You are viewing a plain text version of this content. The canonical link for it is here.
Posted to yarn-dev@hadoop.apache.org by Apache Jenkins Server <je...@builds.apache.org> on 2014/08/07 08:16:28 UTC
Failed: YARN-2249 PreCommit Build #4546
Jira: https://issues.apache.org/jira/browse/YARN-2249
Build: https://builds.apache.org/job/PreCommit-YARN-Build/4546/
###################################################################################
########################## LAST 60 LINES OF THE CONSOLE ###########################
[...truncated 3456 lines...]
{color:green}+1 tests included{color}. The patch appears to include 4 new or modified test files.
{color:green}+1 javac{color}. The applied patch does not increase the total number of javac compiler warnings.
{color:green}+1 javadoc{color}. There were no new javadoc warning messages.
{color:green}+1 eclipse:eclipse{color}. The patch built with eclipse:eclipse.
{color:green}+1 findbugs{color}. The patch does not introduce any new Findbugs (version 2.0.3) warnings.
{color:green}+1 release audit{color}. The applied patch does not increase the total number of release audit warnings.
{color:red}-1 core tests{color}. The patch failed these unit tests in hadoop-yarn-project/hadoop-yarn/hadoop-yarn-common hadoop-yarn-project/hadoop-yarn/hadoop-yarn-server/hadoop-yarn-server-resourcemanager:
org.apache.hadoop.yarn.server.resourcemanager.scheduler.fair.TestMaxRunningAppsEnforcer
org.apache.hadoop.yarn.server.resourcemanager.scheduler.fair.TestFSSchedulerApp
org.apache.hadoop.yarn.server.resourcemanager.scheduler.fifo.TestFifoScheduler
org.apache.hadoop.yarn.server.resourcemanager.scheduler.capacity.TestLeafQueue
org.apache.hadoop.yarn.server.resourcemanager.scheduler.capacity.TestApplicationLimits
org.apache.hadoop.yarn.server.resourcemanager.scheduler.TestSchedulerApplicationAttempt
{color:green}+1 contrib tests{color}. The patch passed contrib unit tests.
Test results: https://builds.apache.org/job/PreCommit-YARN-Build/4546//testReport/
Console output: https://builds.apache.org/job/PreCommit-YARN-Build/4546//console
This message is automatically generated.
======================================================================
======================================================================
Adding comment to Jira.
======================================================================
======================================================================
Comment added.
9858e0c38a18c4fe844122f81df81fdede9fe7d3 logged out
======================================================================
======================================================================
Finished build.
======================================================================
======================================================================
Build step 'Execute shell' marked build as failure
Archiving artifacts
Sending artifact delta relative to PreCommit-YARN-Build #4541
Archived 22 artifacts
Archive block size is 32768
Received 40 blocks and 7253842 bytes
Compression is 15.3%
Took 3.2 sec
[description-setter] Could not determine description.
Recording test results
Email was triggered for: Failure
Sending email for trigger: Failure
###################################################################################
############################## FAILED TESTS (if any) ##############################
30 tests failed.
FAILED: org.apache.hadoop.yarn.server.resourcemanager.scheduler.TestSchedulerApplicationAttempt.testMove
Error Message:
null
Stack Trace:
java.lang.NullPointerException: null
at org.apache.hadoop.yarn.server.resourcemanager.scheduler.SchedulerApplicationAttempt.<init>(SchedulerApplicationAttempt.java:126)
at org.apache.hadoop.yarn.server.resourcemanager.scheduler.TestSchedulerApplicationAttempt.testMove(TestSchedulerApplicationAttempt.java:67)
FAILED: org.apache.hadoop.yarn.server.resourcemanager.scheduler.capacity.TestApplicationLimits.testHeadroom
Error Message:
null
Stack Trace:
java.lang.NullPointerException: null
at org.apache.hadoop.yarn.server.resourcemanager.scheduler.SchedulerApplicationAttempt.<init>(SchedulerApplicationAttempt.java:126)
at org.apache.hadoop.yarn.server.resourcemanager.scheduler.common.fica.FiCaSchedulerApp.<init>(FiCaSchedulerApp.java:71)
at org.apache.hadoop.yarn.server.resourcemanager.scheduler.capacity.TestApplicationLimits.testHeadroom(TestApplicationLimits.java:507)
FAILED: org.apache.hadoop.yarn.server.resourcemanager.scheduler.capacity.TestLeafQueue.testHeadroomWithMaxCap
Error Message:
null
Stack Trace:
java.lang.NullPointerException: null
at org.apache.hadoop.yarn.server.resourcemanager.scheduler.SchedulerApplicationAttempt.<init>(SchedulerApplicationAttempt.java:126)
at org.apache.hadoop.yarn.server.resourcemanager.scheduler.common.fica.FiCaSchedulerApp.<init>(FiCaSchedulerApp.java:71)
at org.apache.hadoop.yarn.server.resourcemanager.scheduler.capacity.TestLeafQueue.testHeadroomWithMaxCap(TestLeafQueue.java:640)
FAILED: org.apache.hadoop.yarn.server.resourcemanager.scheduler.capacity.TestLeafQueue.testLocalityConstraints
Error Message:
null
Stack Trace:
java.lang.NullPointerException: null
at org.apache.hadoop.yarn.server.resourcemanager.scheduler.SchedulerApplicationAttempt.<init>(SchedulerApplicationAttempt.java:126)
at org.apache.hadoop.yarn.server.resourcemanager.scheduler.common.fica.FiCaSchedulerApp.<init>(FiCaSchedulerApp.java:71)
at org.apache.hadoop.yarn.server.resourcemanager.scheduler.capacity.TestLeafQueue.testLocalityConstraints(TestLeafQueue.java:1808)
FAILED: org.apache.hadoop.yarn.server.resourcemanager.scheduler.capacity.TestLeafQueue.testActivateApplicationByUpdatingClusterResource
Error Message:
null
Stack Trace:
java.lang.NullPointerException: null
at org.apache.hadoop.yarn.server.resourcemanager.scheduler.SchedulerApplicationAttempt.<init>(SchedulerApplicationAttempt.java:126)
at org.apache.hadoop.yarn.server.resourcemanager.scheduler.common.fica.FiCaSchedulerApp.<init>(FiCaSchedulerApp.java:71)
at org.apache.hadoop.yarn.server.resourcemanager.scheduler.capacity.TestLeafQueue.testActivateApplicationByUpdatingClusterResource(TestLeafQueue.java:1731)
FAILED: org.apache.hadoop.yarn.server.resourcemanager.scheduler.capacity.TestLeafQueue.testStolenReservedContainer
Error Message:
null
Stack Trace:
java.lang.NullPointerException: null
at org.apache.hadoop.yarn.server.resourcemanager.scheduler.SchedulerApplicationAttempt.<init>(SchedulerApplicationAttempt.java:126)
at org.apache.hadoop.yarn.server.resourcemanager.scheduler.common.fica.FiCaSchedulerApp.<init>(FiCaSchedulerApp.java:71)
at org.apache.hadoop.yarn.server.resourcemanager.scheduler.capacity.TestLeafQueue.testStolenReservedContainer(TestLeafQueue.java:1044)
FAILED: org.apache.hadoop.yarn.server.resourcemanager.scheduler.capacity.TestLeafQueue.testAllocateContainerOnNodeWithoutOffSwitchSpecified
Error Message:
null
Stack Trace:
java.lang.NullPointerException: null
at org.apache.hadoop.yarn.server.resourcemanager.scheduler.SchedulerApplicationAttempt.<init>(SchedulerApplicationAttempt.java:126)
at org.apache.hadoop.yarn.server.resourcemanager.scheduler.common.fica.FiCaSchedulerApp.<init>(FiCaSchedulerApp.java:71)
at org.apache.hadoop.yarn.server.resourcemanager.scheduler.capacity.TestLeafQueue.testAllocateContainerOnNodeWithoutOffSwitchSpecified(TestLeafQueue.java:2063)
FAILED: org.apache.hadoop.yarn.server.resourcemanager.scheduler.capacity.TestLeafQueue.testUserQueueAcl
Error Message:
null
Stack Trace:
java.lang.NullPointerException: null
at org.apache.hadoop.yarn.server.resourcemanager.scheduler.SchedulerApplicationAttempt.<init>(SchedulerApplicationAttempt.java:126)
at org.apache.hadoop.yarn.server.resourcemanager.scheduler.common.fica.FiCaSchedulerApp.<init>(FiCaSchedulerApp.java:71)
at org.apache.hadoop.yarn.server.resourcemanager.scheduler.capacity.TestLeafQueue.testUserQueueAcl(TestLeafQueue.java:331)
FAILED: org.apache.hadoop.yarn.server.resourcemanager.scheduler.capacity.TestLeafQueue.testSingleQueueWithMultipleUsers
Error Message:
null
Stack Trace:
java.lang.NullPointerException: null
at org.apache.hadoop.yarn.server.resourcemanager.scheduler.SchedulerApplicationAttempt.<init>(SchedulerApplicationAttempt.java:126)
at org.apache.hadoop.yarn.server.resourcemanager.scheduler.common.fica.FiCaSchedulerApp.<init>(FiCaSchedulerApp.java:71)
at org.apache.hadoop.yarn.server.resourcemanager.scheduler.capacity.TestLeafQueue.testSingleQueueWithMultipleUsers(TestLeafQueue.java:751)
FAILED: org.apache.hadoop.yarn.server.resourcemanager.scheduler.capacity.TestLeafQueue.testLocalityScheduling
Error Message:
null
Stack Trace:
java.lang.NullPointerException: null
at org.apache.hadoop.yarn.server.resourcemanager.scheduler.SchedulerApplicationAttempt.<init>(SchedulerApplicationAttempt.java:126)
at org.apache.hadoop.yarn.server.resourcemanager.scheduler.common.fica.FiCaSchedulerApp.<init>(FiCaSchedulerApp.java:71)
at org.apache.hadoop.yarn.server.resourcemanager.scheduler.capacity.TestLeafQueue.testLocalityScheduling(TestLeafQueue.java:1278)
FAILED: org.apache.hadoop.yarn.server.resourcemanager.scheduler.capacity.TestLeafQueue.testSchedulingConstraints
Error Message:
null
Stack Trace:
java.lang.NullPointerException: null
at org.apache.hadoop.yarn.server.resourcemanager.scheduler.SchedulerApplicationAttempt.<init>(SchedulerApplicationAttempt.java:126)
at org.apache.hadoop.yarn.server.resourcemanager.scheduler.common.fica.FiCaSchedulerApp.<init>(FiCaSchedulerApp.java:71)
at org.apache.hadoop.yarn.server.resourcemanager.scheduler.capacity.TestLeafQueue.testSchedulingConstraints(TestLeafQueue.java:1550)
FAILED: org.apache.hadoop.yarn.server.resourcemanager.scheduler.capacity.TestLeafQueue.testActivateApplicationAfterQueueRefresh
Error Message:
null
Stack Trace:
java.lang.NullPointerException: null
at org.apache.hadoop.yarn.server.resourcemanager.scheduler.SchedulerApplicationAttempt.<init>(SchedulerApplicationAttempt.java:126)
at org.apache.hadoop.yarn.server.resourcemanager.scheduler.common.fica.FiCaSchedulerApp.<init>(FiCaSchedulerApp.java:71)
at org.apache.hadoop.yarn.server.resourcemanager.scheduler.capacity.TestLeafQueue.testActivateApplicationAfterQueueRefresh(TestLeafQueue.java:1653)
FAILED: org.apache.hadoop.yarn.server.resourcemanager.scheduler.capacity.TestLeafQueue.testReservationExchange
Error Message:
null
Stack Trace:
java.lang.NullPointerException: null
at org.apache.hadoop.yarn.server.resourcemanager.scheduler.SchedulerApplicationAttempt.<init>(SchedulerApplicationAttempt.java:126)
at org.apache.hadoop.yarn.server.resourcemanager.scheduler.common.fica.FiCaSchedulerApp.<init>(FiCaSchedulerApp.java:71)
at org.apache.hadoop.yarn.server.resourcemanager.scheduler.capacity.TestLeafQueue.testReservationExchange(TestLeafQueue.java:1151)
FAILED: org.apache.hadoop.yarn.server.resourcemanager.scheduler.capacity.TestLeafQueue.testUserLimits
Error Message:
null
Stack Trace:
java.lang.NullPointerException: null
at org.apache.hadoop.yarn.server.resourcemanager.scheduler.SchedulerApplicationAttempt.<init>(SchedulerApplicationAttempt.java:126)
at org.apache.hadoop.yarn.server.resourcemanager.scheduler.common.fica.FiCaSchedulerApp.<init>(FiCaSchedulerApp.java:71)
at org.apache.hadoop.yarn.server.resourcemanager.scheduler.capacity.TestLeafQueue.testUserLimits(TestLeafQueue.java:546)
FAILED: org.apache.hadoop.yarn.server.resourcemanager.scheduler.capacity.TestLeafQueue.testAppAttemptMetrics
Error Message:
null
Stack Trace:
java.lang.NullPointerException: null
at org.apache.hadoop.yarn.server.resourcemanager.scheduler.SchedulerApplicationAttempt.<init>(SchedulerApplicationAttempt.java:126)
at org.apache.hadoop.yarn.server.resourcemanager.scheduler.common.fica.FiCaSchedulerApp.<init>(FiCaSchedulerApp.java:71)
at org.apache.hadoop.yarn.server.resourcemanager.scheduler.capacity.CapacityScheduler.addApplicationAttempt(CapacityScheduler.java:573)
at org.apache.hadoop.yarn.server.resourcemanager.scheduler.capacity.CapacityScheduler.handle(CapacityScheduler.java:918)
at org.apache.hadoop.yarn.server.resourcemanager.scheduler.capacity.TestLeafQueue.testAppAttemptMetrics(TestLeafQueue.java:363)
FAILED: org.apache.hadoop.yarn.server.resourcemanager.scheduler.capacity.TestLeafQueue.testApplicationPriorityScheduling
Error Message:
null
Stack Trace:
java.lang.NullPointerException: null
at org.apache.hadoop.yarn.server.resourcemanager.scheduler.SchedulerApplicationAttempt.<init>(SchedulerApplicationAttempt.java:126)
at org.apache.hadoop.yarn.server.resourcemanager.scheduler.common.fica.FiCaSchedulerApp.<init>(FiCaSchedulerApp.java:71)
at org.apache.hadoop.yarn.server.resourcemanager.scheduler.capacity.TestLeafQueue.testApplicationPriorityScheduling(TestLeafQueue.java:1419)
FAILED: org.apache.hadoop.yarn.server.resourcemanager.scheduler.capacity.TestLeafQueue.testSingleQueueOneUserMetrics
Error Message:
null
Stack Trace:
java.lang.NullPointerException: null
at org.apache.hadoop.yarn.server.resourcemanager.scheduler.SchedulerApplicationAttempt.<init>(SchedulerApplicationAttempt.java:126)
at org.apache.hadoop.yarn.server.resourcemanager.scheduler.common.fica.FiCaSchedulerApp.<init>(FiCaSchedulerApp.java:71)
at org.apache.hadoop.yarn.server.resourcemanager.scheduler.capacity.TestLeafQueue.testSingleQueueOneUserMetrics(TestLeafQueue.java:281)
FAILED: org.apache.hadoop.yarn.server.resourcemanager.scheduler.capacity.TestLeafQueue.testSingleQueueWithOneUser
Error Message:
null
Stack Trace:
java.lang.NullPointerException: null
at org.apache.hadoop.yarn.server.resourcemanager.scheduler.SchedulerApplicationAttempt.<init>(SchedulerApplicationAttempt.java:126)
at org.apache.hadoop.yarn.server.resourcemanager.scheduler.common.fica.FiCaSchedulerApp.<init>(FiCaSchedulerApp.java:71)
at org.apache.hadoop.yarn.server.resourcemanager.scheduler.capacity.TestLeafQueue.testSingleQueueWithOneUser(TestLeafQueue.java:412)
FAILED: org.apache.hadoop.yarn.server.resourcemanager.scheduler.capacity.TestLeafQueue.testReservation
Error Message:
null
Stack Trace:
java.lang.NullPointerException: null
at org.apache.hadoop.yarn.server.resourcemanager.scheduler.SchedulerApplicationAttempt.<init>(SchedulerApplicationAttempt.java:126)
at org.apache.hadoop.yarn.server.resourcemanager.scheduler.common.fica.FiCaSchedulerApp.<init>(FiCaSchedulerApp.java:71)
at org.apache.hadoop.yarn.server.resourcemanager.scheduler.capacity.TestLeafQueue.testReservation(TestLeafQueue.java:936)
FAILED: org.apache.hadoop.yarn.server.resourcemanager.scheduler.fair.TestFSSchedulerApp.testDelaySchedulingForContinuousScheduling
Error Message:
null
Stack Trace:
java.lang.NullPointerException: null
at org.apache.hadoop.yarn.server.resourcemanager.scheduler.SchedulerApplicationAttempt.<init>(SchedulerApplicationAttempt.java:126)
at org.apache.hadoop.yarn.server.resourcemanager.scheduler.fair.FSSchedulerApp.<init>(FSSchedulerApp.java:69)
at org.apache.hadoop.yarn.server.resourcemanager.scheduler.fair.TestFSSchedulerApp.testDelaySchedulingForContinuousScheduling(TestFSSchedulerApp.java:128)
FAILED: org.apache.hadoop.yarn.server.resourcemanager.scheduler.fair.TestFSSchedulerApp.testLocalityLevelWithoutDelays
Error Message:
null
Stack Trace:
java.lang.NullPointerException: null
at org.apache.hadoop.yarn.server.resourcemanager.scheduler.SchedulerApplicationAttempt.<init>(SchedulerApplicationAttempt.java:126)
at org.apache.hadoop.yarn.server.resourcemanager.scheduler.fair.FSSchedulerApp.<init>(FSSchedulerApp.java:69)
at org.apache.hadoop.yarn.server.resourcemanager.scheduler.fair.TestFSSchedulerApp.testLocalityLevelWithoutDelays(TestFSSchedulerApp.java:185)
FAILED: org.apache.hadoop.yarn.server.resourcemanager.scheduler.fair.TestFSSchedulerApp.testDelayScheduling
Error Message:
null
Stack Trace:
java.lang.NullPointerException: null
at org.apache.hadoop.yarn.server.resourcemanager.scheduler.SchedulerApplicationAttempt.<init>(SchedulerApplicationAttempt.java:126)
at org.apache.hadoop.yarn.server.resourcemanager.scheduler.fair.FSSchedulerApp.<init>(FSSchedulerApp.java:69)
at org.apache.hadoop.yarn.server.resourcemanager.scheduler.fair.TestFSSchedulerApp.testDelayScheduling(TestFSSchedulerApp.java:65)
FAILED: org.apache.hadoop.yarn.server.resourcemanager.scheduler.fair.TestMaxRunningAppsEnforcer.testRemoveDoesNotEnableAnyApp
Error Message:
null
Stack Trace:
java.lang.NullPointerException: null
at org.apache.hadoop.yarn.server.resourcemanager.scheduler.SchedulerApplicationAttempt.<init>(SchedulerApplicationAttempt.java:126)
at org.apache.hadoop.yarn.server.resourcemanager.scheduler.fair.FSSchedulerApp.<init>(FSSchedulerApp.java:69)
at org.apache.hadoop.yarn.server.resourcemanager.scheduler.fair.TestMaxRunningAppsEnforcer.addApp(TestMaxRunningAppsEnforcer.java:72)
at org.apache.hadoop.yarn.server.resourcemanager.scheduler.fair.TestMaxRunningAppsEnforcer.testRemoveDoesNotEnableAnyApp(TestMaxRunningAppsEnforcer.java:96)
FAILED: org.apache.hadoop.yarn.server.resourcemanager.scheduler.fair.TestMaxRunningAppsEnforcer.testRemoveEnablesAppOnCousinQueue
Error Message:
null
Stack Trace:
java.lang.NullPointerException: null
at org.apache.hadoop.yarn.server.resourcemanager.scheduler.SchedulerApplicationAttempt.<init>(SchedulerApplicationAttempt.java:126)
at org.apache.hadoop.yarn.server.resourcemanager.scheduler.fair.FSSchedulerApp.<init>(FSSchedulerApp.java:69)
at org.apache.hadoop.yarn.server.resourcemanager.scheduler.fair.TestMaxRunningAppsEnforcer.addApp(TestMaxRunningAppsEnforcer.java:72)
at org.apache.hadoop.yarn.server.resourcemanager.scheduler.fair.TestMaxRunningAppsEnforcer.testRemoveEnablesAppOnCousinQueue(TestMaxRunningAppsEnforcer.java:113)
FAILED: org.apache.hadoop.yarn.server.resourcemanager.scheduler.fair.TestMaxRunningAppsEnforcer.testRemoveEnablesOneByQueueOneByUser
Error Message:
null
Stack Trace:
java.lang.NullPointerException: null
at org.apache.hadoop.yarn.server.resourcemanager.scheduler.SchedulerApplicationAttempt.<init>(SchedulerApplicationAttempt.java:126)
at org.apache.hadoop.yarn.server.resourcemanager.scheduler.fair.FSSchedulerApp.<init>(FSSchedulerApp.java:69)
at org.apache.hadoop.yarn.server.resourcemanager.scheduler.fair.TestMaxRunningAppsEnforcer.addApp(TestMaxRunningAppsEnforcer.java:72)
at org.apache.hadoop.yarn.server.resourcemanager.scheduler.fair.TestMaxRunningAppsEnforcer.testRemoveEnablesOneByQueueOneByUser(TestMaxRunningAppsEnforcer.java:131)
FAILED: org.apache.hadoop.yarn.server.resourcemanager.scheduler.fair.TestMaxRunningAppsEnforcer.testRemoveEnablingOrderedByStartTime
Error Message:
null
Stack Trace:
java.lang.NullPointerException: null
at org.apache.hadoop.yarn.server.resourcemanager.scheduler.SchedulerApplicationAttempt.<init>(SchedulerApplicationAttempt.java:126)
at org.apache.hadoop.yarn.server.resourcemanager.scheduler.fair.FSSchedulerApp.<init>(FSSchedulerApp.java:69)
at org.apache.hadoop.yarn.server.resourcemanager.scheduler.fair.TestMaxRunningAppsEnforcer.addApp(TestMaxRunningAppsEnforcer.java:72)
at org.apache.hadoop.yarn.server.resourcemanager.scheduler.fair.TestMaxRunningAppsEnforcer.testRemoveEnablingOrderedByStartTime(TestMaxRunningAppsEnforcer.java:150)
FAILED: org.apache.hadoop.yarn.server.resourcemanager.scheduler.fair.TestMaxRunningAppsEnforcer.testMultipleAppsWaitingOnCousinQueue
Error Message:
null
Stack Trace:
java.lang.NullPointerException: null
at org.apache.hadoop.yarn.server.resourcemanager.scheduler.SchedulerApplicationAttempt.<init>(SchedulerApplicationAttempt.java:126)
at org.apache.hadoop.yarn.server.resourcemanager.scheduler.fair.FSSchedulerApp.<init>(FSSchedulerApp.java:69)
at org.apache.hadoop.yarn.server.resourcemanager.scheduler.fair.TestMaxRunningAppsEnforcer.addApp(TestMaxRunningAppsEnforcer.java:72)
at org.apache.hadoop.yarn.server.resourcemanager.scheduler.fair.TestMaxRunningAppsEnforcer.testMultipleAppsWaitingOnCousinQueue(TestMaxRunningAppsEnforcer.java:170)
FAILED: org.apache.hadoop.yarn.server.resourcemanager.scheduler.fifo.TestFifoScheduler.testNodeLocalAssignment
Error Message:
null
Stack Trace:
java.lang.NullPointerException: null
at org.apache.hadoop.yarn.server.resourcemanager.scheduler.SchedulerApplicationAttempt.<init>(SchedulerApplicationAttempt.java:126)
at org.apache.hadoop.yarn.server.resourcemanager.scheduler.common.fica.FiCaSchedulerApp.<init>(FiCaSchedulerApp.java:71)
at org.apache.hadoop.yarn.server.resourcemanager.scheduler.fifo.FifoScheduler.addApplicationAttempt(FifoScheduler.java:388)
at org.apache.hadoop.yarn.server.resourcemanager.scheduler.fifo.FifoScheduler.handle(FifoScheduler.java:800)
at org.apache.hadoop.yarn.server.resourcemanager.scheduler.fifo.TestFifoScheduler.testNodeLocalAssignment(TestFifoScheduler.java:212)
FAILED: org.apache.hadoop.yarn.server.resourcemanager.scheduler.fifo.TestFifoScheduler.testUpdateResourceOnNode
Error Message:
null
Stack Trace:
java.lang.NullPointerException: null
at org.apache.hadoop.yarn.server.resourcemanager.scheduler.SchedulerApplicationAttempt.<init>(SchedulerApplicationAttempt.java:126)
at org.apache.hadoop.yarn.server.resourcemanager.scheduler.common.fica.FiCaSchedulerApp.<init>(FiCaSchedulerApp.java:71)
at org.apache.hadoop.yarn.server.resourcemanager.scheduler.fifo.FifoScheduler.addApplicationAttempt(FifoScheduler.java:388)
at org.apache.hadoop.yarn.server.resourcemanager.scheduler.fifo.FifoScheduler.handle(FifoScheduler.java:800)
at org.apache.hadoop.yarn.server.resourcemanager.scheduler.fifo.TestFifoScheduler.testUpdateResourceOnNode(TestFifoScheduler.java:307)
FAILED: org.apache.hadoop.yarn.server.resourcemanager.scheduler.fifo.TestFifoScheduler.testAppAttemptMetrics
Error Message:
null
Stack Trace:
java.lang.NullPointerException: null
at org.apache.hadoop.yarn.server.resourcemanager.scheduler.SchedulerApplicationAttempt.<init>(SchedulerApplicationAttempt.java:126)
at org.apache.hadoop.yarn.server.resourcemanager.scheduler.common.fica.FiCaSchedulerApp.<init>(FiCaSchedulerApp.java:71)
at org.apache.hadoop.yarn.server.resourcemanager.scheduler.fifo.FifoScheduler.addApplicationAttempt(FifoScheduler.java:388)
at org.apache.hadoop.yarn.server.resourcemanager.scheduler.fifo.FifoScheduler.handle(FifoScheduler.java:800)
at org.apache.hadoop.yarn.server.resourcemanager.scheduler.fifo.TestFifoScheduler.testAppAttemptMetrics(TestFifoScheduler.java:165)
Success: YARN-2288 PreCommit Build #4548
Posted by Apache Jenkins Server <je...@builds.apache.org>.
Jira: https://issues.apache.org/jira/browse/YARN-2288
Build: https://builds.apache.org/job/PreCommit-YARN-Build/4548/
###################################################################################
########################## LAST 60 LINES OF THE CONSOLE ###########################
[...truncated 2901 lines...]
{color:green}+1 overall{color}. Here are the results of testing the latest attachment
http://issues.apache.org/jira/secure/attachment/12660327/YARN-2288-v5.patch
against trunk revision .
{color:green}+1 @author{color}. The patch does not contain any @author tags.
{color:green}+1 tests included{color}. The patch appears to include 1 new or modified test files.
{color:green}+1 javac{color}. The applied patch does not increase the total number of javac compiler warnings.
{color:green}+1 javadoc{color}. There were no new javadoc warning messages.
{color:green}+1 eclipse:eclipse{color}. The patch built with eclipse:eclipse.
{color:green}+1 findbugs{color}. The patch does not introduce any new Findbugs (version 2.0.3) warnings.
{color:green}+1 release audit{color}. The applied patch does not increase the total number of release audit warnings.
{color:green}+1 core tests{color}. The patch passed unit tests in hadoop-yarn-project/hadoop-yarn/hadoop-yarn-server/hadoop-yarn-server-applicationhistoryservice.
{color:green}+1 contrib tests{color}. The patch passed contrib unit tests.
Test results: https://builds.apache.org/job/PreCommit-YARN-Build/4548//testReport/
Console output: https://builds.apache.org/job/PreCommit-YARN-Build/4548//console
This message is automatically generated.
======================================================================
======================================================================
Adding comment to Jira.
======================================================================
======================================================================
Comment added.
138eae431da558ea6c86f736e4f8db6062c5c90a logged out
======================================================================
======================================================================
Finished build.
======================================================================
======================================================================
Archiving artifacts
Sending artifact delta relative to PreCommit-YARN-Build #4541
Archived 17 artifacts
Archive block size is 32768
Received 45 blocks and 6690487 bytes
Compression is 18.1%
Took 3.4 sec
Description set: YARN-2288
Recording test results
Email was triggered for: Success
Sending email for trigger: Success
###################################################################################
############################## FAILED TESTS (if any) ##############################
All tests passed
Failed: YARN-2288 PreCommit Build #4547
Posted by Apache Jenkins Server <je...@builds.apache.org>.
Jira: https://issues.apache.org/jira/browse/YARN-2288
Build: https://builds.apache.org/job/PreCommit-YARN-Build/4547/
###################################################################################
########################## LAST 60 LINES OF THE CONSOLE ###########################
[...truncated 2892 lines...]
http://issues.apache.org/jira/secure/attachment/12660309/YARN-2288-v4.patch
against trunk revision .
{color:green}+1 @author{color}. The patch does not contain any @author tags.
{color:green}+1 tests included{color}. The patch appears to include 1 new or modified test files.
{color:green}+1 javac{color}. The applied patch does not increase the total number of javac compiler warnings.
{color:green}+1 javadoc{color}. There were no new javadoc warning messages.
{color:green}+1 eclipse:eclipse{color}. The patch built with eclipse:eclipse.
{color:green}+1 findbugs{color}. The patch does not introduce any new Findbugs (version 2.0.3) warnings.
{color:green}+1 release audit{color}. The applied patch does not increase the total number of release audit warnings.
{color:red}-1 core tests{color}. The patch failed these unit tests in hadoop-yarn-project/hadoop-yarn/hadoop-yarn-server/hadoop-yarn-server-applicationhistoryservice:
org.apache.hadoop.yarn.server.timeline.TestLeveldbTimelineStore
{color:green}+1 contrib tests{color}. The patch passed contrib unit tests.
Test results: https://builds.apache.org/job/PreCommit-YARN-Build/4547//testReport/
Console output: https://builds.apache.org/job/PreCommit-YARN-Build/4547//console
This message is automatically generated.
======================================================================
======================================================================
Adding comment to Jira.
======================================================================
======================================================================
Comment added.
f751b60675e2df2c0308f39f7f56188aaca24cdb logged out
======================================================================
======================================================================
Finished build.
======================================================================
======================================================================
Build step 'Execute shell' marked build as failure
Archiving artifacts
Sending artifact delta relative to PreCommit-YARN-Build #4541
Archived 17 artifacts
Archive block size is 32768
Received 221 blocks and 910854 bytes
Compression is 88.8%
Took 0.59 sec
[description-setter] Could not determine description.
Recording test results
Email was triggered for: Failure
Sending email for trigger: Failure
###################################################################################
############################## FAILED TESTS (if any) ##############################
1 tests failed.
FAILED: org.apache.hadoop.yarn.server.timeline.TestLeveldbTimelineStore.testCheckVersion
Error Message:
Exception message mismatch
Stack Trace:
java.lang.AssertionError: Exception message mismatch
at org.junit.Assert.fail(Assert.java:88)
at org.junit.Assert.assertTrue(Assert.java:41)
at org.apache.hadoop.yarn.server.timeline.TestLeveldbTimelineStore.testCheckVersion(TestLeveldbTimelineStore.java:297)