You are viewing a plain text version of this content. The canonical link for it is here.
Posted to dev@lucene.apache.org by Policeman Jenkins Server <je...@thetaphi.de> on 2017/08/11 13:45:21 UTC
[JENKINS] Lucene-Solr-master-Linux (64bit/jdk1.8.0_144) - Build #
20298 - Still Unstable!
Build: https://jenkins.thetaphi.de/job/Lucene-Solr-master-Linux/20298/
Java: 64bit/jdk1.8.0_144 -XX:-UseCompressedOops -XX:+UseConcMarkSweepGC
2 tests failed.
FAILED: org.apache.solr.cloud.ForceLeaderTest.testReplicasInLIRNoLeader
Error Message:
Doc with id=1 not found in http://127.0.0.1:37079/forceleader_test_collection due to: Path not found: /id; rsp={doc=null}
Stack Trace:
java.lang.AssertionError: Doc with id=1 not found in http://127.0.0.1:37079/forceleader_test_collection due to: Path not found: /id; rsp={doc=null}
at __randomizedtesting.SeedInfo.seed([24D1FBB0306F6AC6:C246CF7009ED93A7]:0)
at org.junit.Assert.fail(Assert.java:93)
at org.junit.Assert.assertTrue(Assert.java:43)
at org.apache.solr.cloud.HttpPartitionTest.assertDocExists(HttpPartitionTest.java:603)
at org.apache.solr.cloud.HttpPartitionTest.assertDocsExistInAllReplicas(HttpPartitionTest.java:556)
at org.apache.solr.cloud.ForceLeaderTest.testReplicasInLIRNoLeader(ForceLeaderTest.java:142)
at sun.reflect.NativeMethodAccessorImpl.invoke0(Native Method)
at sun.reflect.NativeMethodAccessorImpl.invoke(NativeMethodAccessorImpl.java:62)
at sun.reflect.DelegatingMethodAccessorImpl.invoke(DelegatingMethodAccessorImpl.java:43)
at java.lang.reflect.Method.invoke(Method.java:498)
at com.carrotsearch.randomizedtesting.RandomizedRunner.invoke(RandomizedRunner.java:1713)
at com.carrotsearch.randomizedtesting.RandomizedRunner$8.evaluate(RandomizedRunner.java:907)
at com.carrotsearch.randomizedtesting.RandomizedRunner$9.evaluate(RandomizedRunner.java:943)
at com.carrotsearch.randomizedtesting.RandomizedRunner$10.evaluate(RandomizedRunner.java:957)
at org.apache.solr.BaseDistributedSearchTestCase$ShardsRepeatRule$ShardsFixedStatement.callStatement(BaseDistributedSearchTestCase.java:993)
at org.apache.solr.BaseDistributedSearchTestCase$ShardsRepeatRule$ShardsStatement.evaluate(BaseDistributedSearchTestCase.java:968)
at com.carrotsearch.randomizedtesting.rules.SystemPropertiesRestoreRule$1.evaluate(SystemPropertiesRestoreRule.java:57)
at org.apache.lucene.util.TestRuleSetupTeardownChained$1.evaluate(TestRuleSetupTeardownChained.java:49)
at org.apache.lucene.util.AbstractBeforeAfterRule$1.evaluate(AbstractBeforeAfterRule.java:45)
at org.apache.lucene.util.TestRuleThreadAndTestName$1.evaluate(TestRuleThreadAndTestName.java:48)
at org.apache.lucene.util.TestRuleIgnoreAfterMaxFailures$1.evaluate(TestRuleIgnoreAfterMaxFailures.java:64)
at org.apache.lucene.util.TestRuleMarkFailure$1.evaluate(TestRuleMarkFailure.java:47)
at com.carrotsearch.randomizedtesting.rules.StatementAdapter.evaluate(StatementAdapter.java:36)
at com.carrotsearch.randomizedtesting.ThreadLeakControl$StatementRunner.run(ThreadLeakControl.java:368)
at com.carrotsearch.randomizedtesting.ThreadLeakControl.forkTimeoutingTask(ThreadLeakControl.java:817)
at com.carrotsearch.randomizedtesting.ThreadLeakControl$3.evaluate(ThreadLeakControl.java:468)
at com.carrotsearch.randomizedtesting.RandomizedRunner.runSingleTest(RandomizedRunner.java:916)
at com.carrotsearch.randomizedtesting.RandomizedRunner$5.evaluate(RandomizedRunner.java:802)
at com.carrotsearch.randomizedtesting.RandomizedRunner$6.evaluate(RandomizedRunner.java:852)
at com.carrotsearch.randomizedtesting.RandomizedRunner$7.evaluate(RandomizedRunner.java:863)
at com.carrotsearch.randomizedtesting.rules.StatementAdapter.evaluate(StatementAdapter.java:36)
at com.carrotsearch.randomizedtesting.rules.SystemPropertiesRestoreRule$1.evaluate(SystemPropertiesRestoreRule.java:57)
at org.apache.lucene.util.AbstractBeforeAfterRule$1.evaluate(AbstractBeforeAfterRule.java:45)
at com.carrotsearch.randomizedtesting.rules.StatementAdapter.evaluate(StatementAdapter.java:36)
at org.apache.lucene.util.TestRuleStoreClassName$1.evaluate(TestRuleStoreClassName.java:41)
at com.carrotsearch.randomizedtesting.rules.NoShadowingOrOverridesOnMethodsRule$1.evaluate(NoShadowingOrOverridesOnMethodsRule.java:40)
at com.carrotsearch.randomizedtesting.rules.NoShadowingOrOverridesOnMethodsRule$1.evaluate(NoShadowingOrOverridesOnMethodsRule.java:40)
at com.carrotsearch.randomizedtesting.rules.StatementAdapter.evaluate(StatementAdapter.java:36)
at com.carrotsearch.randomizedtesting.rules.StatementAdapter.evaluate(StatementAdapter.java:36)
at com.carrotsearch.randomizedtesting.rules.StatementAdapter.evaluate(StatementAdapter.java:36)
at org.apache.lucene.util.TestRuleAssertionsRequired$1.evaluate(TestRuleAssertionsRequired.java:53)
at org.apache.lucene.util.TestRuleMarkFailure$1.evaluate(TestRuleMarkFailure.java:47)
at org.apache.lucene.util.TestRuleIgnoreAfterMaxFailures$1.evaluate(TestRuleIgnoreAfterMaxFailures.java:64)
at org.apache.lucene.util.TestRuleIgnoreTestSuites$1.evaluate(TestRuleIgnoreTestSuites.java:54)
at com.carrotsearch.randomizedtesting.rules.StatementAdapter.evaluate(StatementAdapter.java:36)
at com.carrotsearch.randomizedtesting.ThreadLeakControl$StatementRunner.run(ThreadLeakControl.java:368)
at java.lang.Thread.run(Thread.java:748)
FAILED: org.apache.solr.cloud.TestCollectionsAPIViaSolrCloudCluster.testCollectionCreateSearchDelete
Error Message:
Error from server at http://127.0.0.1:35085/solr/testcollection_shard1_replica_n2: Expected mime type application/octet-stream but got text/html. <html> <head> <meta http-equiv="Content-Type" content="text/html;charset=ISO-8859-1"/> <title>Error 404 </title> </head> <body> <h2>HTTP ERROR: 404</h2> <p>Problem accessing /solr/testcollection_shard1_replica_n2/update. Reason: <pre> Can not find: /solr/testcollection_shard1_replica_n2/update</pre></p> <hr /><a href="http://eclipse.org/jetty">Powered by Jetty:// 9.3.14.v20161028</a><hr/> </body> </html>
Stack Trace:
org.apache.solr.client.solrj.impl.CloudSolrClient$RouteException: Error from server at http://127.0.0.1:35085/solr/testcollection_shard1_replica_n2: Expected mime type application/octet-stream but got text/html. <html>
<head>
<meta http-equiv="Content-Type" content="text/html;charset=ISO-8859-1"/>
<title>Error 404 </title>
</head>
<body>
<h2>HTTP ERROR: 404</h2>
<p>Problem accessing /solr/testcollection_shard1_replica_n2/update. Reason:
<pre> Can not find: /solr/testcollection_shard1_replica_n2/update</pre></p>
<hr /><a href="http://eclipse.org/jetty">Powered by Jetty:// 9.3.14.v20161028</a><hr/>
</body>
</html>
at __randomizedtesting.SeedInfo.seed([24D1FBB0306F6AC6:872B5515B7878063]:0)
at org.apache.solr.client.solrj.impl.CloudSolrClient.directUpdate(CloudSolrClient.java:539)
at org.apache.solr.client.solrj.impl.CloudSolrClient.sendRequest(CloudSolrClient.java:993)
at org.apache.solr.client.solrj.impl.CloudSolrClient.requestWithRetryOnStaleState(CloudSolrClient.java:862)
at org.apache.solr.client.solrj.impl.CloudSolrClient.request(CloudSolrClient.java:793)
at org.apache.solr.client.solrj.SolrRequest.process(SolrRequest.java:178)
at org.apache.solr.client.solrj.request.UpdateRequest.commit(UpdateRequest.java:233)
at org.apache.solr.cloud.TestCollectionsAPIViaSolrCloudCluster.testCollectionCreateSearchDelete(TestCollectionsAPIViaSolrCloudCluster.java:167)
at sun.reflect.NativeMethodAccessorImpl.invoke0(Native Method)
at sun.reflect.NativeMethodAccessorImpl.invoke(NativeMethodAccessorImpl.java:62)
at sun.reflect.DelegatingMethodAccessorImpl.invoke(DelegatingMethodAccessorImpl.java:43)
at java.lang.reflect.Method.invoke(Method.java:498)
at com.carrotsearch.randomizedtesting.RandomizedRunner.invoke(RandomizedRunner.java:1713)
at com.carrotsearch.randomizedtesting.RandomizedRunner$8.evaluate(RandomizedRunner.java:907)
at com.carrotsearch.randomizedtesting.RandomizedRunner$9.evaluate(RandomizedRunner.java:943)
at com.carrotsearch.randomizedtesting.RandomizedRunner$10.evaluate(RandomizedRunner.java:957)
at com.carrotsearch.randomizedtesting.rules.SystemPropertiesRestoreRule$1.evaluate(SystemPropertiesRestoreRule.java:57)
at org.apache.lucene.util.TestRuleSetupTeardownChained$1.evaluate(TestRuleSetupTeardownChained.java:49)
at org.apache.lucene.util.AbstractBeforeAfterRule$1.evaluate(AbstractBeforeAfterRule.java:45)
at org.apache.lucene.util.TestRuleThreadAndTestName$1.evaluate(TestRuleThreadAndTestName.java:48)
at org.apache.lucene.util.TestRuleIgnoreAfterMaxFailures$1.evaluate(TestRuleIgnoreAfterMaxFailures.java:64)
at org.apache.lucene.util.TestRuleMarkFailure$1.evaluate(TestRuleMarkFailure.java:47)
at com.carrotsearch.randomizedtesting.rules.StatementAdapter.evaluate(StatementAdapter.java:36)
at com.carrotsearch.randomizedtesting.ThreadLeakControl$StatementRunner.run(ThreadLeakControl.java:368)
at com.carrotsearch.randomizedtesting.ThreadLeakControl.forkTimeoutingTask(ThreadLeakControl.java:817)
at com.carrotsearch.randomizedtesting.ThreadLeakControl$3.evaluate(ThreadLeakControl.java:468)
at com.carrotsearch.randomizedtesting.RandomizedRunner.runSingleTest(RandomizedRunner.java:916)
at com.carrotsearch.randomizedtesting.RandomizedRunner$5.evaluate(RandomizedRunner.java:802)
at com.carrotsearch.randomizedtesting.RandomizedRunner$6.evaluate(RandomizedRunner.java:852)
at com.carrotsearch.randomizedtesting.RandomizedRunner$7.evaluate(RandomizedRunner.java:863)
at com.carrotsearch.randomizedtesting.rules.StatementAdapter.evaluate(StatementAdapter.java:36)
at com.carrotsearch.randomizedtesting.rules.SystemPropertiesRestoreRule$1.evaluate(SystemPropertiesRestoreRule.java:57)
at org.apache.lucene.util.AbstractBeforeAfterRule$1.evaluate(AbstractBeforeAfterRule.java:45)
at com.carrotsearch.randomizedtesting.rules.StatementAdapter.evaluate(StatementAdapter.java:36)
at org.apache.lucene.util.TestRuleStoreClassName$1.evaluate(TestRuleStoreClassName.java:41)
at com.carrotsearch.randomizedtesting.rules.NoShadowingOrOverridesOnMethodsRule$1.evaluate(NoShadowingOrOverridesOnMethodsRule.java:40)
at com.carrotsearch.randomizedtesting.rules.NoShadowingOrOverridesOnMethodsRule$1.evaluate(NoShadowingOrOverridesOnMethodsRule.java:40)
at com.carrotsearch.randomizedtesting.rules.StatementAdapter.evaluate(StatementAdapter.java:36)
at com.carrotsearch.randomizedtesting.rules.StatementAdapter.evaluate(StatementAdapter.java:36)
at com.carrotsearch.randomizedtesting.rules.StatementAdapter.evaluate(StatementAdapter.java:36)
at org.apache.lucene.util.TestRuleAssertionsRequired$1.evaluate(TestRuleAssertionsRequired.java:53)
at org.apache.lucene.util.TestRuleMarkFailure$1.evaluate(TestRuleMarkFailure.java:47)
at org.apache.lucene.util.TestRuleIgnoreAfterMaxFailures$1.evaluate(TestRuleIgnoreAfterMaxFailures.java:64)
at org.apache.lucene.util.TestRuleIgnoreTestSuites$1.evaluate(TestRuleIgnoreTestSuites.java:54)
at com.carrotsearch.randomizedtesting.rules.StatementAdapter.evaluate(StatementAdapter.java:36)
at com.carrotsearch.randomizedtesting.ThreadLeakControl$StatementRunner.run(ThreadLeakControl.java:368)
at java.lang.Thread.run(Thread.java:748)
Caused by: org.apache.solr.client.solrj.impl.HttpSolrClient$RemoteSolrException: Error from server at http://127.0.0.1:35085/solr/testcollection_shard1_replica_n2: Expected mime type application/octet-stream but got text/html. <html>
<head>
<meta http-equiv="Content-Type" content="text/html;charset=ISO-8859-1"/>
<title>Error 404 </title>
</head>
<body>
<h2>HTTP ERROR: 404</h2>
<p>Problem accessing /solr/testcollection_shard1_replica_n2/update. Reason:
<pre> Can not find: /solr/testcollection_shard1_replica_n2/update</pre></p>
<hr /><a href="http://eclipse.org/jetty">Powered by Jetty:// 9.3.14.v20161028</a><hr/>
</body>
</html>
at org.apache.solr.client.solrj.impl.HttpSolrClient.executeMethod(HttpSolrClient.java:591)
at org.apache.solr.client.solrj.impl.HttpSolrClient.request(HttpSolrClient.java:253)
at org.apache.solr.client.solrj.impl.HttpSolrClient.request(HttpSolrClient.java:242)
at org.apache.solr.client.solrj.impl.LBHttpSolrClient.doRequest(LBHttpSolrClient.java:483)
at org.apache.solr.client.solrj.impl.LBHttpSolrClient.request(LBHttpSolrClient.java:413)
at org.apache.solr.client.solrj.impl.CloudSolrClient.lambda$directUpdate$0(CloudSolrClient.java:516)
at java.util.concurrent.FutureTask.run(FutureTask.java:266)
at org.apache.solr.common.util.ExecutorUtil$MDCAwareThreadPoolExecutor.lambda$execute$0(ExecutorUtil.java:188)
at java.util.concurrent.ThreadPoolExecutor.runWorker(ThreadPoolExecutor.java:1149)
at java.util.concurrent.ThreadPoolExecutor$Worker.run(ThreadPoolExecutor.java:624)
... 1 more
Build Log:
[...truncated 11081 lines...]
[junit4] Suite: org.apache.solr.cloud.TestCollectionsAPIViaSolrCloudCluster
[junit4] 2> 300611 INFO (SUITE-TestCollectionsAPIViaSolrCloudCluster-seed#[24D1FBB0306F6AC6]-worker) [ ] o.a.s.SolrTestCaseJ4 SecureRandom sanity checks: test.solr.allowed.securerandom=null & java.security.egd=file:/dev/./urandom
[junit4] 2> Creating dataDir: /home/jenkins/workspace/Lucene-Solr-master-Linux/solr/build/solr-core/test/J0/temp/solr.cloud.TestCollectionsAPIViaSolrCloudCluster_24D1FBB0306F6AC6-001/init-core-data-001
[junit4] 2> 300612 INFO (SUITE-TestCollectionsAPIViaSolrCloudCluster-seed#[24D1FBB0306F6AC6]-worker) [ ] o.a.s.SolrTestCaseJ4 Using PointFields (NUMERIC_POINTS_SYSPROP=true) w/NUMERIC_DOCVALUES_SYSPROP=true
[junit4] 2> 300612 INFO (SUITE-TestCollectionsAPIViaSolrCloudCluster-seed#[24D1FBB0306F6AC6]-worker) [ ] o.a.s.SolrTestCaseJ4 Randomized ssl (false) and clientAuth (true) via: @org.apache.solr.util.RandomizeSSL(reason=, value=NaN, ssl=NaN, clientAuth=NaN)
[junit4] 2> 300614 INFO (TEST-TestCollectionsAPIViaSolrCloudCluster.testCollectionCreateSearchDelete-seed#[24D1FBB0306F6AC6]) [ ] o.a.s.c.MiniSolrCloudCluster Starting cluster of 5 servers in /home/jenkins/workspace/Lucene-Solr-master-Linux/solr/build/solr-core/test/J0/temp/solr.cloud.TestCollectionsAPIViaSolrCloudCluster_24D1FBB0306F6AC6-001/tempDir-001
[junit4] 2> 300614 INFO (TEST-TestCollectionsAPIViaSolrCloudCluster.testCollectionCreateSearchDelete-seed#[24D1FBB0306F6AC6]) [ ] o.a.s.c.ZkTestServer STARTING ZK TEST SERVER
[junit4] 2> 300614 INFO (Thread-606) [ ] o.a.s.c.ZkTestServer client port:0.0.0.0/0.0.0.0:0
[junit4] 2> 300614 INFO (Thread-606) [ ] o.a.s.c.ZkTestServer Starting server
[junit4] 2> 300624 ERROR (Thread-606) [ ] o.a.z.s.ZooKeeperServer ZKShutdownHandler is not registered, so ZooKeeper server won't take any action on ERROR or SHUTDOWN server state changes
[junit4] 2> 300714 INFO (TEST-TestCollectionsAPIViaSolrCloudCluster.testCollectionCreateSearchDelete-seed#[24D1FBB0306F6AC6]) [ ] o.a.s.c.ZkTestServer start zk server on port:32799
[junit4] 2> 300726 INFO (jetty-launcher-437-thread-1) [ ] o.e.j.s.Server jetty-9.3.14.v20161028
[junit4] 2> 300727 INFO (jetty-launcher-437-thread-2) [ ] o.e.j.s.Server jetty-9.3.14.v20161028
[junit4] 2> 300727 INFO (jetty-launcher-437-thread-4) [ ] o.e.j.s.Server jetty-9.3.14.v20161028
[junit4] 2> 300728 INFO (jetty-launcher-437-thread-2) [ ] o.e.j.s.h.ContextHandler Started o.e.j.s.ServletContextHandler@1e80c11f{/solr,null,AVAILABLE}
[junit4] 2> 300729 INFO (jetty-launcher-437-thread-2) [ ] o.e.j.s.AbstractConnector Started ServerConnector@62c7534e{HTTP/1.1,[http/1.1]}{127.0.0.1:34069}
[junit4] 2> 300729 INFO (jetty-launcher-437-thread-2) [ ] o.e.j.s.Server Started @302079ms
[junit4] 2> 300729 INFO (jetty-launcher-437-thread-2) [ ] o.a.s.c.s.e.JettySolrRunner Jetty properties: {hostContext=/solr, hostPort=34069}
[junit4] 2> 300730 INFO (jetty-launcher-437-thread-3) [ ] o.e.j.s.Server jetty-9.3.14.v20161028
[junit4] 2> 300730 ERROR (jetty-launcher-437-thread-2) [ ] o.a.s.s.StartupLoggingUtils Missing Java Option solr.log.dir. Logging may be missing or incomplete.
[junit4] 2> 300730 INFO (jetty-launcher-437-thread-2) [ ] o.a.s.s.SolrDispatchFilter ___ _ Welcome to Apache Solr? version 8.0.0
[junit4] 2> 300730 INFO (jetty-launcher-437-thread-2) [ ] o.a.s.s.SolrDispatchFilter / __| ___| |_ _ Starting in cloud mode on port null
[junit4] 2> 300730 INFO (jetty-launcher-437-thread-2) [ ] o.a.s.s.SolrDispatchFilter \__ \/ _ \ | '_| Install dir: null, Default config dir: null
[junit4] 2> 300730 INFO (jetty-launcher-437-thread-2) [ ] o.a.s.s.SolrDispatchFilter |___/\___/_|_| Start time: 2017-08-11T12:56:12.718Z
[junit4] 2> 300731 INFO (jetty-launcher-437-thread-5) [ ] o.e.j.s.Server jetty-9.3.14.v20161028
[junit4] 2> 300733 INFO (jetty-launcher-437-thread-1) [ ] o.e.j.s.h.ContextHandler Started o.e.j.s.ServletContextHandler@e01678f{/solr,null,AVAILABLE}
[junit4] 2> 300741 INFO (jetty-launcher-437-thread-1) [ ] o.e.j.s.AbstractConnector Started ServerConnector@253921f9{HTTP/1.1,[http/1.1]}{127.0.0.1:35085}
[junit4] 2> 300741 INFO (jetty-launcher-437-thread-1) [ ] o.e.j.s.Server Started @302090ms
[junit4] 2> 300741 INFO (jetty-launcher-437-thread-1) [ ] o.a.s.c.s.e.JettySolrRunner Jetty properties: {hostContext=/solr, hostPort=35085}
[junit4] 2> 300741 ERROR (jetty-launcher-437-thread-1) [ ] o.a.s.s.StartupLoggingUtils Missing Java Option solr.log.dir. Logging may be missing or incomplete.
[junit4] 2> 300741 INFO (jetty-launcher-437-thread-1) [ ] o.a.s.s.SolrDispatchFilter ___ _ Welcome to Apache Solr? version 8.0.0
[junit4] 2> 300741 INFO (jetty-launcher-437-thread-1) [ ] o.a.s.s.SolrDispatchFilter / __| ___| |_ _ Starting in cloud mode on port null
[junit4] 2> 300741 INFO (jetty-launcher-437-thread-1) [ ] o.a.s.s.SolrDispatchFilter \__ \/ _ \ | '_| Install dir: null, Default config dir: null
[junit4] 2> 300741 INFO (jetty-launcher-437-thread-1) [ ] o.a.s.s.SolrDispatchFilter |___/\___/_|_| Start time: 2017-08-11T12:56:12.729Z
[junit4] 2> 300746 INFO (jetty-launcher-437-thread-4) [ ] o.e.j.s.h.ContextHandler Started o.e.j.s.ServletContextHandler@a25186f{/solr,null,AVAILABLE}
[junit4] 2> 300747 INFO (jetty-launcher-437-thread-4) [ ] o.e.j.s.AbstractConnector Started ServerConnector@121f4826{HTTP/1.1,[http/1.1]}{127.0.0.1:44885}
[junit4] 2> 300747 INFO (jetty-launcher-437-thread-4) [ ] o.e.j.s.Server Started @302096ms
[junit4] 2> 300747 INFO (jetty-launcher-437-thread-4) [ ] o.a.s.c.s.e.JettySolrRunner Jetty properties: {hostContext=/solr, hostPort=44885}
[junit4] 2> 300747 ERROR (jetty-launcher-437-thread-4) [ ] o.a.s.s.StartupLoggingUtils Missing Java Option solr.log.dir. Logging may be missing or incomplete.
[junit4] 2> 300747 INFO (jetty-launcher-437-thread-4) [ ] o.a.s.s.SolrDispatchFilter ___ _ Welcome to Apache Solr? version 8.0.0
[junit4] 2> 300747 INFO (jetty-launcher-437-thread-4) [ ] o.a.s.s.SolrDispatchFilter / __| ___| |_ _ Starting in cloud mode on port null
[junit4] 2> 300747 INFO (jetty-launcher-437-thread-4) [ ] o.a.s.s.SolrDispatchFilter \__ \/ _ \ | '_| Install dir: null, Default config dir: null
[junit4] 2> 300747 INFO (jetty-launcher-437-thread-4) [ ] o.a.s.s.SolrDispatchFilter |___/\___/_|_| Start time: 2017-08-11T12:56:12.735Z
[junit4] 2> 300749 INFO (jetty-launcher-437-thread-2) [ ] o.a.s.s.SolrDispatchFilter solr.xml found in ZooKeeper. Loading...
[junit4] 2> 300753 INFO (jetty-launcher-437-thread-3) [ ] o.e.j.s.h.ContextHandler Started o.e.j.s.ServletContextHandler@63883fab{/solr,null,AVAILABLE}
[junit4] 2> 300753 INFO (jetty-launcher-437-thread-3) [ ] o.e.j.s.AbstractConnector Started ServerConnector@6128006b{HTTP/1.1,[http/1.1]}{127.0.0.1:39201}
[junit4] 2> 300753 INFO (jetty-launcher-437-thread-3) [ ] o.e.j.s.Server Started @302102ms
[junit4] 2> 300753 INFO (jetty-launcher-437-thread-3) [ ] o.a.s.c.s.e.JettySolrRunner Jetty properties: {hostContext=/solr, hostPort=39201}
[junit4] 2> 300753 ERROR (jetty-launcher-437-thread-3) [ ] o.a.s.s.StartupLoggingUtils Missing Java Option solr.log.dir. Logging may be missing or incomplete.
[junit4] 2> 300754 INFO (jetty-launcher-437-thread-3) [ ] o.a.s.s.SolrDispatchFilter ___ _ Welcome to Apache Solr? version 8.0.0
[junit4] 2> 300754 INFO (jetty-launcher-437-thread-3) [ ] o.a.s.s.SolrDispatchFilter / __| ___| |_ _ Starting in cloud mode on port null
[junit4] 2> 300754 INFO (jetty-launcher-437-thread-3) [ ] o.a.s.s.SolrDispatchFilter \__ \/ _ \ | '_| Install dir: null, Default config dir: null
[junit4] 2> 300754 INFO (jetty-launcher-437-thread-3) [ ] o.a.s.s.SolrDispatchFilter |___/\___/_|_| Start time: 2017-08-11T12:56:12.742Z
[junit4] 2> 300764 INFO (jetty-launcher-437-thread-5) [ ] o.e.j.s.h.ContextHandler Started o.e.j.s.ServletContextHandler@7dc365a4{/solr,null,AVAILABLE}
[junit4] 2> 300764 INFO (jetty-launcher-437-thread-5) [ ] o.e.j.s.AbstractConnector Started ServerConnector@447a9b90{HTTP/1.1,[http/1.1]}{127.0.0.1:42317}
[junit4] 2> 300764 INFO (jetty-launcher-437-thread-5) [ ] o.e.j.s.Server Started @302113ms
[junit4] 2> 300764 INFO (jetty-launcher-437-thread-5) [ ] o.a.s.c.s.e.JettySolrRunner Jetty properties: {hostContext=/solr, hostPort=42317}
[junit4] 2> 300764 ERROR (jetty-launcher-437-thread-5) [ ] o.a.s.s.StartupLoggingUtils Missing Java Option solr.log.dir. Logging may be missing or incomplete.
[junit4] 2> 300764 INFO (jetty-launcher-437-thread-5) [ ] o.a.s.s.SolrDispatchFilter ___ _ Welcome to Apache Solr? version 8.0.0
[junit4] 2> 300764 INFO (jetty-launcher-437-thread-5) [ ] o.a.s.s.SolrDispatchFilter / __| ___| |_ _ Starting in cloud mode on port null
[junit4] 2> 300764 INFO (jetty-launcher-437-thread-5) [ ] o.a.s.s.SolrDispatchFilter \__ \/ _ \ | '_| Install dir: null, Default config dir: null
[junit4] 2> 300765 INFO (jetty-launcher-437-thread-5) [ ] o.a.s.s.SolrDispatchFilter |___/\___/_|_| Start time: 2017-08-11T12:56:12.752Z
[junit4] 2> 300767 INFO (jetty-launcher-437-thread-4) [ ] o.a.s.s.SolrDispatchFilter solr.xml found in ZooKeeper. Loading...
[junit4] 2> 300768 INFO (jetty-launcher-437-thread-3) [ ] o.a.s.s.SolrDispatchFilter solr.xml found in ZooKeeper. Loading...
[junit4] 2> 300768 INFO (jetty-launcher-437-thread-1) [ ] o.a.s.s.SolrDispatchFilter solr.xml found in ZooKeeper. Loading...
[junit4] 2> 300768 INFO (jetty-launcher-437-thread-2) [ ] o.a.s.c.ZkContainer Zookeeper client=127.0.0.1:32799/solr
[junit4] 2> 300775 INFO (jetty-launcher-437-thread-5) [ ] o.a.s.s.SolrDispatchFilter solr.xml found in ZooKeeper. Loading...
[junit4] 2> 300785 INFO (jetty-launcher-437-thread-4) [ ] o.a.s.c.ZkContainer Zookeeper client=127.0.0.1:32799/solr
[junit4] 2> 300814 INFO (jetty-launcher-437-thread-1) [ ] o.a.s.c.ZkContainer Zookeeper client=127.0.0.1:32799/solr
[junit4] 2> 300820 INFO (jetty-launcher-437-thread-5) [ ] o.a.s.c.ZkContainer Zookeeper client=127.0.0.1:32799/solr
[junit4] 2> 300821 INFO (jetty-launcher-437-thread-3) [ ] o.a.s.c.ZkContainer Zookeeper client=127.0.0.1:32799/solr
[junit4] 2> 300828 WARN (NIOServerCxn.Factory:0.0.0.0/0.0.0.0:0) [ ] o.a.z.s.NIOServerCnxn caught end of stream exception
[junit4] 2> EndOfStreamException: Unable to read additional data from client sessionid 0x15dd15dd03b0007, likely client has closed socket
[junit4] 2> at org.apache.zookeeper.server.NIOServerCnxn.doIO(NIOServerCnxn.java:239)
[junit4] 2> at org.apache.zookeeper.server.NIOServerCnxnFactory.run(NIOServerCnxnFactory.java:203)
[junit4] 2> at java.lang.Thread.run(Thread.java:748)
[junit4] 2> 300908 INFO (jetty-launcher-437-thread-5) [n:127.0.0.1:42317_solr ] o.a.s.c.Overseer Overseer (id=null) closing
[junit4] 2> 300908 INFO (jetty-launcher-437-thread-5) [n:127.0.0.1:42317_solr ] o.a.s.c.OverseerElectionContext I am going to be the leader 127.0.0.1:42317_solr
[junit4] 2> 300909 INFO (jetty-launcher-437-thread-5) [n:127.0.0.1:42317_solr ] o.a.s.c.Overseer Overseer (id=98464967727710223-127.0.0.1:42317_solr-n_0000000000) starting
[junit4] 2> 300919 INFO (jetty-launcher-437-thread-3) [n:127.0.0.1:39201_solr ] o.a.s.c.Overseer Overseer (id=null) closing
[junit4] 2> 300919 INFO (jetty-launcher-437-thread-5) [n:127.0.0.1:42317_solr ] o.a.s.c.ZkController Register node as live in ZooKeeper:/live_nodes/127.0.0.1:42317_solr
[junit4] 2> 300921 INFO (jetty-launcher-437-thread-3) [n:127.0.0.1:39201_solr ] o.a.s.c.ZkController Register node as live in ZooKeeper:/live_nodes/127.0.0.1:39201_solr
[junit4] 2> 300924 INFO (zkCallback-464-thread-1-processing-n:127.0.0.1:42317_solr) [n:127.0.0.1:42317_solr ] o.a.s.c.c.ZkStateReader Updated live nodes from ZooKeeper... (0) -> (1)
[junit4] 2> 300932 INFO (jetty-launcher-437-thread-1) [n:127.0.0.1:35085_solr ] o.a.s.c.c.ZkStateReader Updated live nodes from ZooKeeper... (0) -> (2)
[junit4] 2> 300934 INFO (jetty-launcher-437-thread-1) [n:127.0.0.1:35085_solr ] o.a.s.c.Overseer Overseer (id=null) closing
[junit4] 2> 300936 INFO (jetty-launcher-437-thread-1) [n:127.0.0.1:35085_solr ] o.a.s.c.ZkController Register node as live in ZooKeeper:/live_nodes/127.0.0.1:35085_solr
[junit4] 2> 300948 INFO (zkCallback-464-thread-1-processing-n:127.0.0.1:42317_solr) [n:127.0.0.1:42317_solr ] o.a.s.c.c.ZkStateReader Updated live nodes from ZooKeeper... (1) -> (3)
[junit4] 2> 300964 INFO (zkCallback-463-thread-2-processing-n:127.0.0.1:39201_solr) [n:127.0.0.1:39201_solr ] o.a.s.c.c.ZkStateReader Updated live nodes from ZooKeeper... (0) -> (3)
[junit4] 2> 300967 INFO (zkCallback-462-thread-1-processing-n:127.0.0.1:35085_solr) [n:127.0.0.1:35085_solr ] o.a.s.c.c.ZkStateReader Updated live nodes from ZooKeeper... (2) -> (3)
[junit4] 2> 300976 INFO (jetty-launcher-437-thread-4) [n:127.0.0.1:44885_solr ] o.a.s.c.c.ZkStateReader Updated live nodes from ZooKeeper... (0) -> (3)
[junit4] 2> 300980 INFO (jetty-launcher-437-thread-4) [n:127.0.0.1:44885_solr ] o.a.s.c.Overseer Overseer (id=null) closing
[junit4] 2> 300986 INFO (jetty-launcher-437-thread-4) [n:127.0.0.1:44885_solr ] o.a.s.c.ZkController Register node as live in ZooKeeper:/live_nodes/127.0.0.1:44885_solr
[junit4] 2> 300986 INFO (zkCallback-462-thread-1-processing-n:127.0.0.1:35085_solr) [n:127.0.0.1:35085_solr ] o.a.s.c.c.ZkStateReader Updated live nodes from ZooKeeper... (3) -> (4)
[junit4] 2> 300986 INFO (zkCallback-463-thread-1-processing-n:127.0.0.1:39201_solr) [n:127.0.0.1:39201_solr ] o.a.s.c.c.ZkStateReader Updated live nodes from ZooKeeper... (3) -> (4)
[junit4] 2> 300986 INFO (zkCallback-464-thread-2-processing-n:127.0.0.1:42317_solr) [n:127.0.0.1:42317_solr ] o.a.s.c.c.ZkStateReader Updated live nodes from ZooKeeper... (3) -> (4)
[junit4] 2> 300987 INFO (zkCallback-461-thread-1-processing-n:127.0.0.1:44885_solr) [n:127.0.0.1:44885_solr ] o.a.s.c.c.ZkStateReader Updated live nodes from ZooKeeper... (3) -> (4)
[junit4] 2> 300991 INFO (jetty-launcher-437-thread-5) [n:127.0.0.1:42317_solr ] o.a.s.m.r.SolrJmxReporter JMX monitoring for 'solr_42317.solr.node' (registry 'solr.node') enabled at server: com.sun.jmx.mbeanserver.JmxMBeanServer@47c215a2
[junit4] 2> 300995 INFO (jetty-launcher-437-thread-5) [n:127.0.0.1:42317_solr ] o.a.s.m.r.SolrJmxReporter JMX monitoring for 'solr_42317.solr.jvm' (registry 'solr.jvm') enabled at server: com.sun.jmx.mbeanserver.JmxMBeanServer@47c215a2
[junit4] 2> 300995 INFO (jetty-launcher-437-thread-5) [n:127.0.0.1:42317_solr ] o.a.s.m.r.SolrJmxReporter JMX monitoring for 'solr_42317.solr.jetty' (registry 'solr.jetty') enabled at server: com.sun.jmx.mbeanserver.JmxMBeanServer@47c215a2
[junit4] 2> 300996 INFO (jetty-launcher-437-thread-5) [n:127.0.0.1:42317_solr ] o.a.s.c.CorePropertiesLocator Found 0 core definitions underneath /home/jenkins/workspace/Lucene-Solr-master-Linux/solr/build/solr-core/test/J0/temp/solr.cloud.TestCollectionsAPIViaSolrCloudCluster_24D1FBB0306F6AC6-001/tempDir-001/node5/.
[junit4] 2> 301031 INFO (jetty-launcher-437-thread-3) [n:127.0.0.1:39201_solr ] o.a.s.m.r.SolrJmxReporter JMX monitoring for 'solr_39201.solr.node' (registry 'solr.node') enabled at server: com.sun.jmx.mbeanserver.JmxMBeanServer@47c215a2
[junit4] 2> 301033 INFO (jetty-launcher-437-thread-2) [n:127.0.0.1:34069_solr ] o.a.s.c.c.ZkStateReader Updated live nodes from ZooKeeper... (0) -> (4)
[junit4] 2> 301033 INFO (jetty-launcher-437-thread-3) [n:127.0.0.1:39201_solr ] o.a.s.m.r.SolrJmxReporter JMX monitoring for 'solr_39201.solr.jvm' (registry 'solr.jvm') enabled at server: com.sun.jmx.mbeanserver.JmxMBeanServer@47c215a2
[junit4] 2> 301034 INFO (jetty-launcher-437-thread-3) [n:127.0.0.1:39201_solr ] o.a.s.m.r.SolrJmxReporter JMX monitoring for 'solr_39201.solr.jetty' (registry 'solr.jetty') enabled at server: com.sun.jmx.mbeanserver.JmxMBeanServer@47c215a2
[junit4] 2> 301034 INFO (jetty-launcher-437-thread-2) [n:127.0.0.1:34069_solr ] o.a.s.c.Overseer Overseer (id=null) closing
[junit4] 2> 301035 INFO (jetty-launcher-437-thread-2) [n:127.0.0.1:34069_solr ] o.a.s.c.ZkController Register node as live in ZooKeeper:/live_nodes/127.0.0.1:34069_solr
[junit4] 2> 301036 INFO (zkCallback-463-thread-1-processing-n:127.0.0.1:39201_solr) [n:127.0.0.1:39201_solr ] o.a.s.c.c.ZkStateReader Updated live nodes from ZooKeeper... (4) -> (5)
[junit4] 2> 301036 INFO (zkCallback-462-thread-1-processing-n:127.0.0.1:35085_solr) [n:127.0.0.1:35085_solr ] o.a.s.c.c.ZkStateReader Updated live nodes from ZooKeeper... (4) -> (5)
[junit4] 2> 301036 INFO (zkCallback-464-thread-2-processing-n:127.0.0.1:42317_solr) [n:127.0.0.1:42317_solr ] o.a.s.c.c.ZkStateReader Updated live nodes from ZooKeeper... (4) -> (5)
[junit4] 2> 301036 INFO (zkCallback-461-thread-1-processing-n:127.0.0.1:44885_solr) [n:127.0.0.1:44885_solr ] o.a.s.c.c.ZkStateReader Updated live nodes from ZooKeeper... (4) -> (5)
[junit4] 2> 301037 INFO (jetty-launcher-437-thread-3) [n:127.0.0.1:39201_solr ] o.a.s.c.CorePropertiesLocator Found 0 core definitions underneath /home/jenkins/workspace/Lucene-Solr-master-Linux/solr/build/solr-core/test/J0/temp/solr.cloud.TestCollectionsAPIViaSolrCloudCluster_24D1FBB0306F6AC6-001/tempDir-001/node4/.
[junit4] 2> 301038 INFO (jetty-launcher-437-thread-1) [n:127.0.0.1:35085_solr ] o.a.s.m.r.SolrJmxReporter JMX monitoring for 'solr_35085.solr.node' (registry 'solr.node') enabled at server: com.sun.jmx.mbeanserver.JmxMBeanServer@47c215a2
[junit4] 2> 301042 INFO (jetty-launcher-437-thread-1) [n:127.0.0.1:35085_solr ] o.a.s.m.r.SolrJmxReporter JMX monitoring for 'solr_35085.solr.jvm' (registry 'solr.jvm') enabled at server: com.sun.jmx.mbeanserver.JmxMBeanServer@47c215a2
[junit4] 2> 301042 INFO (jetty-launcher-437-thread-1) [n:127.0.0.1:35085_solr ] o.a.s.m.r.SolrJmxReporter JMX monitoring for 'solr_35085.solr.jetty' (registry 'solr.jetty') enabled at server: com.sun.jmx.mbeanserver.JmxMBeanServer@47c215a2
[junit4] 2> 301043 INFO (jetty-launcher-437-thread-1) [n:127.0.0.1:35085_solr ] o.a.s.c.CorePropertiesLocator Found 0 core definitions underneath /home/jenkins/workspace/Lucene-Solr-master-Linux/solr/build/solr-core/test/J0/temp/solr.cloud.TestCollectionsAPIViaSolrCloudCluster_24D1FBB0306F6AC6-001/tempDir-001/node1/.
[junit4] 2> 301049 INFO (jetty-launcher-437-thread-4) [n:127.0.0.1:44885_solr ] o.a.s.m.r.SolrJmxReporter JMX monitoring for 'solr_44885.solr.node' (registry 'solr.node') enabled at server: com.sun.jmx.mbeanserver.JmxMBeanServer@47c215a2
[junit4] 2> 301052 INFO (jetty-launcher-437-thread-4) [n:127.0.0.1:44885_solr ] o.a.s.m.r.SolrJmxReporter JMX monitoring for 'solr_44885.solr.jvm' (registry 'solr.jvm') enabled at server: com.sun.jmx.mbeanserver.JmxMBeanServer@47c215a2
[junit4] 2> 301052 INFO (jetty-launcher-437-thread-4) [n:127.0.0.1:44885_solr ] o.a.s.m.r.SolrJmxReporter JMX monitoring for 'solr_44885.solr.jetty' (registry 'solr.jetty') enabled at server: com.sun.jmx.mbeanserver.JmxMBeanServer@47c215a2
[junit4] 2> 301068 INFO (zkCallback-460-thread-1-processing-n:127.0.0.1:34069_solr) [n:127.0.0.1:34069_solr ] o.a.s.c.c.ZkStateReader Updated live nodes from ZooKeeper... (4) -> (5)
[junit4] 2> 301078 INFO (jetty-launcher-437-thread-4) [n:127.0.0.1:44885_solr ] o.a.s.c.CorePropertiesLocator Found 0 core definitions underneath /home/jenkins/workspace/Lucene-Solr-master-Linux/solr/build/solr-core/test/J0/temp/solr.cloud.TestCollectionsAPIViaSolrCloudCluster_24D1FBB0306F6AC6-001/tempDir-001/node3/.
[junit4] 2> 301178 INFO (jetty-launcher-437-thread-2) [n:127.0.0.1:34069_solr ] o.a.s.m.r.SolrJmxReporter JMX monitoring for 'solr_34069.solr.node' (registry 'solr.node') enabled at server: com.sun.jmx.mbeanserver.JmxMBeanServer@47c215a2
[junit4] 2> 301182 INFO (jetty-launcher-437-thread-2) [n:127.0.0.1:34069_solr ] o.a.s.m.r.SolrJmxReporter JMX monitoring for 'solr_34069.solr.jvm' (registry 'solr.jvm') enabled at server: com.sun.jmx.mbeanserver.JmxMBeanServer@47c215a2
[junit4] 2> 301182 INFO (jetty-launcher-437-thread-2) [n:127.0.0.1:34069_solr ] o.a.s.m.r.SolrJmxReporter JMX monitoring for 'solr_34069.solr.jetty' (registry 'solr.jetty') enabled at server: com.sun.jmx.mbeanserver.JmxMBeanServer@47c215a2
[junit4] 2> 301183 INFO (jetty-launcher-437-thread-2) [n:127.0.0.1:34069_solr ] o.a.s.c.CorePropertiesLocator Found 0 core definitions underneath /home/jenkins/workspace/Lucene-Solr-master-Linux/solr/build/solr-core/test/J0/temp/solr.cloud.TestCollectionsAPIViaSolrCloudCluster_24D1FBB0306F6AC6-001/tempDir-001/node2/.
[junit4] 2> 301252 INFO (TEST-TestCollectionsAPIViaSolrCloudCluster.testCollectionCreateSearchDelete-seed#[24D1FBB0306F6AC6]) [ ] o.a.s.c.c.ZkStateReader Updated live nodes from ZooKeeper... (0) -> (5)
[junit4] 2> 301253 INFO (TEST-TestCollectionsAPIViaSolrCloudCluster.testCollectionCreateSearchDelete-seed#[24D1FBB0306F6AC6]) [ ] o.a.s.c.s.i.ZkClientClusterStateProvider Cluster at 127.0.0.1:32799/solr ready
[junit4] 2> 301257 INFO (TEST-TestCollectionsAPIViaSolrCloudCluster.testCollectionCreateSearchDelete-seed#[24D1FBB0306F6AC6]) [ ] o.a.s.SolrTestCaseJ4 ###Starting testCollectionCreateSearchDelete
[junit4] 2> 301267 INFO (TEST-TestCollectionsAPIViaSolrCloudCluster.testCollectionCreateSearchDelete-seed#[24D1FBB0306F6AC6]) [ ] o.e.j.s.AbstractConnector Stopped ServerConnector@447a9b90{HTTP/1.1,[http/1.1]}{127.0.0.1:0}
[junit4] 2> 301267 INFO (TEST-TestCollectionsAPIViaSolrCloudCluster.testCollectionCreateSearchDelete-seed#[24D1FBB0306F6AC6]) [ ] o.a.s.c.CoreContainer Shutting down CoreContainer instance=710217207
[junit4] 2> 301267 INFO (TEST-TestCollectionsAPIViaSolrCloudCluster.testCollectionCreateSearchDelete-seed#[24D1FBB0306F6AC6]) [ ] o.a.s.m.SolrMetricManager Closing metric reporters for registry=solr.node, tag=null
[junit4] 2> 301269 INFO (TEST-TestCollectionsAPIViaSolrCloudCluster.testCollectionCreateSearchDelete-seed#[24D1FBB0306F6AC6]) [ ] o.a.s.m.SolrMetricManager Closing metric reporters for registry=solr.jvm, tag=null
[junit4] 2> 301271 INFO (TEST-TestCollectionsAPIViaSolrCloudCluster.testCollectionCreateSearchDelete-seed#[24D1FBB0306F6AC6]) [ ] o.a.s.m.SolrMetricManager Closing metric reporters for registry=solr.jetty, tag=null
[junit4] 2> 301273 INFO (TEST-TestCollectionsAPIViaSolrCloudCluster.testCollectionCreateSearchDelete-seed#[24D1FBB0306F6AC6]) [ ] o.a.s.m.SolrMetricManager Closing metric reporters for registry=solr.cluster, tag=null
[junit4] 2> 301276 INFO (TEST-TestCollectionsAPIViaSolrCloudCluster.testCollectionCreateSearchDelete-seed#[24D1FBB0306F6AC6]) [ ] o.a.s.c.TransientSolrCoreCacheDefault Allocating transient cache for 2147483647 transient cores
[junit4] 2> 301276 INFO (TEST-TestCollectionsAPIViaSolrCloudCluster.testCollectionCreateSearchDelete-seed#[24D1FBB0306F6AC6]) [ ] o.a.s.c.Overseer Overseer (id=98464967727710223-127.0.0.1:42317_solr-n_0000000000) closing
[junit4] 2> 301276 INFO (OverseerStateUpdate-98464967727710223-127.0.0.1:42317_solr-n_0000000000) [n:127.0.0.1:42317_solr ] o.a.s.c.Overseer Overseer Loop exiting : 127.0.0.1:42317_solr
[junit4] 2> 301278 INFO (zkCallback-463-thread-1-processing-n:127.0.0.1:39201_solr) [n:127.0.0.1:39201_solr ] o.a.s.c.OverseerElectionContext I am going to be the leader 127.0.0.1:39201_solr
[junit4] 2> 301278 INFO (zkCallback-462-thread-1-processing-n:127.0.0.1:35085_solr) [n:127.0.0.1:35085_solr ] o.a.s.c.c.ZkStateReader Updated live nodes from ZooKeeper... (5) -> (4)
[junit4] 2> 301278 INFO (zkCallback-460-thread-1-processing-n:127.0.0.1:34069_solr) [n:127.0.0.1:34069_solr ] o.a.s.c.c.ZkStateReader Updated live nodes from ZooKeeper... (5) -> (4)
[junit4] 2> 301278 INFO (zkCallback-463-thread-2-processing-n:127.0.0.1:39201_solr) [n:127.0.0.1:39201_solr ] o.a.s.c.c.ZkStateReader Updated live nodes from ZooKeeper... (5) -> (4)
[junit4] 2> 301279 INFO (zkCallback-473-thread-1) [ ] o.a.s.c.c.ZkStateReader Updated live nodes from ZooKeeper... (5) -> (4)
[junit4] 2> 301278 INFO (zkCallback-461-thread-1-processing-n:127.0.0.1:44885_solr) [n:127.0.0.1:44885_solr ] o.a.s.c.c.ZkStateReader Updated live nodes from ZooKeeper... (5) -> (4)
[junit4] 2> 301279 INFO (TEST-TestCollectionsAPIViaSolrCloudCluster.testCollectionCreateSearchDelete-seed#[24D1FBB0306F6AC6]) [ ] o.e.j.s.h.ContextHandler Stopped o.e.j.s.ServletContextHandler@7dc365a4{/solr,null,UNAVAILABLE}
[junit4] 2> 301279 INFO (zkCallback-463-thread-1-processing-n:127.0.0.1:39201_solr) [n:127.0.0.1:39201_solr ] o.a.s.c.Overseer Overseer (id=98464967727710222-127.0.0.1:39201_solr-n_0000000001) starting
[junit4] 2> 301281 INFO (TEST-TestCollectionsAPIViaSolrCloudCluster.testCollectionCreateSearchDelete-seed#[24D1FBB0306F6AC6]) [ ] o.e.j.s.Server jetty-9.3.14.v20161028
[junit4] 2> 301288 INFO (TEST-TestCollectionsAPIViaSolrCloudCluster.testCollectionCreateSearchDelete-seed#[24D1FBB0306F6AC6]) [ ] o.e.j.s.h.ContextHandler Started o.e.j.s.ServletContextHandler@fc4b7f0{/solr,null,AVAILABLE}
[junit4] 2> 301288 INFO (TEST-TestCollectionsAPIViaSolrCloudCluster.testCollectionCreateSearchDelete-seed#[24D1FBB0306F6AC6]) [ ] o.e.j.s.AbstractConnector Started ServerConnector@607e3601{HTTP/1.1,[http/1.1]}{127.0.0.1:37699}
[junit4] 2> 301288 INFO (TEST-TestCollectionsAPIViaSolrCloudCluster.testCollectionCreateSearchDelete-seed#[24D1FBB0306F6AC6]) [ ] o.e.j.s.Server Started @302637ms
[junit4] 2> 301288 INFO (TEST-TestCollectionsAPIViaSolrCloudCluster.testCollectionCreateSearchDelete-seed#[24D1FBB0306F6AC6]) [ ] o.a.s.c.s.e.JettySolrRunner Jetty properties: {hostContext=/solr, hostPort=37699}
[junit4] 2> 301289 ERROR (TEST-TestCollectionsAPIViaSolrCloudCluster.testCollectionCreateSearchDelete-seed#[24D1FBB0306F6AC6]) [ ] o.a.s.s.StartupLoggingUtils Missing Java Option solr.log.dir. Logging may be missing or incomplete.
[junit4] 2> 301290 INFO (TEST-TestCollectionsAPIViaSolrCloudCluster.testCollectionCreateSearchDelete-seed#[24D1FBB0306F6AC6]) [ ] o.a.s.s.SolrDispatchFilter ___ _ Welcome to Apache Solr? version 8.0.0
[junit4] 2> 301290 INFO (TEST-TestCollectionsAPIViaSolrCloudCluster.testCollectionCreateSearchDelete-seed#[24D1FBB0306F6AC6]) [ ] o.a.s.s.SolrDispatchFilter / __| ___| |_ _ Starting in cloud mode on port null
[junit4] 2> 301290 INFO (TEST-TestCollectionsAPIViaSolrCloudCluster.testCollectionCreateSearchDelete-seed#[24D1FBB0306F6AC6]) [ ] o.a.s.s.SolrDispatchFilter \__ \/ _ \ | '_| Install dir: null, Default config dir: null
[junit4] 2> 301290 INFO (TEST-TestCollectionsAPIViaSolrCloudCluster.testCollectionCreateSearchDelete-seed#[24D1FBB0306F6AC6]) [ ] o.a.s.s.SolrDispatchFilter |___/\___/_|_| Start time: 2017-08-11T12:56:13.278Z
[junit4] 2> 301294 INFO (TEST-TestCollectionsAPIViaSolrCloudCluster.testCollectionCreateSearchDelete-seed#[24D1FBB0306F6AC6]) [ ] o.a.s.s.SolrDispatchFilter solr.xml found in ZooKeeper. Loading...
[junit4] 2> 301301 INFO (TEST-TestCollectionsAPIViaSolrCloudCluster.testCollectionCreateSearchDelete-seed#[24D1FBB0306F6AC6]) [ ] o.a.s.c.ZkContainer Zookeeper client=127.0.0.1:32799/solr
[junit4] 2> 301315 INFO (TEST-TestCollectionsAPIViaSolrCloudCluster.testCollectionCreateSearchDelete-seed#[24D1FBB0306F6AC6]) [n:127.0.0.1:37699_solr ] o.a.s.c.c.ZkStateReader Updated live nodes from ZooKeeper... (0) -> (4)
[junit4] 2> 301316 INFO (TEST-TestCollectionsAPIViaSolrCloudCluster.testCollectionCreateSearchDelete-seed#[24D1FBB0306F6AC6]) [n:127.0.0.1:37699_solr ] o.a.s.c.Overseer Overseer (id=null) closing
[junit4] 2> 301317 INFO (TEST-TestCollectionsAPIViaSolrCloudCluster.testCollectionCreateSearchDelete-seed#[24D1FBB0306F6AC6]) [n:127.0.0.1:37699_solr ] o.a.s.c.ZkController Register node as live in ZooKeeper:/live_nodes/127.0.0.1:37699_solr
[junit4] 2> 301318 INFO (zkCallback-460-thread-1-processing-n:127.0.0.1:34069_solr) [n:127.0.0.1:34069_solr ] o.a.s.c.c.ZkStateReader Updated live nodes from ZooKeeper... (4) -> (5)
[junit4] 2> 301318 INFO (zkCallback-461-thread-1-processing-n:127.0.0.1:44885_solr) [n:127.0.0.1:44885_solr ] o.a.s.c.c.ZkStateReader Updated live nodes from ZooKeeper... (4) -> (5)
[junit4] 2> 301319 INFO (zkCallback-462-thread-1-processing-n:127.0.0.1:35085_solr) [n:127.0.0.1:35085_solr ] o.a.s.c.c.ZkStateReader Updated live nodes from ZooKeeper... (4) -> (5)
[junit4] 2> 301319 INFO (zkCallback-473-thread-1) [ ] o.a.s.c.c.ZkStateReader Updated live nodes from ZooKeeper... (4) -> (5)
[junit4] 2> 301319 INFO (zkCallback-463-thread-1-processing-n:127.0.0.1:39201_solr) [n:127.0.0.1:39201_solr ] o.a.s.c.c.ZkStateReader Updated live nodes from ZooKeeper... (4) -> (5)
[junit4] 2> 301324 INFO (zkCallback-478-thread-1-processing-n:127.0.0.1:37699_solr) [n:127.0.0.1:37699_solr ] o.a.s.c.c.ZkStateReader Updated live nodes from ZooKeeper... (4) -> (5)
[junit4] 2> 301403 INFO (TEST-TestCollectionsAPIViaSolrCloudCluster.testCollectionCreateSearchDelete-seed#[24D1FBB0306F6AC6]) [n:127.0.0.1:37699_solr ] o.a.s.m.r.SolrJmxReporter JMX monitoring for 'solr_37699.solr.node' (registry 'solr.node') enabled at server: com.sun.jmx.mbeanserver.JmxMBeanServer@47c215a2
[junit4] 2> 301407 INFO (TEST-TestCollectionsAPIViaSolrCloudCluster.testCollectionCreateSearchDelete-seed#[24D1FBB0306F6AC6]) [n:127.0.0.1:37699_solr ] o.a.s.m.r.SolrJmxReporter JMX monitoring for 'solr_37699.solr.jvm' (registry 'solr.jvm') enabled at server: com.sun.jmx.mbeanserver.JmxMBeanServer@47c215a2
[junit4] 2> 301408 INFO (TEST-TestCollectionsAPIViaSolrCloudCluster.testCollectionCreateSearchDelete-seed#[24D1FBB0306F6AC6]) [n:127.0.0.1:37699_solr ] o.a.s.m.r.SolrJmxReporter JMX monitoring for 'solr_37699.solr.jetty' (registry 'solr.jetty') enabled at server: com.sun.jmx.mbeanserver.JmxMBeanServer@47c215a2
[junit4] 2> 301409 INFO (TEST-TestCollectionsAPIViaSolrCloudCluster.testCollectionCreateSearchDelete-seed#[24D1FBB0306F6AC6]) [n:127.0.0.1:37699_solr ] o.a.s.c.CorePropertiesLocator Found 0 core definitions underneath /home/jenkins/workspace/Lucene-Solr-master-Linux/solr/build/solr-core/test/J0/temp/solr.cloud.TestCollectionsAPIViaSolrCloudCluster_24D1FBB0306F6AC6-001/tempDir-001/node6/.
[junit4] 2> 301461 INFO (qtp2024517883-2906) [n:127.0.0.1:44885_solr ] o.a.s.h.a.CollectionsHandler Invoked Collection Action :create with params replicationFactor=2&collection.configName=solrCloudCollectionConfig&maxShardsPerNode=1&name=testcollection&nrtReplicas=2&action=CREATE&numShards=2&property.solr.directoryFactory=solr.StandardDirectoryFactory&wt=javabin&version=2 and sendToOCPQueue=true
[junit4] 2> 301473 INFO (OverseerThreadFactory-1424-thread-1-processing-n:127.0.0.1:39201_solr) [n:127.0.0.1:39201_solr ] o.a.s.c.CreateCollectionCmd Create collection testcollection
[junit4] 2> 301588 INFO (OverseerStateUpdate-98464967727710222-127.0.0.1:39201_solr-n_0000000001) [n:127.0.0.1:39201_solr ] o.a.s.c.o.SliceMutator createReplica() {
[junit4] 2> "operation":"ADDREPLICA",
[junit4] 2> "collection":"testcollection",
[junit4] 2> "shard":"shard1",
[junit4] 2> "core":"testcollection_shard1_replica_n1",
[junit4] 2> "state":"down",
[junit4] 2> "base_url":"http://127.0.0.1:44885/solr",
[junit4] 2> "type":"NRT"}
[junit4] 2> 301590 INFO (OverseerStateUpdate-98464967727710222-127.0.0.1:39201_solr-n_0000000001) [n:127.0.0.1:39201_solr ] o.a.s.c.o.SliceMutator createReplica() {
[junit4] 2> "operation":"ADDREPLICA",
[junit4] 2> "collection":"testcollection",
[junit4] 2> "shard":"shard1",
[junit4] 2> "core":"testcollection_shard1_replica_n2",
[junit4] 2> "state":"down",
[junit4] 2> "base_url":"http://127.0.0.1:35085/solr",
[junit4] 2> "type":"NRT"}
[junit4] 2> 301591 INFO (OverseerStateUpdate-98464967727710222-127.0.0.1:39201_solr-n_0000000001) [n:127.0.0.1:39201_solr ] o.a.s.c.o.SliceMutator createReplica() {
[junit4] 2> "operation":"ADDREPLICA",
[junit4] 2> "collection":"testcollection",
[junit4] 2> "shard":"shard2",
[junit4] 2> "core":"testcollection_shard2_replica_n3",
[junit4] 2> "state":"down",
[junit4] 2> "base_url":"http://127.0.0.1:34069/solr",
[junit4] 2> "type":"NRT"}
[junit4] 2> 301593 INFO (OverseerStateUpdate-98464967727710222-127.0.0.1:39201_solr-n_0000000001) [n:127.0.0.1:39201_solr ] o.a.s.c.o.SliceMutator createReplica() {
[junit4] 2> "operation":"ADDREPLICA",
[junit4] 2> "collection":"testcollection",
[junit4] 2> "shard":"shard2",
[junit4] 2> "core":"testcollection_shard2_replica_n4",
[junit4] 2> "state":"down",
[junit4] 2> "base_url":"http://127.0.0.1:37699/solr",
[junit4] 2> "type":"NRT"}
[junit4] 2> 301805 INFO (qtp187003465-3020) [n:127.0.0.1:37699_solr ] o.a.s.h.a.CoreAdminOperation core create command qt=/admin/cores&collection.configName=solrCloudCollectionConfig&newCollection=true&collection=testcollection&version=2&replicaType=NRT&coreNodeName=core_node8&name=testcollection_shard2_replica_n4&action=CREATE&numShards=2&shard=shard2&property.solr.directoryFactory=solr.StandardDirectoryFactory&wt=javabin
[junit4] 2> 301805 INFO (qtp187003465-3020) [n:127.0.0.1:37699_solr ] o.a.s.c.TransientSolrCoreCacheDefault Allocating transient cache for 2147483647 transient cores
[junit4] 2> 301806 INFO (qtp2024517883-2925) [n:127.0.0.1:44885_solr ] o.a.s.h.a.CoreAdminOperation core create command qt=/admin/cores&collection.configName=solrCloudCollectionConfig&newCollection=true&collection=testcollection&version=2&replicaType=NRT&coreNodeName=core_node5&name=testcollection_shard1_replica_n1&action=CREATE&numShards=2&shard=shard1&property.solr.directoryFactory=solr.StandardDirectoryFactory&wt=javabin
[junit4] 2> 301806 INFO (qtp191499112-2899) [n:127.0.0.1:34069_solr ] o.a.s.h.a.CoreAdminOperation core create command qt=/admin/cores&collection.configName=solrCloudCollectionConfig&newCollection=true&collection=testcollection&version=2&replicaType=NRT&coreNodeName=core_node7&name=testcollection_shard2_replica_n3&action=CREATE&numShards=2&shard=shard2&property.solr.directoryFactory=solr.StandardDirectoryFactory&wt=javabin
[junit4] 2> 301806 INFO (qtp2024517883-2925) [n:127.0.0.1:44885_solr ] o.a.s.c.TransientSolrCoreCacheDefault Allocating transient cache for 2147483647 transient cores
[junit4] 2> 301806 INFO (qtp191499112-2899) [n:127.0.0.1:34069_solr ] o.a.s.c.TransientSolrCoreCacheDefault Allocating transient cache for 2147483647 transient cores
[junit4] 2> 301807 INFO (qtp1172646673-2902) [n:127.0.0.1:35085_solr ] o.a.s.h.a.CoreAdminOperation core create command qt=/admin/cores&collection.configName=solrCloudCollectionConfig&newCollection=true&collection=testcollection&version=2&replicaType=NRT&coreNodeName=core_node6&name=testcollection_shard1_replica_n2&action=CREATE&numShards=2&shard=shard1&property.solr.directoryFactory=solr.StandardDirectoryFactory&wt=javabin
[junit4] 2> 301807 INFO (qtp1172646673-2902) [n:127.0.0.1:35085_solr ] o.a.s.c.TransientSolrCoreCacheDefault Allocating transient cache for 2147483647 transient cores
[junit4] 2> 301914 INFO (zkCallback-478-thread-1-processing-n:127.0.0.1:37699_solr) [n:127.0.0.1:37699_solr ] o.a.s.c.c.ZkStateReader A cluster state change: [WatchedEvent state:SyncConnected type:NodeDataChanged path:/collections/testcollection/state.json] for collection [testcollection] has occurred - updating... (live nodes size: [5])
[junit4] 2> 301914 INFO (zkCallback-462-thread-1-processing-n:127.0.0.1:35085_solr) [n:127.0.0.1:35085_solr ] o.a.s.c.c.ZkStateReader A cluster state change: [WatchedEvent state:SyncConnected type:NodeDataChanged path:/collections/testcollection/state.json] for collection [testcollection] has occurred - updating... (live nodes size: [5])
[junit4] 2> 301914 INFO (zkCallback-461-thread-1-processing-n:127.0.0.1:44885_solr) [n:127.0.0.1:44885_solr ] o.a.s.c.c.ZkStateReader A cluster state change: [WatchedEvent state:SyncConnected type:NodeDataChanged path:/collections/testcollection/state.json] for collection [testcollection] has occurred - updating... (live nodes size: [5])
[junit4] 2> 301914 INFO (zkCallback-478-thread-2-processing-n:127.0.0.1:37699_solr) [n:127.0.0.1:37699_solr ] o.a.s.c.c.ZkStateReader A cluster state change: [WatchedEvent state:SyncConnected type:NodeDataChanged path:/collections/testcollection/state.json] for collection [testcollection] has occurred - updating... (live nodes size: [5])
[junit4] 2> 301914 INFO (zkCallback-460-thread-1-processing-n:127.0.0.1:34069_solr) [n:127.0.0.1:34069_solr ] o.a.s.c.c.ZkStateReader A cluster state change: [WatchedEvent state:SyncConnected type:NodeDataChanged path:/collections/testcollection/state.json] for collection [testcollection] has occurred - updating... (live nodes size: [5])
[junit4] 2> 301919 INFO (zkCallback-460-thread-2-processing-n:127.0.0.1:34069_solr) [n:127.0.0.1:34069_solr ] o.a.s.c.c.ZkStateReader A cluster state change: [WatchedEvent state:SyncConnected type:NodeDataChanged path:/collections/testcollection/state.json] for collection [testcollection] has occurred - updating... (live nodes size: [5])
[junit4] 2> 301919 INFO (zkCallback-461-thread-2-processing-n:127.0.0.1:44885_solr) [n:127.0.0.1:44885_solr ] o.a.s.c.c.ZkStateReader A cluster state change: [WatchedEvent state:SyncConnected type:NodeDataChanged path:/collections/testcollection/state.json] for collection [testcollection] has occurred - updating... (live nodes size: [5])
[junit4] 2> 301920 INFO (zkCallback-462-thread-2-processing-n:127.0.0.1:35085_solr) [n:127.0.0.1:35085_solr ] o.a.s.c.c.ZkStateReader A cluster state change: [WatchedEvent state:SyncConnected type:NodeDataChanged path:/collections/testcollection/state.json] for collection [testcollection] has occurred - updating... (live nodes size: [5])
[junit4] 2> 302821 INFO (qtp191499112-2899) [n:127.0.0.1:34069_solr c:testcollection s:shard2 r:core_node7 x:testcollection_shard2_replica_n3] o.a.s.c.SolrConfig Using Lucene MatchVersion: 8.0.0
[junit4] 2> 302851 INFO (qtp1172646673-2902) [n:127.0.0.1:35085_solr c:testcollection s:shard1 r:core_node6 x:testcollection_shard1_replica_n2] o.a.s.c.SolrConfig Using Lucene MatchVersion: 8.0.0
[junit4] 2> 302853 INFO (qtp2024517883-2925) [n:127.0.0.1:44885_solr c:testcollection s:shard1 r:core_node5 x:testcollection_shard1_replica_n1] o.a.s.c.SolrConfig Using Lucene MatchVersion: 8.0.0
[junit4] 2> 302854 INFO (qtp187003465-3020) [n:127.0.0.1:37699_solr c:testcollection s:shard2 r:core_node8 x:testcollection_shard2_replica_n4] o.a.s.c.SolrConfig Using Lucene MatchVersion: 8.0.0
[junit4] 2> 302875 INFO (qtp191499112-2899) [n:127.0.0.1:34069_solr c:testcollection s:shard2 r:core_node7 x:testcollection_shard2_replica_n3] o.a.s.s.IndexSchema [testcollection_shard2_replica_n3] Schema name=minimal
[junit4] 2> 302878 INFO (qtp191499112-2899) [n:127.0.0.1:34069_solr c:testcollection s:shard2 r:core_node7 x:testcollection_shard2_replica_n3] o.a.s.s.IndexSchema Loaded schema minimal/1.1 with uniqueid field id
[junit4] 2> 302878 INFO (qtp191499112-2899) [n:127.0.0.1:34069_solr c:testcollection s:shard2 r:core_node7 x:testcollection_shard2_replica_n3] o.a.s.c.CoreContainer Creating SolrCore 'testcollection_shard2_replica_n3' using configuration from collection testcollection, trusted=true
[junit4] 2> 302879 INFO (qtp2024517883-2925) [n:127.0.0.1:44885_solr c:testcollection s:shard1 r:core_node5 x:testcollection_shard1_replica_n1] o.a.s.s.IndexSchema [testcollection_shard1_replica_n1] Schema name=minimal
[junit4] 2> 302879 INFO (qtp1172646673-2902) [n:127.0.0.1:35085_solr c:testcollection s:shard1 r:core_node6 x:testcollection_shard1_replica_n2] o.a.s.s.IndexSchema [testcollection_shard1_replica_n2] Schema name=minimal
[junit4] 2> 302879 INFO (qtp187003465-3020) [n:127.0.0.1:37699_solr c:testcollection s:shard2 r:core_node8 x:testcollection_shard2_replica_n4] o.a.s.s.IndexSchema [testcollection_shard2_replica_n4] Schema name=minimal
[junit4] 2> 302880 INFO (qtp191499112-2899) [n:127.0.0.1:34069_solr c:testcollection s:shard2 r:core_node7 x:testcollection_shard2_replica_n3] o.a.s.m.r.SolrJmxReporter JMX monitoring for 'solr_34069.solr.core.testcollection.shard2.replica_n3' (registry 'solr.core.testcollection.shard2.replica_n3') enabled at server: com.sun.jmx.mbeanserver.JmxMBeanServer@47c215a2
[junit4] 2> 302882 INFO (qtp2024517883-2925) [n:127.0.0.1:44885_solr c:testcollection s:shard1 r:core_node5 x:testcollection_shard1_replica_n1] o.a.s.s.IndexSchema Loaded schema minimal/1.1 with uniqueid field id
[junit4] 2> 302882 INFO (qtp1172646673-2902) [n:127.0.0.1:35085_solr c:testcollection s:shard1 r:core_node6 x:testcollection_shard1_replica_n2] o.a.s.s.IndexSchema Loaded schema minimal/1.1 with uniqueid field id
[junit4] 2> 302882 INFO (qtp2024517883-2925) [n:127.0.0.1:44885_solr c:testcollection s:shard1 r:core_node5 x:testcollection_shard1_replica_n1] o.a.s.c.CoreContainer Creating SolrCore 'testcollection_shard1_replica_n1' using configuration from collection testcollection, trusted=true
[junit4] 2> 302882 INFO (qtp1172646673-2902) [n:127.0.0.1:35085_solr c:testcollection s:shard1 r:core_node6 x:testcollection_shard1_replica_n2] o.a.s.c.CoreContainer Creating SolrCore 'testcollection_shard1_replica_n2' using configuration from collection testcollection, trusted=true
[junit4] 2> 302882 INFO (qtp1172646673-2902) [n:127.0.0.1:35085_solr c:testcollection s:shard1 r:core_node6 x:testcollection_shard1_replica_n2] o.a.s.m.r.SolrJmxReporter JMX monitoring for 'solr_35085.solr.core.testcollection.shard1.replica_n2' (registry 'solr.core.testcollection.shard1.replica_n2') enabled at server: com.sun.jmx.mbeanserver.JmxMBeanServer@47c215a2
[junit4] 2> 302882 INFO (qtp2024517883-2925) [n:127.0.0.1:44885_solr c:testcollection s:shard1 r:core_node5 x:testcollection_shard1_replica_n1] o.a.s.m.r.SolrJmxReporter JMX monitoring for 'solr_44885.solr.core.testcollection.shard1.replica_n1' (registry 'solr.core.testcollection.shard1.replica_n1') enabled at server: com.sun.jmx.mbeanserver.JmxMBeanServer@47c215a2
[junit4] 2> 302884 INFO (qtp187003465-3020) [n:127.0.0.1:37699_solr c:testcollection s:shard2 r:core_node8 x:testcollection_shard2_replica_n4] o.a.s.s.IndexSchema Loaded schema minimal/1.1 with uniqueid field id
[junit4] 2> 302884 INFO (qtp187003465-3020) [n:127.0.0.1:37699_solr c:testcollection s:shard2 r:core_node8 x:testcollection_shard2_replica_n4] o.a.s.c.CoreContainer Creating SolrCore 'testcollection_shard2_replica_n4' using configuration from collection testcollection, trusted=true
[junit4] 2> 302885 INFO (qtp187003465-3020) [n:127.0.0.1:37699_solr c:testcollection s:shard2 r:core_node8 x:testcollection_shard2_replica_n4] o.a.s.m.r.SolrJmxReporter JMX monitoring for 'solr_37699.solr.core.testcollection.shard2.replica_n4' (registry 'solr.core.testcollection.shard2.replica_n4') enabled at server: com.sun.jmx.mbeanserver.JmxMBeanServer@47c215a2
[junit4] 2> 302886 INFO (qtp191499112-2899) [n:127.0.0.1:34069_solr c:testcollection s:shard2 r:core_node7 x:testcollection_shard2_replica_n3] o.a.s.c.SolrCore solr.RecoveryStrategy.Builder
[junit4] 2> 302886 INFO (qtp191499112-2899) [n:127.0.0.1:34069_solr c:testcollection s:shard2 r:core_node7 x:testcollection_shard2_replica_n3] o.a.s.c.SolrCore [[testcollection_shard2_replica_n3] ] Opening new SolrCore at [/home/jenkins/workspace/Lucene-Solr-master-Linux/solr/build/solr-core/test/J0/temp/solr.cloud.TestCollectionsAPIViaSolrCloudCluster_24D1FBB0306F6AC6-001/tempDir-001/node2/testcollection_shard2_replica_n3], dataDir=[/home/jenkins/workspace/Lucene-Solr-master-Linux/solr/build/solr-core/test/J0/temp/solr.cloud.TestCollectionsAPIViaSolrCloudCluster_24D1FBB0306F6AC6-001/tempDir-001/node2/./testcollection_shard2_replica_n3/data/]
[junit4] 2> 302886 INFO (qtp2024517883-2925) [n:127.0.0.1:44885_solr c:testcollection s:shard1 r:core_node5 x:testcollection_shard1_replica_n1] o.a.s.c.SolrCore solr.RecoveryStrategy.Builder
[junit4] 2> 302886 INFO (qtp2024517883-2925) [n:127.0.0.1:44885_solr c:testcollection s:shard1 r:core_node5 x:testcollection_shard1_replica_n1] o.a.s.c.SolrCore [[testcollection_shard1_replica_n1] ] Opening new SolrCore at [/home/jenkins/workspace/Lucene-Solr-master-Linux/solr/build/solr-core/test/J0/temp/solr.cloud.TestCollectionsAPIViaSolrCloudCluster_24D1FBB0306F6AC6-001/tempDir-001/node3/testcollection_shard1_replica_n1], dataDir=[/home/jenkins/workspace/Lucene-Solr-master-Linux/solr/build/solr-core/test/J0/temp/solr.cloud.TestCollectionsAPIViaSolrCloudCluster_24D1FBB0306F6AC6-001/tempDir-001/node3/./testcollection_shard1_replica_n1/data/]
[junit4] 2> 302886 INFO (qtp1172646673-2902) [n:127.0.0.1:35085_solr c:testcollection s:shard1 r:core_node6 x:testcollection_shard1_replica_n2] o.a.s.c.SolrCore solr.RecoveryStrategy.Builder
[junit4] 2> 302886 INFO (qtp1172646673-2902) [n:127.0.0.1:35085_solr c:testcollection s:shard1 r:core_node6 x:testcollection_shard1_replica_n2] o.a.s.c.SolrCore [[testcollection_shard1_replica_n2] ] Opening new SolrCore at [/home/jenkins/workspace/Lucene-Solr-master-Linux/solr/build/solr-core/test/J0/temp/solr.cloud.TestCollectionsAPIViaSolrCloudCluster_24D1FBB0306F6AC6-001/tempDir-001/node1/testcollection_shard1_replica_n2], dataDir=[/home/jenkins/workspace/Lucene-Solr-master-Linux/solr/build/solr-core/test/J0/temp/solr.cloud.TestCollectionsAPIViaSolrCloudCluster_24D1FBB0306F6AC6-001/tempDir-001/node1/./testcollection_shard1_replica_n2/data/]
[junit4] 2> 302887 INFO (qtp187003465-3020) [n:127.0.0.1:37699_solr c:testcollection s:shard2 r:core_node8 x:testcollection_shard2_replica_n4] o.a.s.c.SolrCore solr.RecoveryStrategy.Builder
[junit4] 2> 302887 INFO (qtp187003465-3020) [n:127.0.0.1:37699_solr c:testcollection s:shard2 r:core_node8 x:testcollection_shard2_replica_n4] o.a.s.c.SolrCore [[testcollection_shard2_replica_n4] ] Opening new SolrCore at [/home/jenkins/workspace/Lucene-Solr-master-Linux/solr/build/solr-core/test/J0/temp/solr.cloud.TestCollectionsAPIViaSolrCloudCluster_24D1FBB0306F6AC6-001/tempDir-001/node6/testcollection_shard2_replica_n4], dataDir=[/home/jenkins/workspace/Lucene-Solr-master-Linux/solr/build/solr-core/test/J0/temp/solr.cloud.TestCollectionsAPIViaSolrCloudCluster_24D1FBB0306F6AC6-001/tempDir-001/node6/./testcollection_shard2_replica_n4/data/]
[junit4] 2> 302959 INFO (qtp1172646673-2902) [n:127.0.0.1:35085_solr c:testcollection s:shard1 r:core_node6 x:testcollection_shard1_replica_n2] o.a.s.u.UpdateHandler Using UpdateLog implementation: org.apache.solr.update.UpdateLog
[junit4] 2> 302960 INFO (qtp1172646673-2902) [n:127.0.0.1:35085_solr c:testcollection s:shard1 r:core_node6 x:testcollection_shard1_replica_n2] o.a.s.u.UpdateLog Initializing UpdateLog: dataDir=null defaultSyncLevel=FLUSH numRecordsToKeep=100 maxNumLogsToKeep=10 numVersionBuckets=65536
[junit4] 2> 302961 INFO (qtp1172646673-2902) [n:127.0.0.1:35085_solr c:testcollection s:shard1 r:core_node6 x:testcollection_shard1_replica_n2] o.a.s.u.CommitTracker Hard AutoCommit: disabled
[junit4] 2> 302961 INFO (qtp1172646673-2902) [n:127.0.0.1:35085_solr c:testcollection s:shard1 r:core_node6 x:testcollection_shard1_replica_n2] o.a.s.u.CommitTracker Soft AutoCommit: disabled
[junit4] 2> 302962 INFO (qtp187003465-3020) [n:127.0.0.1:37699_solr c:testcollection s:shard2 r:core_node8 x:testcollection_shard2_replica_n4] o.a.s.u.UpdateHandler Using UpdateLog implementation: org.apache.solr.update.UpdateLog
[junit4] 2> 302962 INFO (qtp191499112-2899) [n:127.0.0.1:34069_solr c:testcollection s:shard2 r:core_node7 x:testcollection_shard2_replica_n3] o.a.s.u.UpdateHandler Using UpdateLog implementation: org.apache.solr.update.UpdateLog
[junit4] 2> 302963 INFO (qtp187003465-3020) [n:127.0.0.1:37699_solr c:testcollection s:shard2 r:core_node8 x:testcollection_shard2_replica_n4] o.a.s.u.UpdateLog Initializing UpdateLog: dataDir=null defaultSyncLevel=FLUSH numRecordsToKeep=100 maxNumLogsToKeep=10 numVersionBuckets=65536
[junit4] 2> 302963 INFO (qtp191499112-2899) [n:127.0.0.1:34069_solr c:testcollection s:shard2 r:core_node7 x:testcollection_shard2_replica_n3] o.a.s.u.UpdateLog Initializing UpdateLog: dataDir=null defaultSyncLevel=FLUSH numRecordsToKeep=100 maxNumLogsToKeep=10 numVersionBuckets=65536
[junit4] 2> 302963 INFO (qtp1172646673-2902) [n:127.0.0.1:35085_solr c:testcollection s:shard1 r:core_node6 x:testcollection_shard1_replica_n2] o.a.s.s.SolrIndexSearcher Opening [Searcher@4b40eabf[testcollection_shard1_replica_n2] main]
[junit4] 2> 302964 INFO (qtp191499112-2899) [n:127.0.0.1:34069_solr c:testcollection s:shard2 r:core_node7 x:testcollection_shard2_replica_n3] o.a.s.u.CommitTracker Hard AutoCommit: disabled
[junit4] 2> 302964 INFO (qtp187003465-3020) [n:127.0.0.1:37699_solr c:testcollection s:shard2 r:core_node8 x:testcollection_shard2_replica_n4] o.a.s.u.CommitTracker Hard AutoCommit: disabled
[junit4] 2> 302964 INFO (qtp191499112-2899) [n:127.0.0.1:34069_solr c:testcollection s:shard2 r:core_node7 x:testcollection_shard2_replica_n3] o.a.s.u.CommitTracker Soft AutoCommit: disabled
[junit4] 2> 302964 INFO (qtp187003465-3020) [n:127.0.0.1:37699_solr c:testcollection s:shard2 r:core_node8 x:testcollection_shard2_replica_n4] o.a.s.u.CommitTracker Soft AutoCommit: disabled
[junit4] 2> 302964 INFO (qtp2024517883-2925) [n:127.0.0.1:44885_solr c:testcollection s:shard1 r:core_node5 x:testcollection_shard1_replica_n1] o.a.s.u.UpdateHandler Using UpdateLog implementation: org.apache.solr.update.UpdateLog
[junit4] 2> 302964 INFO (qtp2024517883-2925) [n:127.0.0.1:44885_solr c:testcollection s:shard1 r:core_node5 x:testcollection_shard1_replica_n1] o.a.s.u.UpdateLog Initializing UpdateLog: dataDir=null defaultSyncLevel=FLUSH numRecordsToKeep=100 maxNumLogsToKeep=10 numVersionBuckets=65536
[junit4] 2> 302964 INFO (qtp1172646673-2902) [n:127.0.0.1:35085_solr c:testcollection s:shard1 r:core_node6 x:testcollection_shard1_replica_n2] o.a.s.r.ManagedResourceStorage Configured ZooKeeperStorageIO with znodeBase: /configs/solrCloudCollectionConfig
[junit4] 2> 302964 INFO (qtp1172646673-2902) [n:127.0.0.1:35085_solr c:testcollection s:shard1 r:core_node6 x:testcollection_shard1_replica_n2] o.a.s.r.ManagedResourceStorage Loaded null at path _rest_managed.json using ZooKeeperStorageIO:path=/configs/solrCloudCollectionConfig
[junit4] 2> 302965 INFO (qtp1172646673-2902) [n:127.0.0.1:35085_solr c:testcollection s:shard1 r:core_node6 x:testcollection_shard1_replica_n2] o.a.s.h.ReplicationHandler Commits will be reserved for 10000
[junit4] 2> 302965 INFO (qtp2024517883-2925) [n:127.0.0.1:44885_solr c:testcollection s:shard1 r:core_node5 x:testcollection_shard1_replica_n1] o.a.s.u.CommitTracker Hard AutoCommit: disabled
[junit4] 2> 302965 INFO (qtp2024517883-2925) [n:127.0.0.1:44885_solr c:testcollection s:shard1 r:core_node5 x:testcollection_shard1_replica_n1] o.a.s.u.CommitTracker Soft AutoCommit: disabled
[junit4] 2> 302965 INFO (qtp191499112-2899) [n:127.0.0.1:34069_solr c:testcollection s:shard2 r:core_node7 x:testcollection_shard2_replica_n3] o.a.s.s.SolrIndexSearcher Opening [Searcher@e56319c[testcollection_shard2_replica_n3] main]
[junit4] 2> 302966 INFO (searcherExecutor-1433-thread-1-processing-n:127.0.0.1:35085_solr x:testcollection_shard1_replica_n2 s:shard1 c:testcollection r:core_node6) [n:127.0.0.1:35085_solr c:testcollection s:shard1 r:core_node6 x:testcollection_shard1_replica_n2] o.a.s.c.SolrCore [testcollection_shard1_replica_n2] Registered new searcher Searcher@4b40eabf[testcollection_shard1_replica_n2] main{ExitableDirectoryReader(UninvertingDirectoryReader())}
[junit4] 2> 302966 INFO (qtp1172646673-2902) [n:127.0.0.1:35085_solr c:testcollection s:shard1 r:core_node6 x:testcollection_shard1_replica_n2] o.a.s.u.UpdateLog Could not find max version in index or recent updates, using new clock 1575439486108565504
[junit4] 2> 302966 INFO (qtp187003465-3020) [n:127.0.0.1:37699_solr c:testcollection s:shard2 r:core_node8 x:testcollection_shard2_replica_n4] o.a.s.s.SolrIndexSearcher Opening [Searcher@32319d2a[testcollection_shard2_replica_n4] main]
[junit4] 2> 302967 INFO (qtp187003465-3020) [n:127.0.0.1:37699_solr c:testcollection s:shard2 r:core_node8 x:testcollection_shard2_replica_n4] o.a.s.r.ManagedResourceStorage Configured ZooKeeperStorageIO with znodeBase: /configs/solrCloudCollectionConfig
[junit4] 2> 302967 INFO (qtp187003465-3020) [n:127.0.0.1:37699_solr c:testcollection s:shard2 r:core_node8 x:testcollection_shard2_replica_n4] o.a.s.r.ManagedResourceStorage Loaded null at path _rest_managed.json using ZooKeeperStorageIO:path=/configs/solrCloudCollectionConfig
[junit4] 2> 302967 INFO (qtp2024517883-2925) [n:127.0.0.1:44885_solr c:testcollection s:shard1 r:core_node5 x:testcollection_shard1_replica_n1] o.a.s.s.SolrIndexSearcher Opening [Searcher@140b0228[testcollection_shard1_replica_n1] main]
[junit4] 2> 302967 INFO (qtp191499112-2899) [n:127.0.0.1:34069_solr c:testcollection s:shard2 r:core_node7 x:testcollection_shard2_replica_n3] o.a.s.r.ManagedResourceStorage Configured ZooKeeperStorageIO with znodeBase: /configs/solrCloudCollectionConfig
[junit4] 2> 302967 INFO (qtp187003465-3020) [n:127.0.0.1:37699_solr c:testcollection s:shard2 r:core_node8 x:testcollection_shard2_replica_n4] o.a.s.h.ReplicationHandler Commits will be reserved for 10000
[junit4] 2> 302967 INFO (qtp191499112-2899) [n:127.0.0.1:34069_solr c:testcollection s:shard2 r:core_node7 x:testcollection_shard2_replica_n3] o.a.s.r.ManagedResourceStorage Loaded null at path _rest_managed.json using ZooKeeperStorageIO:path=/configs/solrCloudCollectionConfig
[junit4] 2> 302968 INFO (qtp2024517883-2925) [n:127.0.0.1:44885_solr c:testcollection s:shard1 r:core_node5 x:testcollection_shard1_replica_n1] o.a.s.r.ManagedResourceStorage Configured ZooKeeperStorageIO with znodeBase: /configs/solrCloudCollectionConfig
[junit4] 2> 302982 INFO (searcherExecutor-1434-thread-1-processing-n:127.0.0.1:37699_solr x:testcollection_shard2_replica_n4 s:shard2 c:testcollection r:core_node8) [n:127.0.0.1:37699_solr c:testcollection s:shard2 r:core_node8 x:testcollection_shard2_replica_n4] o.a.s.c.SolrCore [testcollection_shard2_replica_n4] Registered new searcher Searcher@32319d2a[testcollection_shard2_replica_n4] main{ExitableDirectoryReader(UninvertingDirectoryReader())}
[junit4] 2> 302982 INFO (qtp2024517883-2925) [n:127.0.0.1:44885_solr c:testcollection s:shard1 r:core_node5 x:testcollection_shard1_replica_n1] o.a.s.r.ManagedResourceStorage Loaded null at path _rest_managed.json using ZooKeeperStorageIO:path=/configs/solrCloudCollectionConfig
[junit4] 2> 302982 INFO (qtp187003465-3020) [n:127.0.0.1:37699_solr c:testcollection s:shard2 r:core_node8 x:testcollection_shard2_replica_n4] o.a.s.u.UpdateLog Could not find max version in index or recent updates, using new clock 1575439486125342720
[junit4] 2> 302983 INFO (qtp191499112-2899) [n:127.0.0.1:34069_solr c:testcollection s:shard2 r:core_node7 x:testcollection_shard2_replica_n3] o.a.s.h.ReplicationHandler Commits will be reserved for 10000
[junit4] 2> 302983 INFO (qtp1172646673-2902) [n:127.0.0.1:35085_solr c:testcollection s:shard1 r:core_node6 x:testcollection_shard1_replica_n2] o.a.s.c.ShardLeaderElectionContext Waiting until we see more replicas up for shard shard1: total=2 found=1 timeoutin=9999ms
[junit4] 2> 302983 INFO (searcherExecutor-1431-thread-1-processing-n:127.0.0.1:34069_solr x:testcollection_shard2_replica_n3 s:shard2 c:testcollection r:core_node7) [n:127.0.0.1:34069_solr c:testcollection s:shard2 r:core_node7 x:testcollection_shard2_replica_n3] o.a.s.c.SolrCore [testcollection_shard2_replica_n3] Registered new searcher Searcher@e56319c[testcollection_shard2_replica_n3] main{ExitableDirectoryReader(UninvertingDirectoryReader())}
[junit4] 2> 302983 INFO (qtp191499112-2899) [n:127.0.0.1:34069_solr c:testcollection s:shard2 r:core_node7 x:testcollection_shard2_replica_n3] o.a.s.u.UpdateLog Could not find max version in index or recent updates, using new clock 1575439486126391296
[junit4] 2> 302984 INFO (qtp2024517883-2925) [n:127.0.0.1:44885_solr c:testcollection s:shard1 r:core_node5 x:testcollection_shard1_replica_n1] o.a.s.h.ReplicationHandler Commits will be reserved for 10000
[junit4] 2> 302984 INFO (searcherExecutor-1432-thread-1-processing-n:127.0.0.1:44885_solr x:testcollection_shard1_replica_n1 s:shard1 c:testcollection r:core_node5) [n:127.0.0.1:44885_solr c:testcollection s:shard1 r:core_node5 x:testcollection_shard1_replica_n1] o.a.s.c.SolrCore [testcollection_shard1_replica_n1] Registered new searcher Searcher@140b0228[testcollection_shard1_replica_n1] main{ExitableDirectoryReader(UninvertingDirectoryReader())}
[junit4] 2> 302984 INFO (qtp2024517883-2925) [n:127.0.0.1:44885_solr c:testcollection s:shard1 r:core_node5 x:testcollection_shard1_replica_n1] o.a.s.u.UpdateLog Could not find max version in index or recent updates, using new clock 1575439486127439872
[junit4] 2> 302987 INFO (qtp191499112-2899) [n:127.0.0.1:34069_solr c:testcollection s:shard2 r:core_node7 x:testcollection_shard2_replica_n3] o.a.s.c.ShardLeaderElectionContext Enough replicas found to continue.
[junit4] 2> 302987 INFO (qtp191499112-2899) [n:127.0.0.1:34069_solr c:testcollection s:shard2 r:core_node7 x:testcollection_shard2_replica_n3] o.a.s.c.ShardLeaderElectionContext I may be the new leader - try and sync
[junit4] 2> 302987 INFO (qtp191499112-2899) [n:127.0.0.1:34069_solr c:testcollection s:shard2 r:core_node7 x:testcollection_shard2_replica_n3] o.a.s.c.SyncStrategy Sync replicas to http://127.0.0.1:34069/solr/testcollection_shard2_replica_n3/
[junit4] 2> 302988 INFO (qtp191499112-2899) [n:127.0.0.1:34069_solr c:testcollection s:shard2 r:core_node7 x:testcollection_shard2_replica_n3] o.a.s.u.PeerSync PeerSync: core=testcollection_shard2_replica_n3 url=http://127.0.0.1:34069/solr START replicas=[http://127.0.0.1:37699/solr/testcollection_shard2_replica_n4/] nUpdates=100
[junit4] 2> 302993 INFO (qtp187003465-3022) [n:127.0.0.1:37699_solr c:testcollection s:shard2 r:core_node8 x:testcollection_shard2_replica_n4] o.a.s.c.S.Request [testcollection_shard2_replica_n4] webapp=/solr path=/get params={distrib=false&qt=/get&fingerprint=false&getVersions=100&wt=javabin&version=2} status=0 QTime=0
[junit4] 2> 303089 INFO (zkCallback-462-thread-1-processing-n:127.0.0.1:35085_solr) [n:127.0.0.1:35085_solr ] o.a.s.c.c.ZkStateReader A cluster state change: [WatchedEvent state:SyncConnected type:NodeDataChanged path:/collections/testcollection/state.json] for collection [testcollection] has occurred - updating... (live nodes size: [5])
[junit4] 2> 303089 INFO (zkCallback-461-thread-1-processing-n:127.0.0.1:44885_solr) [n:127.0.0.1:44885_solr ] o.a.s.c.c.ZkStateReader A cluster state change: [WatchedEvent state:SyncConnected type:NodeDataChanged path:/collections/testcollection/state.json] for collection [testcollection] has occurred - updating... (live nodes size: [5])
[junit4] 2> 303089 INFO (zkCallback-460-thread-1-processing-n:127.0.0.1:34069_solr) [n:127.0.0.1:34069_solr ] o.a.s.c.c.ZkStateReader A cluster state change: [WatchedEvent state:SyncConnected type:NodeDataChanged path:/collections/testcollection/state.json] for collection [testcollection] has occurred - updating... (live nodes size: [5])
[junit4] 2> 303089 INFO (zkCallback-461-thread-2-processing-n:127.0.0.1:44885_solr) [n:127.0.0.1:44885_solr ] o.a.s.c.c.ZkStateReader A cluster state change: [WatchedEvent state:SyncConnected type:NodeDataChanged path:/collections/testcollection/state.json] for collection [testcollection] has occurred - updating... (live nodes size: [5])
[junit4] 2> 303089 INFO (zkCallback-460-thread-2-processing-n:127.0.0.1:34069_solr) [n:127.0.0.1:34069_solr ] o.a.s.c.c.ZkStateReader A cluster state change: [WatchedEvent state:SyncConnected type:NodeDataChanged path:/collections/testcollection/state.json] for collection [testcollection] has occurred - updating... (live nodes size: [5])
[junit4] 2> 303089 INFO (zkCallback-478-thread-1-processing-n:127.0.0.1:37699_solr) [n:127.0.0.1:37699_solr ] o.a.s.c.c.ZkStateReader A cluster state change: [WatchedEvent state:SyncConnected type:NodeDataChanged path:/collections/testcollection/state.json] for collection [testcollection] has occurred - updating... (live nodes size: [5])
[junit4] 2> 303089 INFO (zkCallback-462-thread-2-processing-n:127.0.0.1:35085_solr) [n:127.0.0.1:35085_solr ] o.a.s.c.c.ZkStateReader A cluster state change: [WatchedEvent state:SyncConnected type:NodeDataChanged path:/collections/testcollection/state.json] for collection [testcollection] has occurred - updating... (live nodes size: [5])
[junit4] 2> 303089 INFO (zkCallback-478-thread-2-processing-n:127.0.0.1:37699_solr) [n:127.0.0.1:37699_solr ] o.a.s.c.c.ZkStateReader A cluster state change: [WatchedEvent state:SyncConnected type:NodeDataChanged path:/collections/testcollection/state.json] for collection [testcollection] has occurred - updating... (live nodes size: [5])
[junit4] 2> 303288 INFO (qtp191499112-2899) [n:127.0.0.1:34069_solr c:testcollection s:shard2 r:core_node7 x:testcollection_shard2_replica_n3] o.a.s.u.PeerSync PeerSync: core=testcollection_shard2_replica_n3 url=http://127.0.0.1:34069/solr DONE. We have no versions. sync failed.
[junit4] 2> 303288 INFO (qtp191499112-2899) [n:127.0.0.1:34069_solr c:testcollection s:shard2 r:core_node7 x:testcollection_shard2_replica_n3] o.a.s.c.SyncStrategy Leader's attempt to sync with shard failed, moving to the next candidate
[junit4] 2> 303288 INFO (qtp191499112-2899) [n:127.0.0.1:34069_solr c:testcollection s:shard2 r:core_node7 x:testcollection_shard2_replica_n3] o.a.s.c.ShardLeaderElectionContext We failed sync, but we have no versions - we can't sync in that case - we were active before, so become leader anyway
[junit4] 2> 303288 INFO (qtp191499112-2899) [n:127.0.0.1:34069_solr c:testcollection s:shard2 r:core_node7 x:testcollection_shard2_replica_n3] o.a.s.c.ShardLeaderElectionContext Found all replicas participating in election, clear LIR
[junit4] 2> 303290 INFO (qtp191499112-2899) [n:127.0.0.1:34069_solr c:testcollection s:shard2 r:core_node7 x:testcollection_shard2_replica_n3] o.a.s.c.ShardLeaderElectionContext I am the new leader: http://127.0.0.1:34069/solr/testcollection_shard2_replica_n3/ shard2
[junit4] 2> 303391 INFO (zkCallback-462-thread-1-processing-n:127.0.0.1:35085_solr) [n:127.0.0.1:35085_solr ] o.a.s.c.c.ZkStateReader A cluster state change: [WatchedEvent state:SyncConnected type:NodeDataChanged path:/collections/testcollection/state.json] for collection [testcollection] has occurred - updating... (live nodes size: [5])
[junit4] 2> 303391 INFO (zkCallback-461-thread-2-processing-n:127.0.0.1:44885_solr) [n:127.0.0.1:44885_solr ] o.a.s.c.c.ZkStateReader A cluster state change: [WatchedEvent state:SyncConnected type:NodeDataChanged path:/collections/testcollection/state.json] for collection [testcollection] has occurred - updating... (live nodes size: [5])
[junit4] 2> 303391 INFO (zkCallback-460-thread-1-processing-n:127.0.0.1:34069_solr) [n:127.0.0.1:34069_solr ] o.a.s.c.c.ZkStateReader A cluster state change: [WatchedEvent state:SyncConnected type:NodeDataChanged path:/collections/testcollection/state.json] for collection [testcollection] has occurred - updating... (live nodes size: [5])
[junit4] 2> 303391 INFO (zkCallback-462-thread-2-processing-n:127.0.0.1:35085_solr) [n:127.0.0.1:35085_solr ] o.a.s.c.c.ZkStateReader A cluster state change: [WatchedEvent state:SyncConnected type:NodeDataChanged path:/collections/testcollection/state.json] for collection [testcollection] has occurred - updating... (live nodes size: [5])
[junit4] 2> 303392 INFO (zkCallback-478-thread-2-processing-n:127.0.0.1:37699_solr) [n:127.0.0.1:37699_solr ] o.a.s.c.c.ZkStateReader A cluster state change: [WatchedEvent state:SyncConnected type:NodeDataChanged path:/collections/testcollection/state.json] for collection [testcollection] has occurred - updating... (live nodes size: [5])
[junit4] 2> 303392 INFO (zkCallback-478-thread-1-processing-n:127.0.0.1:37699_solr) [n:127.0.0.1:37699_solr ] o.a.s.c.c.ZkStateReader A cluster state change: [WatchedEvent state:SyncConnected type:NodeDataChanged path:/collections/testcollection/state.json] for collection [testcollection] has occurred - updating... (live nodes size: [5])
[junit4] 2> 303391 INFO (zkCallback-460-thread-2-processing-n:127.0.0.1:34069_solr) [n:127.0.0.1:34069_solr ] o.a.s.c.c.ZkStateReader A cluster state change: [WatchedEvent state:SyncConnected type:NodeDataChanged path:/collections/testcollection/state.json] for collection [testcollection] has occurred - updating... (live nodes size: [5])
[junit4] 2> 303391 INFO (zkCallback-461-thread-1-processing-n:127.0.0.1:44885_solr) [n:127.0.0.1:44885_solr ] o.a.s.c.c.ZkStateReader A cluster state change: [WatchedEvent state:SyncConnected type:NodeDataChanged path:/collections/testcollection/state.json] for collection [testcollection] has occurred - updating... (live nodes size: [5])
[junit4] 2> 303441 INFO (qtp191499112-2899) [n:127.0.0.1:34069_solr c:testcollection s:shard2 r:core_node7 x:testcollection_shard2_replica_n3] o.a.s.c.ZkController I am the leader, no recovery necessary
[junit4] 2> 303442 INFO (qtp191499112-2899) [n:127.0.0.1:34069_solr c:testcollection s:shard2 r:core_node7 x:testcollection_shard2_replica_n3] o.a.s.s.HttpSolrCall [admin] webapp=null path=/admin/cores params={qt=/admin/cores&collection.configName=solrCloudCollectionConfig&newCollection=true&collection=testcollection&version=2&replicaType=NRT&coreNodeName=core_node7&name=testcollection_shard2_replica_n3&action=CREATE&numShards=2&shard=shard2&property.solr.directoryFactory=solr.StandardDirectoryFactory&wt=javabin} status=0 QTime=1635
[junit4] 2> 303483 INFO (qtp1172646673-2902) [n:127.0.0.1:35085_solr c:testcollection s:shard1 r:core_node6 x:testcollection_shard1_replica_n2] o.a.s.c.ShardLeaderElectionContext Enough replicas found to continue.
[junit4] 2> 303483 INFO (qtp1172646673-2902) [n:127.0.0.1:35085_solr c:testcollection s:shard1 r:core_node6 x:testcollection_shard1_replica_n2] o.a.s.c.ShardLeaderElectionContext I may be the new leader - try and sync
[junit4] 2> 303483 INFO (qtp1172646673-2902) [n:127.0.0.1:35085_solr c:testcollection s:shard1 r:core_node6 x:testcollection_shard1_replica_n2] o.a.s.c.SyncStrategy Sync replicas to http://127.0.0.1:35085/solr/testcollection_shard1_replica_n2/
[junit4] 2> 303484 INFO (qtp1172646673-2902) [n:127.0.0.1:35085_solr c:testcollection s:shard1 r:core_node6 x:testcollection_shard1_replica_n2] o.a.s.u.PeerSync PeerSync: core=testcollection_shard1_replica_n2 url=http://127.0.0.1:35085/solr START replicas=[http://127.0.0.1:44885/solr/testcollection_shard1_replica_n1/] nUpdates=100
[junit4] 2> 303489 INFO (qtp2024517883-2907) [n:127.0.0.1:44885_solr c:testcollection s:shard1 r:core_node5 x:testcollection_shard1_replica_n1] o.a.s.c.S.Request [testcollection_shard1_replica_n1] webapp=/solr path=/get params={distrib=false&qt=/get&fingerprint=false&getVersions=100&wt=javabin&version=2} status=0 QTime=0
[junit4] 2> 303543 INFO (zkCallback-478-thread-2-processing-n:127.0.0.1:37699_solr) [n:127.0.0.1:37699_solr ] o.a.s.c.c.ZkStateReader A cluster state change: [WatchedEvent state:SyncConnected type:NodeDataChanged path:/collections/testcollection/state.json] for collection [testcollection] has occurred - updating... (live nodes size: [5])
[junit4] 2> 303543 INFO (zkCallback-478-thread-1-processing-n:127.0.0.1:37699_solr) [n:127.0.0.1:37699_solr ] o.a.s.c.c.ZkStateReader A cluster state change: [WatchedEvent state:SyncConnected type:NodeDataChanged path:/collections/testcollection/state.json] for collection [testcollection] has occurred - updating... (live nodes size: [5])
[junit4] 2> 303543 INFO (zkCallback-462-thread-1-processing-n:127.0.0.1:35085_solr) [n:127.0.0.1:35085_solr ] o.a.s.c.c.ZkStateReader A cluster state change: [WatchedEvent state:SyncConnected type:NodeDataChanged path:/collections/testcollection/state.json] for collection [testcollection] has occurred - updating... (live nodes size: [5])
[junit4] 2> 303543 INFO (zkCallback-460-thread-1-processing-n:127.0.0.1:34069_solr) [n:127.0.0.1:34069_solr ] o.a.s.c.c.ZkStateReader A cluster state change: [WatchedEvent state:SyncConnected type:NodeDataChanged path:/collections/testcollection/state.json] for collection [testcollection] has occurred - updating... (live nodes size: [5])
[junit4] 2> 303543 INFO (zkCallback-461-thread-2-processing-n:127.0.0.1:44885_solr) [n:127.0.0.1:44885_solr ] o.a.s.c.c.ZkStateReader A cluster state change: [WatchedEvent state:SyncConnected type:NodeDataChanged path:/collections/testcollection/state.json] for collection [testcollection] has occurred - updating... (live nodes size: [5])
[junit4] 2> 303543 INFO (zkCallback-460-thread-2-processing-n:127.0.0.1:34069_solr) [n:127.0.0.1:34069_solr ] o.a.s.c.c.ZkStateReader A cluster state change: [WatchedEvent state:SyncConnected type:NodeDataChanged path:/collections/testcollection/state.json] for collection [testcollection] has occurred - updating... (live nodes size: [5])
[junit4] 2> 303543 INFO (zkCallback-461-thread-1-processing-n:127.0.0.1:44885_solr) [n:127.0.0.1:44885_solr ] o.a.s.c.c.ZkStateReader A cluster state change: [WatchedEvent state:SyncConnected type:NodeDataChanged path:/collections/testcollection/state.json] for collection [testcollection] has occurred - updating... (live nodes size: [5])
[junit4] 2> 303543 INFO (zkCallback-462-thread-2-processing-n:127.0.0.1:35085_solr) [n:127.0.0.1:35085_solr ] o.a.s.c.c.ZkStateReader A cluster state change: [WatchedEvent state:SyncConnected type:NodeDataChanged path:/collections/testcollection/state.json] for collection [testcollection] has occurred - updating... (live nodes size: [5])
[junit4] 2> 303784 INFO (qtp1172646673-2902) [n:127.0.0.1:35085_solr c:testcollection s:shard1 r:core_node6 x:testcollection_shard1_replica_n2] o.a.s.u.PeerSync PeerSync: core=testcollection_shard1_replica_n2 url=http://127.0.0.1:35085/solr DONE. We have no versions. sync failed.
[junit4] 2> 303784 INFO (qtp1172646673-2902) [n:127.0.0.1:35085_solr c:testcollection s:shard1 r:core_node6 x:testcollection_shard1_replica_n2] o.a.s.c.SyncStrategy Leader's attempt to sync with shard failed, moving to the next candidate
[junit4] 2> 303784 INFO (qtp1172646673-2902) [n:127.0.0.1:35085_solr c:testcollection s:shard1 r:core_node6 x:testcollection_shard1_replica_n2] o.a.s.c.ShardLeaderElectionContext We failed sync, but we have no versions - we can't sync in that case - we were active before, so become leader anyway
[junit4] 2> 303784 INFO (qtp1172646673-2902) [n:127.0.0.1:35085_solr c:testcollection s:shard1 r:core_node6 x:testcollection_shard1_replica_n2] o.a.s.c.ShardLeaderElectionContext Found all replicas participating in election, clear LIR
[junit4] 2> 303786 INFO (qtp1172646673-2902) [n:127.0.0.1:35085_solr c:testcollection s:shard1 r:core_node6 x:testcollection_shard1_replica_n2] o.a.s.c.ShardLeaderElectionContext I am the new leader: http://127.0.0.1:35085/solr/testcollection_shard1_replica_n2/ shard1
[junit4] 2> 303887 INFO (zkCallback-462-thread-1-processing-n:127.0.0.1:35085_solr) [n:127.0.0.1:35085_solr ] o.a.s.c.c.ZkStateReader A cluster state change: [WatchedEvent state:SyncConnected type:NodeDataChanged path:/collections/testcollection/state.json] for collection [testcollection] has occurred - updating... (live nodes size: [5])
[junit4] 2> 303887 INFO (zkCallback-462-thread-2-processing-n:127.0.0.1:35085_solr) [n:127.0.0.1:35085_solr ] o.a.s.c.c.ZkStateReader A cluster state change: [WatchedEvent state:SyncConnected type:NodeDataChanged path:/collections/testcollection/state.json] for collection [testcollection] has occurred - updating... (live nodes size: [5])
[junit4] 2> 303887 INFO (zkCallback-461-thread-2-processing-n:127.0.0.1:44885_solr) [n:127.0.0.1:44885_solr ] o.a.s.c.c.ZkStateReader A cluster state change: [WatchedEvent state:SyncConnected type:NodeDataChanged path:/collections/testcollection/state.json] for collection [testcollection] has occurred - updating... (live nodes size: [5])
[junit4] 2> 303887 INFO (zkCallback-460-thread-2-processing-n:127.0.0.1:34069_solr) [n:127.0.0.1:34069_solr ] o.a.s.c.c.ZkStateReader A cluster state change: [WatchedEvent state:SyncConnected type:NodeDataChanged path:/collections/testcollection/state.json] for collection [testcollection] has occurred - updating... (live nodes size: [5])
[junit4] 2> 303887 INFO (zkCallback-460-thread-1-processing-n:127.0.0.1:34069_solr) [n:127.0.0.1:34069_solr ] o.a.s.c.c.ZkStateReader A cluster state change: [WatchedEvent state:SyncConnected type:NodeDataChanged path:/collections/testcollection/state.json] for collection [testcollection] has occurred - updating... (live nodes size: [5])
[junit4] 2> 303887 INFO (zkCallback-478-thread-1-processing-n:127.0.0.1:37699_solr) [n:127.0.0.1:37699_solr ] o.a.s.c.c.ZkStateReader A cluster state change: [WatchedEvent state:SyncConnected type:NodeDataChanged path:/collections/testcollection/state.json] for collection [testcollection] has occurred - updating... (live nodes size: [5])
[junit4] 2> 303887 INFO (zkCallback-478-thread-2-processing-n:127.0.0.1:37699_solr) [n:127.0.0.1:37699_solr ] o.a.s.c.c.ZkStateReader A cluster state change: [WatchedEvent state:SyncConnected type:NodeDataChanged path:/collections/testcollection/state.json] for collection [testcollection] has occurred - updating... (live nodes size: [5])
[junit4] 2> 303887 INFO (zkCallback-461-thread-1-processing-n:127.0.0.1:44885_solr) [n:127.0.0.1:44885_solr ] o.a.s.c.c.ZkStateReader A cluster state change: [WatchedEvent state:SyncConnected type:NodeDataChanged path:/collections/testcollection/state.json] for collection [testcollection] has occurred - updating... (live nodes size: [5])
[junit4] 2> 303936 INFO (qtp1172646673-2902) [n:127.0.0.1:35085_solr c:testcollection s:shard1 r:core_node6 x:testcollection_shard1_replica_n2] o.a.s.c.ZkController I am the leader, no recovery necessary
[junit4] 2> 303937 INFO (qtp1172646673-2902) [n:127.0.0.1:35085_solr c:testcollection s:shard1 r:core_node6 x:testcollection_shard1_replica_n2] o.a.s.s.HttpSolrCall [admin] webapp=null path=/admin/cores params={qt=/admin/cores&collection.configName=solrCloudCollectionConfig&newCollection=true&collection=testcollection&version=2&replicaType=NRT&coreNodeName=core_node6&name=testcollection_shard1_replica_n2&action=CREATE&numShards=2&shard=shard1&property.solr.directoryFactory=solr.StandardDirectoryFactory&wt=javabin} status=0 QTime=2130
[junit4] 2> 303989 INFO (qtp187003465-3020) [n:127.0.0.1:37699_solr c:testcollection s:shard2 r:core_node8 x:testcollection_shard2_replica_n4] o.a.s.s.HttpSolrCall [admin] webapp=null path=/admin/cores params={qt=/admin/cores&collection.configName=solrCloudCollectionConfig&newCollection=true&collection=testcollection&version=2&replicaType=NRT&coreNodeName=core_node8&name=testcollection_shard2_replica_n4&action=CREATE&numShards=2&shard=shard2&property.solr.directoryFactory=solr.StandardDirectoryFactory&wt=javabin} status=0 QTime=2183
[junit4] 2> 303989 INFO (qtp2024517883-2925) [n:127.0.0.1:44885_solr c:testcollection s:shard1 r:core_node5 x:testcollection_shard1_replica_n1] o.a.s.s.HttpSolrCall [admin] webapp=null path=/admin/cores params={qt=/admin/cores&collection.configName=solrCloudCollectionConfig&newCo
[...truncated too long message...]
hread-2-processing-n:127.0.0.1:34081_) [n:127.0.0.1:34081_ c:collection1 s:shard2 r:core_node46 x:collection1_shard2_replica_t45] o.a.s.c.SolrCore [collection1_shard2_replica_t45] CLOSING SolrCore org.apache.solr.core.SolrCore@74f84890
[junit4] 2> 1600969 INFO (zkCallback-1815-thread-2-processing-n:127.0.0.1:34081_) [n:127.0.0.1:34081_ c:collection1 s:shard2 r:core_node46 x:collection1_shard2_replica_t45] o.a.s.m.SolrMetricManager Closing metric reporters for registry=solr.core.collection1.shard2.replica_t45, tag=1962428560
[junit4] 2> 1600972 INFO (zkCallback-1815-thread-2-processing-n:127.0.0.1:34081_) [n:127.0.0.1:34081_ c:collection1 s:shard2 r:core_node46 x:collection1_shard2_replica_t45] o.a.s.m.SolrMetricManager Closing metric reporters for registry=solr.collection.collection1.shard2.leader, tag=1962428560
[junit4] 2> 1600973 INFO (TEST-ForceLeaderTest.testReplicasInLIRNoLeader-seed#[24D1FBB0306F6AC6]) [ ] o.e.j.s.AbstractConnector Stopped ServerConnector@b871b27{HTTP/1.1,[http/1.1]}{127.0.0.1:0}
[junit4] 2> 1600973 INFO (TEST-ForceLeaderTest.testReplicasInLIRNoLeader-seed#[24D1FBB0306F6AC6]) [ ] o.e.j.s.h.ContextHandler Stopped o.e.j.s.ServletContextHandler@1e8796e1{/,null,UNAVAILABLE}
[junit4] 2> 1600973 ERROR (TEST-ForceLeaderTest.testReplicasInLIRNoLeader-seed#[24D1FBB0306F6AC6]) [ ] o.a.z.s.ZooKeeperServer ZKShutdownHandler is not registered, so ZooKeeper server won't take any action on ERROR or SHUTDOWN server state changes
[junit4] 2> 1600973 INFO (TEST-ForceLeaderTest.testReplicasInLIRNoLeader-seed#[24D1FBB0306F6AC6]) [ ] o.a.s.c.ZkTestServer connecting to 127.0.0.1:45499 45499
[junit4] 2> 1606105 INFO (Thread-7987) [ ] o.a.s.c.ZkTestServer connecting to 127.0.0.1:45499 45499
[junit4] 2> 1606106 WARN (Thread-7987) [ ] o.a.s.c.ZkTestServer Watch limit violations:
[junit4] 2> Maximum concurrent create/delete watches above limit:
[junit4] 2>
[junit4] 2> 6 /solr/aliases.json
[junit4] 2> 4 /solr/security.json
[junit4] 2> 4 /solr/configs/conf1
[junit4] 2>
[junit4] 2> Maximum concurrent data watches above limit:
[junit4] 2>
[junit4] 2> 6 /solr/clusterprops.json
[junit4] 2> 6 /solr/clusterstate.json
[junit4] 2> 3 /solr/collections/forceleader_test_collection/state.json
[junit4] 2> 3 /solr/collections/collection1/state.json
[junit4] 2>
[junit4] 2> Maximum concurrent children watches above limit:
[junit4] 2>
[junit4] 2> 6 /solr/live_nodes
[junit4] 2> 6 /solr/collections
[junit4] 2> 3 /solr/overseer/queue
[junit4] 2> 3 /solr/overseer/collection-queue-work
[junit4] 2> 2 /solr/overseer/queue-work
[junit4] 2>
[junit4] 2> 1606106 WARN (TEST-ForceLeaderTest.testReplicasInLIRNoLeader-seed#[24D1FBB0306F6AC6]) [ ] o.a.s.c.SocketProxy Closing 0 connections to: http://127.0.0.1:38021/, target: http://127.0.0.1:36277/
[junit4] 2> 1606106 WARN (TEST-ForceLeaderTest.testReplicasInLIRNoLeader-seed#[24D1FBB0306F6AC6]) [ ] o.a.s.c.SocketProxy Closing 1 connections to: http://127.0.0.1:34081/, target: http://127.0.0.1:43993/
[junit4] 2> 1606106 WARN (TEST-ForceLeaderTest.testReplicasInLIRNoLeader-seed#[24D1FBB0306F6AC6]) [ ] o.a.s.c.SocketProxy Closing 13 connections to: http://127.0.0.1:37079/, target: http://127.0.0.1:46199/
[junit4] 2> 1606106 WARN (TEST-ForceLeaderTest.testReplicasInLIRNoLeader-seed#[24D1FBB0306F6AC6]) [ ] o.a.s.c.SocketProxy Closing 2 connections to: http://127.0.0.1:35913/, target: http://127.0.0.1:44083/
[junit4] 2> NOTE: reproduce with: ant test -Dtestcase=ForceLeaderTest -Dtests.method=testReplicasInLIRNoLeader -Dtests.seed=24D1FBB0306F6AC6 -Dtests.multiplier=3 -Dtests.slow=true -Dtests.locale=it -Dtests.timezone=America/Indiana/Vevay -Dtests.asserts=true -Dtests.file.encoding=US-ASCII
[junit4] FAILURE 62.2s J0 | ForceLeaderTest.testReplicasInLIRNoLeader <<<
[junit4] > Throwable #1: java.lang.AssertionError: Doc with id=1 not found in http://127.0.0.1:37079/forceleader_test_collection due to: Path not found: /id; rsp={doc=null}
[junit4] > at __randomizedtesting.SeedInfo.seed([24D1FBB0306F6AC6:C246CF7009ED93A7]:0)
[junit4] > at org.apache.solr.cloud.HttpPartitionTest.assertDocExists(HttpPartitionTest.java:603)
[junit4] > at org.apache.solr.cloud.HttpPartitionTest.assertDocsExistInAllReplicas(HttpPartitionTest.java:556)
[junit4] > at org.apache.solr.cloud.ForceLeaderTest.testReplicasInLIRNoLeader(ForceLeaderTest.java:142)
[junit4] > at org.apache.solr.BaseDistributedSearchTestCase$ShardsRepeatRule$ShardsFixedStatement.callStatement(BaseDistributedSearchTestCase.java:993)
[junit4] > at org.apache.solr.BaseDistributedSearchTestCase$ShardsRepeatRule$ShardsStatement.evaluate(BaseDistributedSearchTestCase.java:968)
[junit4] > at java.lang.Thread.run(Thread.java:748)
[junit4] 2> NOTE: leaving temporary files on disk at: /home/jenkins/workspace/Lucene-Solr-master-Linux/solr/build/solr-core/test/J0/temp/solr.cloud.ForceLeaderTest_24D1FBB0306F6AC6-001
[junit4] 2> NOTE: test params are: codec=Asserting(Lucene70): {multiDefault=PostingsFormat(name=LuceneVarGapDocFreqInterval), a_t=PostingsFormat(name=Memory), id=PostingsFormat(name=LuceneVarGapFixedInterval), text=TestBloomFilteredLucenePostings(BloomFilteringPostingsFormat(Lucene50(blocksize=128)))}, docValues:{range_facet_l_dv=DocValuesFormat(name=Lucene70), _version_=DocValuesFormat(name=Memory), intDefault=DocValuesFormat(name=Memory), id_i1=DocValuesFormat(name=Lucene70), range_facet_i_dv=DocValuesFormat(name=Memory), intDvoDefault=DocValuesFormat(name=Asserting), range_facet_l=DocValuesFormat(name=Memory), timestamp=DocValuesFormat(name=Memory)}, maxPointsInLeafNode=406, maxMBSortInHeap=6.872523355047335, sim=RandomSimilarity(queryNorm=false): {}, locale=it, timezone=America/Indiana/Vevay
[junit4] 2> NOTE: Linux 4.10.0-27-generic amd64/Oracle Corporation 1.8.0_144 (64-bit)/cpus=8,threads=1,free=259092576,total=518979584
[junit4] 2> NOTE: All tests run in this JVM: [TestConfigSetsAPIZkFailure, BlockCacheTest, TestSlowCompositeReaderWrapper, TestPullReplica, TestSystemCollAutoCreate, TestShardHandlerFactory, TestLMDirichletSimilarityFactory, TestIBSimilarityFactory, SolrCoreTest, SolrCloudExampleTest, TestWriterPerf, TestSchemaSimilarityResource, TestStressUserVersions, TestSolrCloudWithDelegationTokens, SparseHLLTest, IndexBasedSpellCheckerTest, SolrIndexSplitterTest, CoreAdminCreateDiscoverTest, TestImpersonationWithHadoopAuth, TestCSVResponseWriter, DistributedQueryComponentCustomSortTest, TestRealTimeGet, DocumentAnalysisRequestHandlerTest, PreAnalyzedUpdateProcessorTest, HttpSolrCallGetCoreTest, TestLegacyNumericUtils, CollectionStateFormat2Test, TestLeaderInitiatedRecoveryThread, CollectionsAPISolrJTest, TestCSVLoader, TestHighlightDedupGrouping, BJQParserTest, ConnectionManagerTest, TestCollectionsAPIViaSolrCloudCluster, TestHdfsUpdateLog, TestRandomCollapseQParserPlugin, TestReplicationHandler, TestDistributedSearch, TestExtendedDismaxParser, TestXmlQParserPlugin, TestLazyCores, TestCloudPivotFacet, TestFastOutputStream, DistributedQueryElevationComponentTest, DocExpirationUpdateProcessorFactoryTest, SolrMetricsIntegrationTest, BaseCdcrDistributedZkTest, DefaultValueUpdateProcessorTest, PreAnalyzedFieldManagedSchemaCloudTest, TestSubQueryTransformerCrossCore, TlogReplayBufferedWhileIndexingTest, TestRandomRequestDistribution, TestFieldCollectionResource, FacetPivotSmallTest, RequestHandlersTest, TestManagedResourceStorage, HdfsWriteToMultipleCollectionsTest, TestBinaryResponseWriter, TestSolrQueryResponse, ZkNodePropsTest, UUIDFieldTest, JavabinLoaderTest, TestQuerySenderNoQuery, TestIndexingPerformance, TestRTimerTree, TestConfigSets, ExternalFileFieldSortTest, TestMinMaxOnMultiValuedField, BigEndianAscendingWordSerializerTest, TestFaceting, PluginInfoTest, TestLRUStatsCache, SolrIndexConfigTest, TestStressLucene, TestPerFieldSimilarityWithDefaultOverride, TestManagedSchemaAPI, SyncSliceTest, TestPhraseSuggestions, TestGeoJSONResponseWriter, TestUninvertingReader, TestRecoveryHdfs, CdcrReplicationHandlerTest, TestHttpShardHandlerFactory, ShufflingReplicaListTransformerTest, SpellCheckCollatorTest, RuleEngineTest, SynonymTokenizerTest, ClassificationUpdateProcessorIntegrationTest, OpenExchangeRatesOrgProviderTest, TestComponentsName, SolrShardReporterTest, TestMultiWordSynonyms, HdfsRecoveryZkTest, TestBinaryField, DocValuesMissingTest, ChaosMonkeyNothingIsSafeTest, PKIAuthenticationIntegrationTest, FieldMutatingUpdateProcessorTest, InfoHandlerTest, TestInitParams, SuggesterWFSTTest, TestUseDocValuesAsStored2, OverseerTaskQueueTest, CursorMarkTest, CleanupOldIndexTest, TestDistribDocBasedVersion, DistributedSpellCheckComponentTest, HdfsDirectoryTest, TestFieldTypeResource, LeaderInitiatedRecoveryOnCommitTest, TestPayloadCheckQParserPlugin, TestGraphTermsQParserPlugin, TestNumericRangeQuery32, ZkStateReaderTest, TestMacros, XmlUpdateRequestHandlerTest, AtomicUpdateProcessorFactoryTest, RestartWhileUpdatingTest, CollectionsAPIDistributedZkTest, BasicZkTest, FullSolrCloudDistribCmdsTest, TestZkChroot, TestRandomDVFaceting, TestJoin, SpellCheckComponentTest, BadIndexSchemaTest, ConvertedLegacyTest, TestSort, TestFunctionQuery, BasicFunctionalityTest, DirectUpdateHandlerTest, TestBadConfig, SoftAutoCommitTest, TestLuceneMatchVersion, TestPerFieldSimilarity, TestBM25SimilarityFactory, TimeZoneUtilsTest, DateMathParserTest, TestSuggestSpellingConverter, TestSolrJ, TestUtils, SolrTestCaseJ4Test, TestCrossCoreJoin, TestDistributedMissingSort, ActionThrottleTest, AssignBackwardCompatibilityTest, CollectionReloadTest, CollectionTooManyReplicasTest, CollectionsAPIAsyncDistributedZkTest, DistribCursorPagingTest, ForceLeaderTest]
[junit4] Completed [525/729 (2!)] on J0 in 130.43s, 3 tests, 1 failure, 1 skipped <<< FAILURES!
[...truncated 43935 lines...]