You are viewing a plain text version of this content. The canonical link for it is here.
Posted to commits@openjpa.apache.org by Apache Jenkins Server <je...@builds.apache.org> on 2012/12/12 07:50:41 UTC

Build failed in Jenkins: OpenJPA-trunk-deploy #348

See <https://builds.apache.org/job/OpenJPA-trunk-deploy/348/changes>

Changes:

[ppoddar] OPENJPA-2305: Change inheritance hierarchy of generated canonical metamodel

[ppoddar] OPENJPA-2304: Protect the expressin list for concurrent access

------------------------------------------
[...truncated 463 lines...]
Results :

Tests run: 21, Failures: 0, Errors: 0, Skipped: 0

[JENKINS] Recording test results
[INFO] [jar:jar {execution: default-jar}]
[INFO] Building jar: <https://builds.apache.org/job/OpenJPA-trunk-deploy/ws/trunk/openjpa-jdbc/target/openjpa-jdbc-2.3.0-SNAPSHOT.jar>
[INFO] [jar:jar {execution: default-jar}]
[INFO] [jar:test-jar {execution: attach-tests}]
[INFO] Building jar: <https://builds.apache.org/job/OpenJPA-trunk-deploy/ws/trunk/openjpa-jdbc/target/openjpa-jdbc-2.3.0-SNAPSHOT-tests.jar>
[INFO] [ianal:verify-legal-files {execution: default}]
[INFO] Checking legal files in: openjpa-jdbc-2.3.0-SNAPSHOT.jar
[INFO] Checking legal files in: openjpa-jdbc-2.3.0-SNAPSHOT-tests.jar
[INFO] [apache-rat:check {execution: default}]
[INFO] Exclude: **/.*/**
[INFO] Exclude: **/target/**/*
[INFO] [install:install {execution: default-install}]
[INFO] Installing <https://builds.apache.org/job/OpenJPA-trunk-deploy/ws/trunk/openjpa-jdbc/target/openjpa-jdbc-2.3.0-SNAPSHOT.jar> to /home/hudson/hudson-slave/maven-repositories/1/org/apache/openjpa/openjpa-jdbc/2.3.0-SNAPSHOT/openjpa-jdbc-2.3.0-SNAPSHOT.jar
[INFO] Installing <https://builds.apache.org/job/OpenJPA-trunk-deploy/ws/trunk/openjpa-jdbc/target/openjpa-jdbc-2.3.0-SNAPSHOT-tests.jar> to /home/hudson/hudson-slave/maven-repositories/1/org/apache/openjpa/openjpa-jdbc/2.3.0-SNAPSHOT/openjpa-jdbc-2.3.0-SNAPSHOT-tests.jar
[INFO] [deploy:deploy {execution: default-deploy}]
[INFO] Retrieving previous build number from apache.snapshots.https
[WARNING] *** CHECKSUM FAILED - Checksum failed on download: local = 'e3bbc288ae24d33c27b3418d8fb040998d195fd0'; remote = '041ab3acb56120a3c2294e3966ffbb60981ec232' - RETRYING
[WARNING] *** CHECKSUM FAILED - Checksum failed on download: local = 'e3bbc288ae24d33c27b3418d8fb040998d195fd0'; remote = '041ab3acb56120a3c2294e3966ffbb60981ec232' - IGNORING
Uploading: https://repository.apache.org/content/repositories/snapshots/org/apache/openjpa/openjpa-jdbc/2.3.0-SNAPSHOT/openjpa-jdbc-2.3.0-20121212.064817-99.jar
1387K uploaded  (openjpa-jdbc-2.3.0-20121212.064817-99.jar)
[INFO] Uploading project information for openjpa-jdbc 2.3.0-20121212.064817-99
[INFO] Retrieving previous metadata from apache.snapshots.https
[INFO] Uploading repository metadata for: 'artifact org.apache.openjpa:openjpa-jdbc'
[INFO] Retrieving previous metadata from apache.snapshots.https
[WARNING] *** CHECKSUM FAILED - Checksum failed on download: local = 'e3bbc288ae24d33c27b3418d8fb040998d195fd0'; remote = '041ab3acb56120a3c2294e3966ffbb60981ec232' - RETRYING
[WARNING] *** CHECKSUM FAILED - Checksum failed on download: local = 'e3bbc288ae24d33c27b3418d8fb040998d195fd0'; remote = '041ab3acb56120a3c2294e3966ffbb60981ec232' - IGNORING
[INFO] Uploading repository metadata for: 'snapshot org.apache.openjpa:openjpa-jdbc:2.3.0-SNAPSHOT'
[INFO] Retrieving previous build number from apache.snapshots.https
Uploading: https://repository.apache.org/content/repositories/snapshots/org/apache/openjpa/openjpa-jdbc/2.3.0-SNAPSHOT/openjpa-jdbc-2.3.0-20121212.064817-99-tests.jar
41K uploaded  (openjpa-jdbc-2.3.0-20121212.064817-99-tests.jar)
[JENKINS] Archiving <https://builds.apache.org/job/OpenJPA-trunk-deploy/ws/trunk/openjpa-jdbc/pom.xml> to /home/hudson/hudson/jobs/OpenJPA-trunk-deploy/modules/org.apache.openjpa$openjpa-jdbc/builds/2012-12-12_06-46-42/archive/org.apache.openjpa/openjpa-jdbc/2.3.0-SNAPSHOT/openjpa-jdbc-2.3.0-SNAPSHOT.pom
[JENKINS] Archiving <https://builds.apache.org/job/OpenJPA-trunk-deploy/ws/trunk/openjpa-jdbc/target/openjpa-jdbc-2.3.0-SNAPSHOT.jar> to /home/hudson/hudson/jobs/OpenJPA-trunk-deploy/modules/org.apache.openjpa$openjpa-jdbc/builds/2012-12-12_06-46-42/archive/org.apache.openjpa/openjpa-jdbc/2.3.0-20121212.064817-99/openjpa-jdbc-2.3.0-20121212.064817-99.jar
[JENKINS] Archiving <https://builds.apache.org/job/OpenJPA-trunk-deploy/ws/trunk/openjpa-jdbc/target/openjpa-jdbc-2.3.0-SNAPSHOT-tests.jar> to /home/hudson/hudson/jobs/OpenJPA-trunk-deploy/modules/org.apache.openjpa$openjpa-jdbc/builds/2012-12-12_06-46-42/archive/org.apache.openjpa/openjpa-jdbc/2.3.0-20121212.064817-99/openjpa-jdbc-2.3.0-20121212.064817-99-tests.jar
[INFO] ------------------------------------------------------------------------
[INFO] Building OpenJPA Persistence
[INFO]    task-segment: [clean, deploy]
[INFO] ------------------------------------------------------------------------
[INFO] [clean:clean {execution: default-clean}]
[INFO] Deleting file set: <https://builds.apache.org/job/OpenJPA-trunk-deploy/ws/trunk/openjpa-persistence/target> (included: [**], excluded: [])
[INFO] [buildnumber:create {execution: default}]
[INFO] [enforcer:enforce {execution: default}]
[INFO] [checkstyle:checkstyle {execution: default}]
[INFO] Starting audit...
Audit done.

[WARNING] Unable to locate Source XRef to link to - DISABLED
[INFO] [remote-resources:process {execution: default}]
[INFO] [resources:resources {execution: default-resources}]
[INFO] Using 'UTF-8' encoding to copy filtered resources.
[INFO] Copying 14 resources
[INFO] Copying 3 resources
[INFO] [compiler:compile {execution: default-compile}]
[INFO] Compiling 233 source files to <https://builds.apache.org/job/OpenJPA-trunk-deploy/ws/trunk/openjpa-persistence/target/classes>
[INFO] [compiler:testCompile {execution: test-source-compile}]
[INFO] Compiling 2 source files to <https://builds.apache.org/job/OpenJPA-trunk-deploy/ws/trunk/openjpa-persistence/target/test-classes>
[INFO] [resources:testResources {execution: default-testResources}]
[INFO] Using 'UTF-8' encoding to copy filtered resources.
[INFO] Copying 3 resources
[INFO] Copying 3 resources
[INFO] [compiler:testCompile {execution: default-testCompile}]
[INFO] Nothing to compile - all classes are up to date
[WARNING] DEPRECATED [systemProperties]: Use systemPropertyVariables instead.
[INFO] [surefire:test {execution: default-test}]
[INFO] Surefire report directory: <https://builds.apache.org/job/OpenJPA-trunk-deploy/ws/trunk/openjpa-persistence/target/surefire-reports>

-------------------------------------------------------
 T E S T S
-------------------------------------------------------
Running org.apache.openjpa.persistence.TestEnumToKernelConstantMappings
Tests run: 7, Failures: 0, Errors: 0, Skipped: 0, Time elapsed: 0.032 sec
Running org.apache.openjpa.persistence.TestPersistenceProductDerivation
Tests run: 5, Failures: 0, Errors: 0, Skipped: 0, Time elapsed: 0.308 sec

Results :

Tests run: 12, Failures: 0, Errors: 0, Skipped: 0

[JENKINS] Recording test results
[INFO] [jar:jar {execution: default-jar}]
[INFO] Building jar: <https://builds.apache.org/job/OpenJPA-trunk-deploy/ws/trunk/openjpa-persistence/target/openjpa-persistence-2.3.0-SNAPSHOT.jar>
[INFO] [jar:jar {execution: default-jar}]
[INFO] [jar:test-jar {execution: attach-tests}]
[INFO] Building jar: <https://builds.apache.org/job/OpenJPA-trunk-deploy/ws/trunk/openjpa-persistence/target/openjpa-persistence-2.3.0-SNAPSHOT-tests.jar>
[INFO] [ianal:verify-legal-files {execution: default}]
[INFO] Checking legal files in: openjpa-persistence-2.3.0-SNAPSHOT.jar
[INFO] Checking legal files in: openjpa-persistence-2.3.0-SNAPSHOT-tests.jar
[INFO] [apache-rat:check {execution: default}]
[INFO] Exclude: **/.*/**
[INFO] Exclude: **/target/**/*
[INFO] [install:install {execution: default-install}]
[INFO] Installing <https://builds.apache.org/job/OpenJPA-trunk-deploy/ws/trunk/openjpa-persistence/target/openjpa-persistence-2.3.0-SNAPSHOT.jar> to /home/hudson/hudson-slave/maven-repositories/1/org/apache/openjpa/openjpa-persistence/2.3.0-SNAPSHOT/openjpa-persistence-2.3.0-SNAPSHOT.jar
[INFO] Installing <https://builds.apache.org/job/OpenJPA-trunk-deploy/ws/trunk/openjpa-persistence/target/openjpa-persistence-2.3.0-SNAPSHOT-tests.jar> to /home/hudson/hudson-slave/maven-repositories/1/org/apache/openjpa/openjpa-persistence/2.3.0-SNAPSHOT/openjpa-persistence-2.3.0-SNAPSHOT-tests.jar
[INFO] [deploy:deploy {execution: default-deploy}]
[INFO] Retrieving previous build number from apache.snapshots.https
[WARNING] *** CHECKSUM FAILED - Checksum failed on download: local = 'e98cbee0f56874980b766e23d29a98251aadbb4d'; remote = 'ddb5967ae26f08924bdad2c2d8c8e5a42a8053a8' - RETRYING
[WARNING] *** CHECKSUM FAILED - Checksum failed on download: local = 'e98cbee0f56874980b766e23d29a98251aadbb4d'; remote = 'ddb5967ae26f08924bdad2c2d8c8e5a42a8053a8' - IGNORING
Uploading: https://repository.apache.org/content/repositories/snapshots/org/apache/openjpa/openjpa-persistence/2.3.0-SNAPSHOT/openjpa-persistence-2.3.0-20121212.064817-99.jar
809K uploaded  (openjpa-persistence-2.3.0-20121212.064817-99.jar)
[INFO] Uploading project information for openjpa-persistence 2.3.0-20121212.064817-99
[INFO] Retrieving previous metadata from apache.snapshots.https
[WARNING] *** CHECKSUM FAILED - Checksum failed on download: local = 'e98cbee0f56874980b766e23d29a98251aadbb4d'; remote = 'ddb5967ae26f08924bdad2c2d8c8e5a42a8053a8' - RETRYING
[WARNING] *** CHECKSUM FAILED - Checksum failed on download: local = 'e98cbee0f56874980b766e23d29a98251aadbb4d'; remote = 'ddb5967ae26f08924bdad2c2d8c8e5a42a8053a8' - IGNORING
[INFO] Uploading repository metadata for: 'snapshot org.apache.openjpa:openjpa-persistence:2.3.0-SNAPSHOT'
[INFO] Retrieving previous metadata from apache.snapshots.https
[INFO] Uploading repository metadata for: 'artifact org.apache.openjpa:openjpa-persistence'
[INFO] Retrieving previous build number from apache.snapshots.https
Uploading: https://repository.apache.org/content/repositories/snapshots/org/apache/openjpa/openjpa-persistence/2.3.0-SNAPSHOT/openjpa-persistence-2.3.0-20121212.064817-99-tests.jar
29K uploaded  (openjpa-persistence-2.3.0-20121212.064817-99-tests.jar)
[JENKINS] Archiving <https://builds.apache.org/job/OpenJPA-trunk-deploy/ws/trunk/openjpa-persistence/pom.xml> to /home/hudson/hudson/jobs/OpenJPA-trunk-deploy/modules/org.apache.openjpa$openjpa-persistence/builds/2012-12-12_06-46-42/archive/org.apache.openjpa/openjpa-persistence/2.3.0-SNAPSHOT/openjpa-persistence-2.3.0-SNAPSHOT.pom
[JENKINS] Archiving <https://builds.apache.org/job/OpenJPA-trunk-deploy/ws/trunk/openjpa-persistence/target/openjpa-persistence-2.3.0-SNAPSHOT.jar> to /home/hudson/hudson/jobs/OpenJPA-trunk-deploy/modules/org.apache.openjpa$openjpa-persistence/builds/2012-12-12_06-46-42/archive/org.apache.openjpa/openjpa-persistence/2.3.0-20121212.064817-99/openjpa-persistence-2.3.0-20121212.064817-99.jar
[JENKINS] Archiving <https://builds.apache.org/job/OpenJPA-trunk-deploy/ws/trunk/openjpa-persistence/target/openjpa-persistence-2.3.0-SNAPSHOT-tests.jar> to /home/hudson/hudson/jobs/OpenJPA-trunk-deploy/modules/org.apache.openjpa$openjpa-persistence/builds/2012-12-12_06-46-42/archive/org.apache.openjpa/openjpa-persistence/2.3.0-20121212.064817-99/openjpa-persistence-2.3.0-20121212.064817-99-tests.jar
[INFO] ------------------------------------------------------------------------
[INFO] Building OpenJPA Persistence JDBC
[INFO]    task-segment: [clean, deploy]
[INFO] ------------------------------------------------------------------------
[INFO] [clean:clean {execution: default-clean}]
[INFO] Deleting file set: <https://builds.apache.org/job/OpenJPA-trunk-deploy/ws/trunk/openjpa-persistence-jdbc/target> (included: [**], excluded: [])
[INFO] [buildnumber:create {execution: default}]
[INFO] [enforcer:enforce {execution: default}]
[INFO] [checkstyle:checkstyle {execution: default}]
[INFO] Starting audit...
Audit done.

[WARNING] Unable to locate Source XRef to link to - DISABLED
[INFO] [remote-resources:process {execution: default}]
[INFO] [resources:resources {execution: default-resources}]
[INFO] Using 'UTF-8' encoding to copy filtered resources.
[INFO] Copying 2 resources
[INFO] Copying 3 resources
[INFO] [compiler:compile {execution: default-compile}]
[INFO] Compiling 65 source files to <https://builds.apache.org/job/OpenJPA-trunk-deploy/ws/trunk/openjpa-persistence-jdbc/target/classes>
[INFO] [compiler:testCompile {execution: test-source-compile}]
[INFO] Compiling 2702 source files to <https://builds.apache.org/job/OpenJPA-trunk-deploy/ws/trunk/openjpa-persistence-jdbc/target/test-classes>
[INFO] [resources:testResources {execution: default-testResources}]
[INFO] Using 'UTF-8' encoding to copy filtered resources.
[INFO] Copying 105 resources
[INFO] Copying 3 resources
[INFO] [compiler:testCompile {execution: default-testCompile}]
[INFO] Nothing to compile - all classes are up to date
[INFO] [antrun:run {execution: default}]
[INFO] Executing tasks

enhance:

enhance.all.entities:
     [echo]  running enhancer
org.apache.commons.lang.exception.NestableRuntimeException: Error extracting class information from "<https://builds.apache.org/job/OpenJPA-trunk-deploy/ws/trunk/openjpa-persistence-jdbc/target/test-classes/org/apache/openjpa/persistence/distinctjoin/Lecturer.class".>
	at org.apache.openjpa.lib.meta.ClassArgParser.parseTypeNames(ClassArgParser.java:226)
	at org.apache.openjpa.lib.meta.ClassArgParser.parseTypes(ClassArgParser.java:161)
	at org.apache.openjpa.enhance.PCEnhancer.run(PCEnhancer.java:4864)
	at org.apache.openjpa.ant.PCEnhancerTask.executeOn(PCEnhancerTask.java:89)
	at org.apache.openjpa.lib.ant.AbstractTask.execute(AbstractTask.java:184)
	at org.apache.tools.ant.UnknownElement.execute(UnknownElement.java:288)
	at sun.reflect.GeneratedMethodAccessor26.invoke(Unknown Source)
	at sun.reflect.DelegatingMethodAccessorImpl.invoke(DelegatingMethodAccessorImpl.java:25)
	at java.lang.reflect.Method.invoke(Method.java:597)
	at org.apache.tools.ant.dispatch.DispatchUtils.execute(DispatchUtils.java:106)
	at org.apache.tools.ant.Task.perform(Task.java:348)
	at org.apache.tools.ant.Target.execute(Target.java:357)
	at org.apache.tools.ant.Target.performTasks(Target.java:385)
	at org.apache.tools.ant.Project.executeSortedTargets(Project.java:1337)
	at org.apache.tools.ant.helper.SingleCheckExecutor.executeTargets(SingleCheckExecutor.java:38)
	at org.apache.tools.ant.Project.executeTargets(Project.java:1189)
	at org.apache.tools.ant.taskdefs.Ant.execute(Ant.java:416)
	at org.apache.tools.ant.taskdefs.CallTarget.execute(CallTarget.java:105)
	at org.apache.tools.ant.UnknownElement.execute(UnknownElement.java:288)
	at sun.reflect.GeneratedMethodAccessor26.invoke(Unknown Source)
	at sun.reflect.DelegatingMethodAccessorImpl.invoke(DelegatingMethodAccessorImpl.java:25)
	at java.lang.reflect.Method.invoke(Method.java:597)
	at org.apache.tools.ant.dispatch.DispatchUtils.execute(DispatchUtils.java:106)
	at org.apache.tools.ant.Task.perform(Task.java:348)
	at org.apache.tools.ant.Target.execute(Target.java:357)
	at org.apache.tools.ant.Target.performTasks(Target.java:385)
	at org.apache.tools.ant.Project.executeSortedTargets(Project.java:1337)
	at org.apache.tools.ant.helper.SingleCheckExecutor.executeTargets(SingleCheckExecutor.java:38)
	at org.apache.tools.ant.Project.executeTargets(Project.java:1189)
	at org.apache.tools.ant.taskdefs.Ant.execute(Ant.java:416)
	at org.apache.tools.ant.UnknownElement.execute(UnknownElement.java:288)
	at sun.reflect.GeneratedMethodAccessor26.invoke(Unknown Source)
	at sun.reflect.DelegatingMethodAccessorImpl.invoke(DelegatingMethodAccessorImpl.java:25)
	at java.lang.reflect.Method.invoke(Method.java:597)
	at org.apache.tools.ant.dispatch.DispatchUtils.execute(DispatchUtils.java:106)
	at org.apache.tools.ant.Task.perform(Task.java:348)
	at org.apache.tools.ant.Target.execute(Target.java:357)
	at org.apache.maven.plugin.antrun.AbstractAntMojo.executeTasks(AbstractAntMojo.java:118)
	at org.apache.maven.plugin.antrun.AntRunMojo.execute(AntRunMojo.java:98)
	at org.apache.maven.plugin.DefaultPluginManager.executeMojo(DefaultPluginManager.java:490)
	at hudson.maven.agent.PluginManagerInterceptor.executeMojo(PluginManagerInterceptor.java:182)
	at org.apache.maven.lifecycle.DefaultLifecycleExecutor.executeGoals(DefaultLifecycleExecutor.java:694)
	at org.apache.maven.lifecycle.DefaultLifecycleExecutor.executeGoalWithLifecycle(DefaultLifecycleExecutor.java:556)
	at org.apache.maven.lifecycle.DefaultLifecycleExecutor.executeGoal(DefaultLifecycleExecutor.java:535)
	at org.apache.maven.lifecycle.DefaultLifecycleExecutor.executeGoalAndHandleFailures(DefaultLifecycleExecutor.java:387)
	at org.apache.maven.lifecycle.DefaultLifecycleExecutor.executeTaskSegments(DefaultLifecycleExecutor.java:348)
	at org.apache.maven.lifecycle.DefaultLifecycleExecutor.execute(DefaultLifecycleExecutor.java:180)
	at org.apache.maven.lifecycle.LifecycleExecutorInterceptor.execute(LifecycleExecutorInterceptor.java:65)
	at org.apache.maven.DefaultMaven.doExecute(DefaultMaven.java:328)
	at org.apache.maven.DefaultMaven.execute(DefaultMaven.java:138)
	at org.apache.maven.cli.MavenCli.main(MavenCli.java:362)
	at sun.reflect.NativeMethodAccessorImpl.invoke0(Native Method)
	at sun.reflect.NativeMethodAccessorImpl.invoke(NativeMethodAccessorImpl.java:39)
	at sun.reflect.DelegatingMethodAccessorImpl.invoke(DelegatingMethodAccessorImpl.java:25)
	at java.lang.reflect.Method.invoke(Method.java:597)
	at org.codehaus.classworlds.Launcher.launchEnhanced(Launcher.java:315)
	at org.codehaus.classworlds.Launcher.launch(Launcher.java:255)
	at hudson.maven.agent.Main.launch(Main.java:185)
	at hudson.maven.MavenBuilder.call(MavenBuilder.java:151)
	at hudson.maven.Maven2Builder.call(Maven2Builder.java:77)
	at hudson.maven.Maven2Builder.call(Maven2Builder.java:53)
	at hudson.remoting.UserRequest.perform(UserRequest.java:118)
	at hudson.remoting.UserRequest.perform(UserRequest.java:48)
	at hudson.remoting.Request$2.run(Request.java:326)
	at hudson.remoting.InterceptingExecutorService$1.call(InterceptingExecutorService.java:72)
	at java.util.concurrent.FutureTask$Sync.innerRun(FutureTask.java:303)
	at java.util.concurrent.FutureTask.run(FutureTask.java:138)
	at java.util.concurrent.ThreadPoolExecutor$Worker.runTask(ThreadPoolExecutor.java:886)
	at java.util.concurrent.ThreadPoolExecutor$Worker.run(ThreadPoolExecutor.java:908)
	at java.lang.Thread.run(Thread.java:662)
Caused by: java.io.FileNotFoundException: <https://builds.apache.org/job/OpenJPA-trunk-deploy/ws/trunk/openjpa-persistence-jdbc/target/test-classes/org/apache/openjpa/persistence/distinctjoin/Lecturer.class> (Too many open files)
	at java.io.FileInputStream.open(Native Method)
	at java.io.FileInputStream.<init>(FileInputStream.java:120)
	at org.apache.openjpa.lib.util.J2DoPrivHelper$30.run(J2DoPrivHelper.java:710)
	at org.apache.openjpa.lib.util.J2DoPrivHelper$30.run(J2DoPrivHelper.java:708)
	at java.security.AccessController.doPrivileged(Native Method)
	at org.apache.openjpa.lib.meta.ClassArgParser.getFromClassFile(ClassArgParser.java:306)
	at org.apache.openjpa.lib.meta.ClassArgParser.parseTypeNames(ClassArgParser.java:217)
	... 69 more
[JENKINS] Archiving <https://builds.apache.org/job/OpenJPA-trunk-deploy/ws/trunk/openjpa-persistence-jdbc/pom.xml> to /home/hudson/hudson/jobs/OpenJPA-trunk-deploy/modules/org.apache.openjpa$openjpa-persistence-jdbc/builds/2012-12-12_06-46-42/archive/org.apache.openjpa/openjpa-persistence-jdbc/2.3.0-SNAPSHOT/openjpa-persistence-jdbc-2.3.0-SNAPSHOT.pom
[INFO] ------------------------------------------------------------------------
[ERROR] BUILD ERROR
[INFO] ------------------------------------------------------------------------
[INFO] An Ant BuildException has occured: The following error occurred while executing this line:
<https://builds.apache.org/job/OpenJPA-trunk-deploy/ws/trunk/openjpa-persistence-jdbc/src/main/ant/enhancer.xml>:51: The following error occurred while executing this line:
<https://builds.apache.org/job/OpenJPA-trunk-deploy/ws/trunk/openjpa-persistence-jdbc/src/main/ant/enhancer.xml>:89: org.apache.commons.lang.exception.NestableRuntimeException: Error extracting class information from "<https://builds.apache.org/job/OpenJPA-trunk-deploy/ws/trunk/openjpa-persistence-jdbc/target/test-classes/org/apache/openjpa/persistence/distinctjoin/Lecturer.class".>

<https://builds.apache.org/job/OpenJPA-trunk-deploy/ws/trunk/openjpa-persistence-jdbc/target/test-classes/org/apache/openjpa/persistence/distinctjoin/Lecturer.class> (Too many open files)
[INFO] ------------------------------------------------------------------------
[INFO] For more information, run Maven with the -e switch
[INFO] ------------------------------------------------------------------------
[INFO] Total time: 3 minutes 20 seconds
[INFO] Finished at: Wed Dec 12 06:50:38 UTC 2012
[INFO] Final Memory: 115M/592M
[INFO] ------------------------------------------------------------------------
Sending e-mails to: commits@openjpa.apache.org
channel stopped

Jenkins build is back to normal : OpenJPA-trunk-deploy #352

Posted by Apache Jenkins Server <je...@builds.apache.org>.
See <https://builds.apache.org/job/OpenJPA-trunk-deploy/352/changes>


Build failed in Jenkins: OpenJPA-trunk-deploy #351

Posted by Apache Jenkins Server <je...@builds.apache.org>.
See <https://builds.apache.org/job/OpenJPA-trunk-deploy/351/changes>

Changes:

[hthomann] OPENJPA-2257: Added additional changes (i.e. return a copy of _supportedKeys) to the code changes made previously by Albert Lee.

[ppoddar] OPENJPA-2057:remove wrong import

[hthomann] OPENJPA-2235: Updated TestIsolationFecthHint test to fix build failure.

------------------------------------------
[...truncated 293 lines...]
         have common prefixes, one of which is: "*"
         Consider using a lookahead of 2 or more for nested expansion.
File "TokenMgrError.java" does not exist.  Will create one.
Warning: ParseException.java: File is obsolete.  Please rename or delete this file so that a new one can be generated for you.
File "Token.java" does not exist.  Will create one.
File "JavaCharStream.java" does not exist.  Will create one.
Parser generated with 0 errors and 3 warnings.
[INFO] Processed 1 grammar
[INFO] [checkstyle:checkstyle {execution: default}]
[INFO] Starting audit...
Audit done.

[WARNING] Unable to locate Source XRef to link to - DISABLED
[INFO] [remote-resources:process {execution: default}]
[INFO] [resources:resources {execution: default-resources}]
[INFO] Using 'UTF-8' encoding to copy filtered resources.
[INFO] Copying 15 resources
[INFO] Copying 3 resources
[INFO] [compiler:compile {execution: default-compile}]
[INFO] Compiling 505 source files to <https://builds.apache.org/job/OpenJPA-trunk-deploy/ws/trunk/openjpa-kernel/target/classes>
[INFO] [antrun:run {execution: add-was-interfaces}]
[INFO] Executing tasks
[INFO] Executed tasks
[INFO] [antrun:run {execution: generate-standard-sco-proxies}]
[INFO] Executing tasks
org.apache.openjpa.util.java$sql$Date$proxy
org.apache.openjpa.util.java$sql$Time$proxy
org.apache.openjpa.util.java$sql$Timestamp$proxy
org.apache.openjpa.util.java$util$ArrayList$proxy
org.apache.openjpa.util.java$util$Date$proxy
org.apache.openjpa.util.java$util$GregorianCalendar$proxy
org.apache.openjpa.util.java$util$HashMap$proxy
org.apache.openjpa.util.java$util$HashSet$proxy
org.apache.openjpa.util.java$util$Hashtable$proxy
org.apache.openjpa.util.java$util$LinkedList$proxy
org.apache.openjpa.util.java$util$Properties$proxy
org.apache.openjpa.util.java$util$TreeMap$proxy
org.apache.openjpa.util.java$util$TreeSet$proxy
org.apache.openjpa.util.java$util$Vector$proxy
org.apache.openjpa.util.java$util$EnumMap$proxy
org.apache.openjpa.util.java$util$IdentityHashMap$proxy
org.apache.openjpa.util.java$util$LinkedHashMap$proxy
org.apache.openjpa.util.java$util$LinkedHashSet$proxy
org.apache.openjpa.util.java$util$PriorityQueue$proxy
[INFO] Executed tasks
[INFO] [compiler:testCompile {execution: test-source-compile}]
[INFO] Compiling 12 source files to <https://builds.apache.org/job/OpenJPA-trunk-deploy/ws/trunk/openjpa-kernel/target/test-classes>
[INFO] [resources:testResources {execution: default-testResources}]
[INFO] Using 'UTF-8' encoding to copy filtered resources.
[INFO] skip non existing resourceDirectory <https://builds.apache.org/job/OpenJPA-trunk-deploy/ws/trunk/openjpa-kernel/src/test/resources>
[INFO] Copying 3 resources
[INFO] [compiler:testCompile {execution: default-testCompile}]
[INFO] Nothing to compile - all classes are up to date
[WARNING] DEPRECATED [systemProperties]: Use systemPropertyVariables instead.
[INFO] [surefire:test {execution: default-test}]
[INFO] Surefire report directory: <https://builds.apache.org/job/OpenJPA-trunk-deploy/ws/trunk/openjpa-kernel/target/surefire-reports>

-------------------------------------------------------
 T E S T S
-------------------------------------------------------
Running org.apache.openjpa.meta.TestMemberProvider
Tests run: 2, Failures: 0, Errors: 0, Skipped: 0, Time elapsed: 0.879 sec
Running org.apache.openjpa.meta.TestJavaTypes
Tests run: 1, Failures: 0, Errors: 0, Skipped: 0, Time elapsed: 0.107 sec
Running org.apache.openjpa.conf.TestSpecification
Tests run: 3, Failures: 0, Errors: 0, Skipped: 0, Time elapsed: 0.016 sec
Running org.apache.openjpa.enhance.TestPCSubclassNameConversion
Tests run: 1, Failures: 0, Errors: 0, Skipped: 0, Time elapsed: 0.157 sec
Running org.apache.openjpa.meta.TestAccessCode
Tests run: 8, Failures: 0, Errors: 0, Skipped: 0, Time elapsed: 0.09 sec
Running org.apache.openjpa.enhance.TestGetDeclaredMethod
Tests run: 3, Failures: 0, Errors: 0, Skipped: 0, Time elapsed: 0.05 sec
Running org.apache.openjpa.util.TestProxyManager
Tests run: 43, Failures: 0, Errors: 0, Skipped: 0, Time elapsed: 0.658 sec
Running org.apache.openjpa.util.TestResultShape
Tests run: 8, Failures: 0, Errors: 0, Skipped: 0, Time elapsed: 0.027 sec
Running org.apache.openjpa.ee.TestOSGiManagedRuntime
Tests run: 4, Failures: 0, Errors: 0, Skipped: 0, Time elapsed: 0.053 sec
Running org.apache.openjpa.ee.TestWASManagedRuntime
Tests run: 1, Failures: 0, Errors: 0, Skipped: 0, Time elapsed: 0.003 sec

Results :

Tests run: 74, Failures: 0, Errors: 0, Skipped: 0

[JENKINS] Recording test results
[INFO] [jar:jar {execution: default-jar}]
[INFO] Building jar: <https://builds.apache.org/job/OpenJPA-trunk-deploy/ws/trunk/openjpa-kernel/target/openjpa-kernel-2.3.0-SNAPSHOT.jar>
[INFO] [jar:jar {execution: default-jar}]
[INFO] [jar:test-jar {execution: attach-tests}]
[INFO] Building jar: <https://builds.apache.org/job/OpenJPA-trunk-deploy/ws/trunk/openjpa-kernel/target/openjpa-kernel-2.3.0-SNAPSHOT-tests.jar>
[INFO] [ianal:verify-legal-files {execution: default}]
[INFO] Checking legal files in: openjpa-kernel-2.3.0-SNAPSHOT.jar
[INFO] Checking legal files in: openjpa-kernel-2.3.0-SNAPSHOT-tests.jar
[INFO] [apache-rat:check {execution: default}]
[INFO] Exclude: **/.*/**
[INFO] Exclude: **/target/**/*
[INFO] [install:install {execution: default-install}]
[INFO] Installing <https://builds.apache.org/job/OpenJPA-trunk-deploy/ws/trunk/openjpa-kernel/target/openjpa-kernel-2.3.0-SNAPSHOT.jar> to /home/jenkins/jenkins-slave/maven-repositories/0/org/apache/openjpa/openjpa-kernel/2.3.0-SNAPSHOT/openjpa-kernel-2.3.0-SNAPSHOT.jar
[INFO] Installing <https://builds.apache.org/job/OpenJPA-trunk-deploy/ws/trunk/openjpa-kernel/target/openjpa-kernel-2.3.0-SNAPSHOT-tests.jar> to /home/jenkins/jenkins-slave/maven-repositories/0/org/apache/openjpa/openjpa-kernel/2.3.0-SNAPSHOT/openjpa-kernel-2.3.0-SNAPSHOT-tests.jar
[INFO] [deploy:deploy {execution: default-deploy}]
[INFO] Retrieving previous build number from apache.snapshots.https
[WARNING] *** CHECKSUM FAILED - Checksum failed on download: local = '648426f7a5799c1976cb5fff93255e40a9454ebf'; remote = '6b74c497a51eda6e39b3b43c53889890ab9b5908' - RETRYING
[WARNING] *** CHECKSUM FAILED - Checksum failed on download: local = '648426f7a5799c1976cb5fff93255e40a9454ebf'; remote = '6b74c497a51eda6e39b3b43c53889890ab9b5908' - IGNORING
Uploading: https://repository.apache.org/content/repositories/snapshots/org/apache/openjpa/openjpa-kernel/2.3.0-SNAPSHOT/openjpa-kernel-2.3.0-20121229.064953-100.jar
1421K uploaded  (openjpa-kernel-2.3.0-20121229.064953-100.jar)
[INFO] Retrieving previous metadata from apache.snapshots.https
[WARNING] *** CHECKSUM FAILED - Checksum failed on download: local = '648426f7a5799c1976cb5fff93255e40a9454ebf'; remote = '6b74c497a51eda6e39b3b43c53889890ab9b5908' - RETRYING
[WARNING] *** CHECKSUM FAILED - Checksum failed on download: local = '648426f7a5799c1976cb5fff93255e40a9454ebf'; remote = '6b74c497a51eda6e39b3b43c53889890ab9b5908' - IGNORING
[INFO] Uploading repository metadata for: 'snapshot org.apache.openjpa:openjpa-kernel:2.3.0-SNAPSHOT'
[INFO] Retrieving previous metadata from apache.snapshots.https
[INFO] Uploading repository metadata for: 'artifact org.apache.openjpa:openjpa-kernel'
[INFO] Uploading project information for openjpa-kernel 2.3.0-20121229.064953-100
[INFO] Retrieving previous build number from apache.snapshots.https
Uploading: https://repository.apache.org/content/repositories/snapshots/org/apache/openjpa/openjpa-kernel/2.3.0-SNAPSHOT/openjpa-kernel-2.3.0-20121229.064953-100-tests.jar
50K uploaded  (openjpa-kernel-2.3.0-20121229.064953-100-tests.jar)
[JENKINS] Archiving <https://builds.apache.org/job/OpenJPA-trunk-deploy/ws/trunk/openjpa-kernel/pom.xml> to /home/hudson/hudson/jobs/OpenJPA-trunk-deploy/modules/org.apache.openjpa$openjpa-kernel/builds/2012-12-29_06-48-27/archive/org.apache.openjpa/openjpa-kernel/2.3.0-SNAPSHOT/openjpa-kernel-2.3.0-SNAPSHOT.pom
[JENKINS] Archiving <https://builds.apache.org/job/OpenJPA-trunk-deploy/ws/trunk/openjpa-kernel/target/openjpa-kernel-2.3.0-SNAPSHOT.jar> to /home/hudson/hudson/jobs/OpenJPA-trunk-deploy/modules/org.apache.openjpa$openjpa-kernel/builds/2012-12-29_06-48-27/archive/org.apache.openjpa/openjpa-kernel/2.3.0-20121229.064953-100/openjpa-kernel-2.3.0-20121229.064953-100.jar
[JENKINS] Archiving <https://builds.apache.org/job/OpenJPA-trunk-deploy/ws/trunk/openjpa-kernel/target/openjpa-kernel-2.3.0-SNAPSHOT-tests.jar> to /home/hudson/hudson/jobs/OpenJPA-trunk-deploy/modules/org.apache.openjpa$openjpa-kernel/builds/2012-12-29_06-48-27/archive/org.apache.openjpa/openjpa-kernel/2.3.0-20121229.064953-100/openjpa-kernel-2.3.0-20121229.064953-100-tests.jar
[INFO] ------------------------------------------------------------------------
[INFO] Building OpenJPA JDBC
[INFO]    task-segment: [clean, deploy]
[INFO] ------------------------------------------------------------------------
[INFO] [clean:clean {execution: default-clean}]
[INFO] [buildnumber:create {execution: default}]
[INFO] [enforcer:enforce {execution: default}]
[INFO] [checkstyle:checkstyle {execution: default}]
[INFO] Starting audit...
Audit done.

[WARNING] Unable to locate Source XRef to link to - DISABLED
[INFO] [remote-resources:process {execution: default}]
[INFO] [resources:resources {execution: default-resources}]
[INFO] Using 'UTF-8' encoding to copy filtered resources.
[INFO] Copying 14 resources
[INFO] Copying 3 resources
[INFO] [compiler:compile {execution: default-compile}]
[INFO] Compiling 357 source files to <https://builds.apache.org/job/OpenJPA-trunk-deploy/ws/trunk/openjpa-jdbc/target/classes>
[INFO] [compiler:testCompile {execution: test-source-compile}]
[INFO] Compiling 7 source files to <https://builds.apache.org/job/OpenJPA-trunk-deploy/ws/trunk/openjpa-jdbc/target/test-classes>
[INFO] [resources:testResources {execution: default-testResources}]
[INFO] Using 'UTF-8' encoding to copy filtered resources.
[INFO] skip non existing resourceDirectory <https://builds.apache.org/job/OpenJPA-trunk-deploy/ws/trunk/openjpa-jdbc/src/test/resources>
[INFO] Copying 3 resources
[INFO] [compiler:testCompile {execution: default-testCompile}]
[INFO] Nothing to compile - all classes are up to date
[WARNING] DEPRECATED [systemProperties]: Use systemPropertyVariables instead.
[INFO] [surefire:test {execution: default-test}]
[INFO] Surefire report directory: <https://builds.apache.org/job/OpenJPA-trunk-deploy/ws/trunk/openjpa-jdbc/target/surefire-reports>

-------------------------------------------------------
 T E S T S
-------------------------------------------------------
Running org.apache.openjpa.jdbc.sql.identifier.TestDBIdentifiers
Tests run: 5, Failures: 0, Errors: 0, Skipped: 0, Time elapsed: 0.424 sec
Running org.apache.openjpa.jdbc.meta.TestMappingDefaultsImpl
128  INFO   [main] openjpa.jdbc.JDBC - Using dictionary class "org.apache.openjpa.jdbc.sql.OracleDictionary".
Tests run: 1, Failures: 0, Errors: 0, Skipped: 0, Time elapsed: 1.119 sec
Running org.apache.openjpa.jdbc.sql.TestDBDictionaryGeneratedSQL
Tests run: 5, Failures: 0, Errors: 0, Skipped: 0, Time elapsed: 0.53 sec
Running org.apache.openjpa.jdbc.sql.TestDB2Dictionary
Tests run: 5, Failures: 0, Errors: 0, Skipped: 0, Time elapsed: 0.225 sec
Running org.apache.openjpa.jdbc.sql.TestMySQLDictionary
Tests run: 3, Failures: 0, Errors: 0, Skipped: 0, Time elapsed: 0.174 sec
Running org.apache.openjpa.jdbc.kernel.TestUpdateManagerFlushException
Tests run: 1, Failures: 0, Errors: 0, Skipped: 0, Time elapsed: 0.011 sec
Running org.apache.openjpa.jdbc.sql.TestDictionaryFactory
Tests run: 1, Failures: 0, Errors: 0, Skipped: 0, Time elapsed: 0.006 sec

Results :

Tests run: 21, Failures: 0, Errors: 0, Skipped: 0

[JENKINS] Recording test results
[INFO] [jar:jar {execution: default-jar}]
[INFO] Building jar: <https://builds.apache.org/job/OpenJPA-trunk-deploy/ws/trunk/openjpa-jdbc/target/openjpa-jdbc-2.3.0-SNAPSHOT.jar>
[INFO] [jar:jar {execution: default-jar}]
[INFO] [jar:test-jar {execution: attach-tests}]
[INFO] Building jar: <https://builds.apache.org/job/OpenJPA-trunk-deploy/ws/trunk/openjpa-jdbc/target/openjpa-jdbc-2.3.0-SNAPSHOT-tests.jar>
[INFO] [ianal:verify-legal-files {execution: default}]
[INFO] Checking legal files in: openjpa-jdbc-2.3.0-SNAPSHOT.jar
[INFO] Checking legal files in: openjpa-jdbc-2.3.0-SNAPSHOT-tests.jar
[INFO] [apache-rat:check {execution: default}]
[INFO] Exclude: **/.*/**
[INFO] Exclude: **/target/**/*
[INFO] [install:install {execution: default-install}]
[INFO] Installing <https://builds.apache.org/job/OpenJPA-trunk-deploy/ws/trunk/openjpa-jdbc/target/openjpa-jdbc-2.3.0-SNAPSHOT.jar> to /home/jenkins/jenkins-slave/maven-repositories/0/org/apache/openjpa/openjpa-jdbc/2.3.0-SNAPSHOT/openjpa-jdbc-2.3.0-SNAPSHOT.jar
[INFO] Installing <https://builds.apache.org/job/OpenJPA-trunk-deploy/ws/trunk/openjpa-jdbc/target/openjpa-jdbc-2.3.0-SNAPSHOT-tests.jar> to /home/jenkins/jenkins-slave/maven-repositories/0/org/apache/openjpa/openjpa-jdbc/2.3.0-SNAPSHOT/openjpa-jdbc-2.3.0-SNAPSHOT-tests.jar
[INFO] [deploy:deploy {execution: default-deploy}]
[INFO] Retrieving previous build number from apache.snapshots.https
[WARNING] *** CHECKSUM FAILED - Checksum failed on download: local = '8263ac468d69dfd965500c75e2c9b337e744d1b9'; remote = 'cca8f310cad1ef788660e827dd653f7e586b596b' - RETRYING
[WARNING] *** CHECKSUM FAILED - Checksum failed on download: local = '8263ac468d69dfd965500c75e2c9b337e744d1b9'; remote = 'cca8f310cad1ef788660e827dd653f7e586b596b' - IGNORING
Uploading: https://repository.apache.org/content/repositories/snapshots/org/apache/openjpa/openjpa-jdbc/2.3.0-SNAPSHOT/openjpa-jdbc-2.3.0-20121229.064953-100.jar
1387K uploaded  (openjpa-jdbc-2.3.0-20121229.064953-100.jar)
[INFO] Uploading project information for openjpa-jdbc 2.3.0-20121229.064953-100
[INFO] Retrieving previous metadata from apache.snapshots.https
[INFO] Uploading repository metadata for: 'artifact org.apache.openjpa:openjpa-jdbc'
[INFO] Retrieving previous metadata from apache.snapshots.https
[WARNING] *** CHECKSUM FAILED - Checksum failed on download: local = '8263ac468d69dfd965500c75e2c9b337e744d1b9'; remote = 'cca8f310cad1ef788660e827dd653f7e586b596b' - RETRYING
[WARNING] *** CHECKSUM FAILED - Checksum failed on download: local = '8263ac468d69dfd965500c75e2c9b337e744d1b9'; remote = 'cca8f310cad1ef788660e827dd653f7e586b596b' - IGNORING
[INFO] Uploading repository metadata for: 'snapshot org.apache.openjpa:openjpa-jdbc:2.3.0-SNAPSHOT'
[INFO] Retrieving previous build number from apache.snapshots.https
Uploading: https://repository.apache.org/content/repositories/snapshots/org/apache/openjpa/openjpa-jdbc/2.3.0-SNAPSHOT/openjpa-jdbc-2.3.0-20121229.064953-100-tests.jar
41K uploaded  (openjpa-jdbc-2.3.0-20121229.064953-100-tests.jar)
[JENKINS] Archiving <https://builds.apache.org/job/OpenJPA-trunk-deploy/ws/trunk/openjpa-jdbc/pom.xml> to /home/hudson/hudson/jobs/OpenJPA-trunk-deploy/modules/org.apache.openjpa$openjpa-jdbc/builds/2012-12-29_06-48-27/archive/org.apache.openjpa/openjpa-jdbc/2.3.0-SNAPSHOT/openjpa-jdbc-2.3.0-SNAPSHOT.pom
[JENKINS] Archiving <https://builds.apache.org/job/OpenJPA-trunk-deploy/ws/trunk/openjpa-jdbc/target/openjpa-jdbc-2.3.0-SNAPSHOT.jar> to /home/hudson/hudson/jobs/OpenJPA-trunk-deploy/modules/org.apache.openjpa$openjpa-jdbc/builds/2012-12-29_06-48-27/archive/org.apache.openjpa/openjpa-jdbc/2.3.0-20121229.064953-100/openjpa-jdbc-2.3.0-20121229.064953-100.jar
[JENKINS] Archiving <https://builds.apache.org/job/OpenJPA-trunk-deploy/ws/trunk/openjpa-jdbc/target/openjpa-jdbc-2.3.0-SNAPSHOT-tests.jar> to /home/hudson/hudson/jobs/OpenJPA-trunk-deploy/modules/org.apache.openjpa$openjpa-jdbc/builds/2012-12-29_06-48-27/archive/org.apache.openjpa/openjpa-jdbc/2.3.0-20121229.064953-100/openjpa-jdbc-2.3.0-20121229.064953-100-tests.jar
[INFO] ------------------------------------------------------------------------
[INFO] Building OpenJPA Persistence
[INFO]    task-segment: [clean, deploy]
[INFO] ------------------------------------------------------------------------
[INFO] [clean:clean {execution: default-clean}]
[INFO] [buildnumber:create {execution: default}]
[INFO] [enforcer:enforce {execution: default}]
[INFO] [checkstyle:checkstyle {execution: default}]
[INFO] Starting audit...
Audit done.

[WARNING] Unable to locate Source XRef to link to - DISABLED
[INFO] [remote-resources:process {execution: default}]
[INFO] [resources:resources {execution: default-resources}]
[INFO] Using 'UTF-8' encoding to copy filtered resources.
[INFO] Copying 14 resources
[INFO] Copying 3 resources
[INFO] [compiler:compile {execution: default-compile}]
[INFO] Compiling 233 source files to <https://builds.apache.org/job/OpenJPA-trunk-deploy/ws/trunk/openjpa-persistence/target/classes>
[INFO] -------------------------------------------------------------
[ERROR] COMPILATION ERROR : 
[INFO] -------------------------------------------------------------
[ERROR] <https://builds.apache.org/job/OpenJPA-trunk-deploy/ws/trunk/openjpa-persistence/src/main/java/org/apache/openjpa/persistence/criteria/PathImpl.java>:[36,35] package org.apache.openjpa.jdbc.meta does not exist
[INFO] 1 error
[INFO] -------------------------------------------------------------
[JENKINS] Archiving <https://builds.apache.org/job/OpenJPA-trunk-deploy/ws/trunk/openjpa-persistence/pom.xml> to /home/hudson/hudson/jobs/OpenJPA-trunk-deploy/modules/org.apache.openjpa$openjpa-persistence/builds/2012-12-29_06-48-27/archive/org.apache.openjpa/openjpa-persistence/2.3.0-SNAPSHOT/openjpa-persistence-2.3.0-SNAPSHOT.pom
[INFO] ------------------------------------------------------------------------
[ERROR] BUILD FAILURE
[INFO] ------------------------------------------------------------------------
[INFO] Compilation failure
<https://builds.apache.org/job/OpenJPA-trunk-deploy/ws/trunk/openjpa-persistence/src/main/java/org/apache/openjpa/persistence/criteria/PathImpl.java>:[36,35] package org.apache.openjpa.jdbc.meta does not exist

[INFO] ------------------------------------------------------------------------
[INFO] For more information, run Maven with the -e switch
[INFO] ------------------------------------------------------------------------
[INFO] Total time: 4 minutes 1 second
[INFO] Finished at: Sat Dec 29 06:52:57 UTC 2012
[INFO] Final Memory: 90M/527M
[INFO] ------------------------------------------------------------------------
Sending e-mails to: commits@openjpa.apache.org
Sending e-mails to: commits@openjpa.apache.org
channel stopped

Build failed in Jenkins: OpenJPA-trunk-deploy #350

Posted by Apache Jenkins Server <je...@builds.apache.org>.
See <https://builds.apache.org/job/OpenJPA-trunk-deploy/350/changes>

Changes:

[hthomann] OPENJPA-2235: READ_UNCOMMITTED setting for the fetch plan isolation level is ignored in DB2Dictionary - applied Helen Xu's patch to trunk.

------------------------------------------
[...truncated 5908 lines...]
AU        openjpa-persistence/src/main/java/org/apache/openjpa/persistence/TupleImpl.java
AU        openjpa-persistence/src/main/java/org/apache/openjpa/persistence/MetaDataTag.java
AU        openjpa-persistence/src/main/java/org/apache/openjpa/persistence/OpenJPAEntityManagerFactory.java
AU        openjpa-persistence/src/main/java/org/apache/openjpa/persistence/ReadOnly.java
AU        openjpa-persistence/src/main/java/org/apache/openjpa/persistence/FetchAttribute.java
A         openjpa-persistence/src/main/java/org/apache/openjpa/persistence/package.html
AU        openjpa-persistence/src/main/java/org/apache/openjpa/persistence/Type.java
AU        openjpa-persistence/src/main/java/org/apache/openjpa/persistence/PessimisticLockException.java
AU        openjpa-persistence/src/main/java/org/apache/openjpa/persistence/QueryImpl.java
AU        openjpa-persistence/src/main/java/org/apache/openjpa/persistence/OpenJPAEntityManagerFactorySPI.java
AU        openjpa-persistence/src/main/java/org/apache/openjpa/persistence/FetchGroups.java
AU        openjpa-persistence/src/main/java/org/apache/openjpa/persistence/MixedLockLevelsHelper.java
AU        openjpa-persistence/src/main/java/org/apache/openjpa/persistence/EntityExistsException.java
AU        openjpa-persistence/src/main/java/org/apache/openjpa/persistence/DetachStateType.java
AU        openjpa-persistence/src/main/java/org/apache/openjpa/persistence/EntityManagerFactoryValue.java
A         openjpa-persistence/src/main/java/org/apache/openjpa/persistence/util
AU        openjpa-persistence/src/main/java/org/apache/openjpa/persistence/util/SourceCode.java
AU        openjpa-persistence/src/main/java/org/apache/openjpa/persistence/util/ReservedWords.java
AU        openjpa-persistence/src/main/java/org/apache/openjpa/persistence/util/package.html
AU        openjpa-persistence/src/main/java/org/apache/openjpa/persistence/DataCache.java
AU        openjpa-persistence/src/main/java/org/apache/openjpa/persistence/OpenJPAQuerySPI.java
AU        openjpa-persistence/src/main/java/org/apache/openjpa/persistence/ArgumentException.java
AU        openjpa-persistence/src/main/java/org/apache/openjpa/persistence/CallbackMode.java
AU        openjpa-persistence/src/main/java/org/apache/openjpa/persistence/OpenJPAPersistence.java
AU        openjpa-persistence/src/main/java/org/apache/openjpa/persistence/StoreCacheImpl.java
AU        openjpa-persistence/src/main/java/org/apache/openjpa/persistence/ExternalValues.java
AU        openjpa-persistence/src/main/java/org/apache/openjpa/persistence/ParameterImpl.java
AU        openjpa-persistence/src/main/java/org/apache/openjpa/persistence/TransactionRequiredException.java
AU        openjpa-persistence/src/main/java/org/apache/openjpa/persistence/LockScopesHelper.java
A         openjpa-persistence/src/main/java/org/apache/openjpa/persistence/meta
AU        openjpa-persistence/src/main/java/org/apache/openjpa/persistence/meta/AnnotationProcessor6.java
AU        openjpa-persistence/src/main/java/org/apache/openjpa/persistence/meta/MetadataProcessor.java
AU        openjpa-persistence/src/main/java/org/apache/openjpa/persistence/meta/AbstractManagedType.java
AU        openjpa-persistence/src/main/java/org/apache/openjpa/persistence/meta/Types.java
AU        openjpa-persistence/src/main/java/org/apache/openjpa/persistence/meta/CompileTimeLogger.java
AU        openjpa-persistence/src/main/java/org/apache/openjpa/persistence/meta/MetamodelImpl.java
AU        openjpa-persistence/src/main/java/org/apache/openjpa/persistence/meta/SourceAnnotationHandler.java
AU        openjpa-persistence/src/main/java/org/apache/openjpa/persistence/meta/Members.java
AU        openjpa-persistence/src/main/java/org/apache/openjpa/persistence/meta/package.html
AU        openjpa-persistence/src/main/java/org/apache/openjpa/persistence/EntityNotFoundException.java
AU        openjpa-persistence/src/main/java/org/apache/openjpa/persistence/GeneratorImpl.java
AU        openjpa-persistence/src/main/java/org/apache/openjpa/persistence/QueryResultCacheImpl.java
AU        openjpa-persistence/src/main/java/org/apache/openjpa/persistence/AnnotationPersistenceMetaDataSerializer.java
A         openjpa-persistence/src/main/java/org/apache/openjpa/persistence/validation
AU        openjpa-persistence/src/main/java/org/apache/openjpa/persistence/validation/ValidatorImpl.java
AU        openjpa-persistence/src/main/java/org/apache/openjpa/persistence/validation/ValidationUtils.java
AU        openjpa-persistence/src/main/java/org/apache/openjpa/persistence/validation/TraversableResolverImpl.java
AU        openjpa-persistence/src/main/java/org/apache/openjpa/persistence/KeyDependent.java
AU        openjpa-persistence/src/main/java/org/apache/openjpa/persistence/StoreCache.java
AU        openjpa-persistence/src/main/java/org/apache/openjpa/persistence/UpdateAction.java
AU        openjpa-persistence/src/main/java/org/apache/openjpa/persistence/OpenJPAEnum.java
AU        openjpa-persistence/src/main/java/org/apache/openjpa/persistence/AutoClearType.java
AU        openjpa-persistence/src/main/java/org/apache/openjpa/persistence/AnnotationBuilder.java
AU        openjpa-persistence/src/main/java/org/apache/openjpa/persistence/PersistenceProviderImpl.java
AU        openjpa-persistence/src/main/java/org/apache/openjpa/persistence/AutoDetachType.java
AU        openjpa-persistence/src/main/java/org/apache/openjpa/persistence/XMLPersistenceMetaDataParser.java
AU        openjpa-persistence/src/main/java/org/apache/openjpa/persistence/OpenJPAEntityManager.java
AU        openjpa-persistence/src/main/java/org/apache/openjpa/persistence/Generator.java
AU        openjpa-persistence/src/main/java/org/apache/openjpa/persistence/PersistenceExceptions.java
AU        openjpa-persistence/src/main/java/org/apache/openjpa/persistence/QueryResultCache.java
AU        openjpa-persistence/src/main/java/org/apache/openjpa/persistence/KeyType.java
AU        openjpa-persistence/src/main/java/org/apache/openjpa/persistence/ElementType.java
AU        openjpa-persistence/src/main/java/org/apache/openjpa/persistence/PersistenceListenerAdapter.java
AU        openjpa-persistence/src/main/java/org/apache/openjpa/persistence/QueryTimeoutException.java
AU        openjpa-persistence/src/main/java/org/apache/openjpa/persistence/OpenJPAEntityTransaction.java
AU        openjpa-persistence/src/main/java/org/apache/openjpa/persistence/OpenJPAEntityManagerSPI.java
AU        openjpa-persistence/src/main/java/org/apache/openjpa/persistence/LRS.java
AU        openjpa-persistence/src/main/java/org/apache/openjpa/persistence/HintHandler.java
AU        openjpa-persistence/src/main/java/org/apache/openjpa/persistence/LoadFetchGroup.java
AU        openjpa-persistence/src/main/java/org/apache/openjpa/persistence/InverseLogical.java
AU        openjpa-persistence/src/main/java/org/apache/openjpa/persistence/OptimisticLockException.java
AU        openjpa-persistence/src/main/java/org/apache/openjpa/persistence/Externalizer.java
AU        openjpa-persistence/src/main/java/org/apache/openjpa/persistence/PersistentCollection.java
AU        openjpa-persistence/src/main/java/org/apache/openjpa/persistence/PersistenceMetaDataDefaults.java
AU        openjpa-persistence/src/main/java/org/apache/openjpa/persistence/LockTimeoutException.java
AU        openjpa-persistence/src/main/java/org/apache/openjpa/persistence/ElementDependent.java
AU        openjpa-persistence/src/main/java/org/apache/openjpa/persistence/TupleFactory.java
A         openjpa-persistence/src/main/java/org/apache/openjpa/persistence/osgi
AU        openjpa-persistence/src/main/java/org/apache/openjpa/persistence/osgi/PersistenceActivator.java
AU        openjpa-persistence/src/main/java/org/apache/openjpa/persistence/osgi/BundleDelegatingClassLoader.java
AU        openjpa-persistence/src/main/java/org/apache/openjpa/persistence/osgi/BundleUtils.java
AU        openjpa-persistence/src/main/java/org/apache/openjpa/persistence/osgi/package.html
AU        openjpa-persistence/src/main/java/org/apache/openjpa/persistence/OpenJPAQuery.java
AU        openjpa-persistence/src/main/java/org/apache/openjpa/persistence/FetchPlanImpl.java
AU        openjpa-persistence/src/main/java/org/apache/openjpa/persistence/JPAProperties.java
AU        openjpa-persistence/src/main/java/org/apache/openjpa/persistence/HintValueConverter.java
AU        openjpa-persistence/src/main/java/org/apache/openjpa/persistence/NoResultException.java
A         openjpa-persistence/src/main/appended-resources
A         openjpa-persistence/src/main/appended-resources/META-INF
AU        openjpa-persistence/src/main/appended-resources/META-INF/NOTICE.vm
AU        openjpa-persistence/src/main/appended-resources/META-INF/LICENSE.vm
A         openjpa-persistence/src/main/resources
A         openjpa-persistence/src/main/resources/META-INF
A         openjpa-persistence/src/main/resources/META-INF/services
A         openjpa-persistence/src/main/resources/META-INF/services/org.apache.openjpa.lib.conf.ProductDerivation
A         openjpa-persistence/src/main/resources/META-INF/services/javax.persistence.spi.PersistenceProvider
A         openjpa-persistence/src/main/resources/META-INF/services/org.apache.openjpa.kernel.exps.ExpressionParser
A         openjpa-persistence/src/main/resources/org
A         openjpa-persistence/src/main/resources/org/apache
A         openjpa-persistence/src/main/resources/org/apache/openjpa
A         openjpa-persistence/src/main/resources/org/apache/openjpa/persistence
AU        openjpa-persistence/src/main/resources/org/apache/openjpa/persistence/localizer.properties
A         openjpa-persistence/src/main/resources/org/apache/openjpa/persistence/orm-xsd.rsrc
A         openjpa-persistence/src/main/resources/org/apache/openjpa/persistence/orm_2_0-xsd.rsrc
A         openjpa-persistence/src/main/resources/org/apache/openjpa/persistence/criteria
AU        openjpa-persistence/src/main/resources/org/apache/openjpa/persistence/criteria/localizer.properties
AU        openjpa-persistence/src/main/resources/org/apache/openjpa/persistence/extendable-orm.xsd
AU        openjpa-persistence/src/main/resources/org/apache/openjpa/persistence/openjpa-orm.xsd
A         openjpa-persistence/src/main/resources/org/apache/openjpa/persistence/meta
AU        openjpa-persistence/src/main/resources/org/apache/openjpa/persistence/meta/localizer.properties
A         openjpa-persistence/src/main/resources/org/apache/openjpa/persistence/persistence-xsd.rsrc
A         openjpa-persistence/src/main/resources/org/apache/openjpa/persistence/persistence_2_0-xsd.rsrc
A         openjpa-persistence/src/main/resources/org/apache/openjpa/persistence/validation
AU        openjpa-persistence/src/main/resources/org/apache/openjpa/persistence/validation/localizer.properties
A         openjpa-persistence/src/main/resources/org/apache/openjpa/persistence/util
AU        openjpa-persistence/src/main/resources/org/apache/openjpa/persistence/util/localizer.properties
AU        openjpa-persistence/pom.xml
 U        .
At revision 1426417
Parsing POMs
[trunk] $ /home/hudson/tools/java/latest1.6/bin/java -Xmx1280m -XX:MaxPermSize=512m -cp /home/jenkins/jenkins-slave/maven-agent.jar:/home/jenkins/jenkins-slave/classworlds.jar hudson.maven.agent.Main /home/hudson/tools/maven/apache-maven-2.2.1 /x1/jenkins/jenkins-slave/slave.jar /home/jenkins/jenkins-slave/maven-interceptor.jar 36260 /home/jenkins/jenkins-slave/maven2.1-interceptor.jar
<===[JENKINS REMOTING CAPACITY]===>   channel started
log4j:WARN No appenders could be found for logger (org.apache.commons.beanutils.converters.BooleanConverter).
log4j:WARN Please initialize the log4j system properly.
Executing Maven:  -B -f <https://builds.apache.org/job/OpenJPA-trunk-deploy/ws/trunk/pom.xml> -Dmaven.repo.local=/home/jenkins/jenkins-slave/maven-repositories/0 clean deploy
[INFO] Scanning for projects...
[INFO] Reactor build order: 
[INFO]   OpenJPA Parent POM
[INFO]   OpenJPA Utilities Library
[INFO]   OpenJPA Kernel
[INFO]   OpenJPA JDBC
[INFO]   OpenJPA Persistence
[INFO]   OpenJPA Persistence JDBC
[INFO]   OpenJPA Persistence Locking Tests
[INFO]   OpenJPA tools
[INFO]   OpenJPA Maven Plugin
[INFO]   OpenJPA XML Store
[INFO]   OpenJPA Slice
[INFO]   OpenJPA JEST
[INFO]   OpenJPA Aggregate Jar
[INFO]   OpenJPA Aggregate Jar with Dependencies
[INFO]   OpenJPA Project Docs and Assemblies
[INFO]   OpenJPA Examples
[INFO]   OpenJPA Examples - Simple
[INFO]   OpenJPA Examples - image-gallery
[INFO]   OpenJPA Examples - OpenBooks
[INFO]   OpenJPA Integration Tests
[INFO]   OpenJPA Integration Tests - Daytrader
[INFO]   OpenJPA Integration Tests - Examples
[INFO]   OpenJPA Integration Tests - SLF4JLogFactory
[INFO]   OpenJPA Integration Tests - JPA TCK
[INFO]   OpenJPA Integration Tests - Bean Validation
[INFO]   OpenJPA Integration Tests - JMX Platform MBeans
[INFO]   OpenJPA Fetching Statistic Tool
[INFO]   OpenJPA Fetching Statistic Tool -- WAS Bundle
[INFO] ------------------------------------------------------------------------
[INFO] Building OpenJPA Parent POM
[INFO]    task-segment: [clean, deploy]
[INFO] ------------------------------------------------------------------------
[INFO] [clean:clean {execution: default-clean}]
[INFO] [buildnumber:create {execution: default}]
[INFO] Checking for local modifications: skipped.
[INFO] Updating project files from SCM: skipped.
[INFO] Executing: /bin/sh -c cd <https://builds.apache.org/job/OpenJPA-trunk-deploy/ws/trunk> && svn --non-interactive info
[INFO] Working directory: <https://builds.apache.org/job/OpenJPA-trunk-deploy/ws/trunk>
[INFO] Storing buildNumber: 1426352 at timestamp: December 28, 2012 at 6:55 AM
[INFO] Executing: /bin/sh -c cd <https://builds.apache.org/job/OpenJPA-trunk-deploy/ws/trunk> && svn --non-interactive info
[INFO] Working directory: <https://builds.apache.org/job/OpenJPA-trunk-deploy/ws/trunk>
[INFO] Storing buildScmBranch: trunk
[INFO] [enforcer:enforce {execution: default}]
[INFO] Setting property: classpath.resource.loader.class => 'org.codehaus.plexus.velocity.ContextClassLoaderResourceLoader'.
[INFO] Setting property: velocimacro.messages.on => 'false'.
[INFO] Setting property: resource.loader => 'classpath'.
[INFO] Setting property: resource.manager.logwhenfound => 'false'.
[INFO] [checkstyle:checkstyle {execution: default}]
[INFO] Source directory does not exist - skipping report.
[INFO] Setting property: classpath.resource.loader.class => 'org.codehaus.plexus.velocity.ContextClassLoaderResourceLoader'.
[INFO] Setting property: velocimacro.messages.on => 'false'.
[INFO] Setting property: resource.loader => 'classpath'.
[INFO] Setting property: resource.manager.logwhenfound => 'false'.
[INFO] [remote-resources:process {execution: default}]
[INFO] [compiler:testCompile {execution: test-source-compile}]
[INFO] No sources to compile
[INFO] [site:attach-descriptor {execution: default-attach-descriptor}]
[INFO] Unable to load parent project from a relative path: Could not find the model file '<https://builds.apache.org/job/OpenJPA-trunk-deploy/ws/pom.xml'.> for project unknown
[INFO] Parent project loaded from repository.
[INFO] [ianal:verify-legal-files {execution: default}]
[INFO] [apache-rat:check {execution: default}]
[INFO] Exclude: **/.*/**
[INFO] Exclude: **/target/**/*
[INFO] [install:install {execution: default-install}]
[INFO] Installing <https://builds.apache.org/job/OpenJPA-trunk-deploy/ws/trunk/pom.xml> to /home/jenkins/jenkins-slave/maven-repositories/0/org/apache/openjpa/openjpa-parent/2.3.0-SNAPSHOT/openjpa-parent-2.3.0-SNAPSHOT.pom
[INFO] [deploy:deploy {execution: default-deploy}]
[INFO] Retrieving previous build number from apache.snapshots.https
[WARNING] *** CHECKSUM FAILED - Checksum failed on download: local = 'dca127c398a98951020d5c712d3771e263f4db8f'; remote = '48e6618d234e38a2ccae5090f6a3e6c15f59c563' - RETRYING
[WARNING] *** CHECKSUM FAILED - Checksum failed on download: local = 'dca127c398a98951020d5c712d3771e263f4db8f'; remote = '48e6618d234e38a2ccae5090f6a3e6c15f59c563' - IGNORING
Uploading: https://repository.apache.org/content/repositories/snapshots/org/apache/openjpa/openjpa-parent/2.3.0-SNAPSHOT/openjpa-parent-2.3.0-20121228.065527-101.pom
52K uploaded  (openjpa-parent-2.3.0-20121228.065527-101.pom)
[INFO] Uploading site descriptor for openjpa-parent 2.3.0-20121228.065527-101 site.xml
[INFO] Retrieving previous metadata from apache.snapshots.https
[WARNING] *** CHECKSUM FAILED - Checksum failed on download: local = 'dca127c398a98951020d5c712d3771e263f4db8f'; remote = '48e6618d234e38a2ccae5090f6a3e6c15f59c563' - RETRYING
[WARNING] *** CHECKSUM FAILED - Checksum failed on download: local = 'dca127c398a98951020d5c712d3771e263f4db8f'; remote = '48e6618d234e38a2ccae5090f6a3e6c15f59c563' - IGNORING
[INFO] Uploading repository metadata for: 'snapshot org.apache.openjpa:openjpa-parent:2.3.0-SNAPSHOT'
[INFO] Retrieving previous metadata from apache.snapshots.https
[INFO] Uploading repository metadata for: 'artifact org.apache.openjpa:openjpa-parent'
[JENKINS] Archiving <https://builds.apache.org/job/OpenJPA-trunk-deploy/ws/trunk/pom.xml> to /home/hudson/hudson/jobs/OpenJPA-trunk-deploy/modules/org.apache.openjpa$openjpa-parent/builds/2012-12-28_06-55-04/archive/org.apache.openjpa/openjpa-parent/2.3.0-SNAPSHOT/openjpa-parent-2.3.0-SNAPSHOT.pom
[JENKINS] Archiving /home/jenkins/jenkins-slave/maven-repositories/0/org/apache/openjpa/openjpa-parent/2.3.0-SNAPSHOT/openjpa-parent-2.3.0-SNAPSHOT.pom to /home/hudson/hudson/jobs/OpenJPA-trunk-deploy/modules/org.apache.openjpa$openjpa-parent/builds/2012-12-28_06-55-04/archive/org.apache.openjpa/openjpa-parent/2.3.0-20121228.065527-101/openjpa-parent-2.3.0-20121228.065527-101.pom
[INFO] ------------------------------------------------------------------------
[INFO] Building OpenJPA Utilities Library
[INFO]    task-segment: [clean, deploy]
[INFO] ------------------------------------------------------------------------
[INFO] [clean:clean {execution: default-clean}]
[INFO] [buildnumber:create {execution: default}]
[INFO] [enforcer:enforce {execution: default}]
[INFO] [checkstyle:checkstyle {execution: default}]
[INFO] Starting audit...
Audit done.

[WARNING] Unable to locate Source XRef to link to - DISABLED
[INFO] [remote-resources:process {execution: default}]
[INFO] [resources:resources {execution: default-resources}]
[INFO] Using 'UTF-8' encoding to copy filtered resources.
[INFO] Copying 9 resources
[INFO] Copying 3 resources
[INFO] [compiler:compile {execution: default-compile}]
[INFO] Compiling 161 source files to <https://builds.apache.org/job/OpenJPA-trunk-deploy/ws/trunk/openjpa-lib/target/classes>
[INFO] -------------------------------------------------------------
[JENKINS] Archiving <https://builds.apache.org/job/OpenJPA-trunk-deploy/ws/trunk/openjpa-lib/pom.xml> to /home/hudson/hudson/jobs/OpenJPA-trunk-deploy/modules/org.apache.openjpa$openjpa-lib/builds/2012-12-28_06-55-04/archive/org.apache.openjpa/openjpa-lib/2.3.0-SNAPSHOT/openjpa-lib-2.3.0-SNAPSHOT.pom[ERROR] COMPILATION ERROR : 
[INFO] -------------------------------------------------------------

[ERROR] <https://builds.apache.org/job/OpenJPA-trunk-deploy/ws/trunk/openjpa-lib/src/main/java/org/apache/openjpa/lib/conf/Configuration.java>:[32,37] package org.apache.openjpa.persistence does not exist
[INFO] 1 error
[INFO] -------------------------------------------------------------
[INFO] ------------------------------------------------------------------------
[ERROR] BUILD FAILURE
[INFO] ------------------------------------------------------------------------
[INFO] Compilation failure
<https://builds.apache.org/job/OpenJPA-trunk-deploy/ws/trunk/openjpa-lib/src/main/java/org/apache/openjpa/lib/conf/Configuration.java>:[32,37] package org.apache.openjpa.persistence does not exist

[INFO] ------------------------------------------------------------------------
[INFO] For more information, run Maven with the -e switch
[INFO] ------------------------------------------------------------------------
[INFO] Total time: 22 seconds
[INFO] Finished at: Fri Dec 28 06:55:35 UTC 2012
[INFO] Final Memory: 60M/468M
[INFO] ------------------------------------------------------------------------
Waiting for Jenkins to finish collecting data
Sending e-mails to: commits@openjpa.apache.org
channel stopped

Build failed in Jenkins: OpenJPA-trunk-deploy #349

Posted by Apache Jenkins Server <je...@builds.apache.org>.
See <https://builds.apache.org/job/OpenJPA-trunk-deploy/349/changes>

Changes:

[ppoddar] Add javadoc comments

[ppoddar] OPENJPA-2057: Add additional class loader to configuration to load custom plugins

------------------------------------------
[...truncated 5906 lines...]
AU        openjpa-persistence/src/main/java/org/apache/openjpa/persistence/PersistenceProductDerivation.java
AU        openjpa-persistence/src/main/java/org/apache/openjpa/persistence/TupleImpl.java
AU        openjpa-persistence/src/main/java/org/apache/openjpa/persistence/MetaDataTag.java
AU        openjpa-persistence/src/main/java/org/apache/openjpa/persistence/OpenJPAEntityManagerFactory.java
AU        openjpa-persistence/src/main/java/org/apache/openjpa/persistence/ReadOnly.java
AU        openjpa-persistence/src/main/java/org/apache/openjpa/persistence/FetchAttribute.java
A         openjpa-persistence/src/main/java/org/apache/openjpa/persistence/package.html
AU        openjpa-persistence/src/main/java/org/apache/openjpa/persistence/Type.java
AU        openjpa-persistence/src/main/java/org/apache/openjpa/persistence/PessimisticLockException.java
AU        openjpa-persistence/src/main/java/org/apache/openjpa/persistence/QueryImpl.java
AU        openjpa-persistence/src/main/java/org/apache/openjpa/persistence/OpenJPAEntityManagerFactorySPI.java
AU        openjpa-persistence/src/main/java/org/apache/openjpa/persistence/FetchGroups.java
AU        openjpa-persistence/src/main/java/org/apache/openjpa/persistence/MixedLockLevelsHelper.java
AU        openjpa-persistence/src/main/java/org/apache/openjpa/persistence/EntityExistsException.java
AU        openjpa-persistence/src/main/java/org/apache/openjpa/persistence/DetachStateType.java
AU        openjpa-persistence/src/main/java/org/apache/openjpa/persistence/EntityManagerFactoryValue.java
A         openjpa-persistence/src/main/java/org/apache/openjpa/persistence/util
AU        openjpa-persistence/src/main/java/org/apache/openjpa/persistence/util/SourceCode.java
AU        openjpa-persistence/src/main/java/org/apache/openjpa/persistence/util/ReservedWords.java
AU        openjpa-persistence/src/main/java/org/apache/openjpa/persistence/util/package.html
AU        openjpa-persistence/src/main/java/org/apache/openjpa/persistence/DataCache.java
AU        openjpa-persistence/src/main/java/org/apache/openjpa/persistence/OpenJPAQuerySPI.java
AU        openjpa-persistence/src/main/java/org/apache/openjpa/persistence/ArgumentException.java
AU        openjpa-persistence/src/main/java/org/apache/openjpa/persistence/CallbackMode.java
AU        openjpa-persistence/src/main/java/org/apache/openjpa/persistence/OpenJPAPersistence.java
AU        openjpa-persistence/src/main/java/org/apache/openjpa/persistence/StoreCacheImpl.java
AU        openjpa-persistence/src/main/java/org/apache/openjpa/persistence/ExternalValues.java
AU        openjpa-persistence/src/main/java/org/apache/openjpa/persistence/ParameterImpl.java
AU        openjpa-persistence/src/main/java/org/apache/openjpa/persistence/TransactionRequiredException.java
AU        openjpa-persistence/src/main/java/org/apache/openjpa/persistence/LockScopesHelper.java
A         openjpa-persistence/src/main/java/org/apache/openjpa/persistence/meta
AU        openjpa-persistence/src/main/java/org/apache/openjpa/persistence/meta/AnnotationProcessor6.java
AU        openjpa-persistence/src/main/java/org/apache/openjpa/persistence/meta/MetadataProcessor.java
AU        openjpa-persistence/src/main/java/org/apache/openjpa/persistence/meta/AbstractManagedType.java
AU        openjpa-persistence/src/main/java/org/apache/openjpa/persistence/meta/Types.java
AU        openjpa-persistence/src/main/java/org/apache/openjpa/persistence/meta/CompileTimeLogger.java
AU        openjpa-persistence/src/main/java/org/apache/openjpa/persistence/meta/MetamodelImpl.java
AU        openjpa-persistence/src/main/java/org/apache/openjpa/persistence/meta/SourceAnnotationHandler.java
AU        openjpa-persistence/src/main/java/org/apache/openjpa/persistence/meta/Members.java
AU        openjpa-persistence/src/main/java/org/apache/openjpa/persistence/meta/package.html
AU        openjpa-persistence/src/main/java/org/apache/openjpa/persistence/EntityNotFoundException.java
AU        openjpa-persistence/src/main/java/org/apache/openjpa/persistence/GeneratorImpl.java
AU        openjpa-persistence/src/main/java/org/apache/openjpa/persistence/QueryResultCacheImpl.java
AU        openjpa-persistence/src/main/java/org/apache/openjpa/persistence/AnnotationPersistenceMetaDataSerializer.java
A         openjpa-persistence/src/main/java/org/apache/openjpa/persistence/validation
AU        openjpa-persistence/src/main/java/org/apache/openjpa/persistence/validation/ValidatorImpl.java
AU        openjpa-persistence/src/main/java/org/apache/openjpa/persistence/validation/ValidationUtils.java
AU        openjpa-persistence/src/main/java/org/apache/openjpa/persistence/validation/TraversableResolverImpl.java
AU        openjpa-persistence/src/main/java/org/apache/openjpa/persistence/KeyDependent.java
AU        openjpa-persistence/src/main/java/org/apache/openjpa/persistence/StoreCache.java
AU        openjpa-persistence/src/main/java/org/apache/openjpa/persistence/UpdateAction.java
AU        openjpa-persistence/src/main/java/org/apache/openjpa/persistence/OpenJPAEnum.java
AU        openjpa-persistence/src/main/java/org/apache/openjpa/persistence/AutoClearType.java
AU        openjpa-persistence/src/main/java/org/apache/openjpa/persistence/AnnotationBuilder.java
AU        openjpa-persistence/src/main/java/org/apache/openjpa/persistence/PersistenceProviderImpl.java
AU        openjpa-persistence/src/main/java/org/apache/openjpa/persistence/AutoDetachType.java
AU        openjpa-persistence/src/main/java/org/apache/openjpa/persistence/XMLPersistenceMetaDataParser.java
AU        openjpa-persistence/src/main/java/org/apache/openjpa/persistence/OpenJPAEntityManager.java
AU        openjpa-persistence/src/main/java/org/apache/openjpa/persistence/Generator.java
AU        openjpa-persistence/src/main/java/org/apache/openjpa/persistence/PersistenceExceptions.java
AU        openjpa-persistence/src/main/java/org/apache/openjpa/persistence/QueryResultCache.java
AU        openjpa-persistence/src/main/java/org/apache/openjpa/persistence/KeyType.java
AU        openjpa-persistence/src/main/java/org/apache/openjpa/persistence/ElementType.java
AU        openjpa-persistence/src/main/java/org/apache/openjpa/persistence/PersistenceListenerAdapter.java
AU        openjpa-persistence/src/main/java/org/apache/openjpa/persistence/QueryTimeoutException.java
AU        openjpa-persistence/src/main/java/org/apache/openjpa/persistence/OpenJPAEntityTransaction.java
AU        openjpa-persistence/src/main/java/org/apache/openjpa/persistence/OpenJPAEntityManagerSPI.java
AU        openjpa-persistence/src/main/java/org/apache/openjpa/persistence/LRS.java
AU        openjpa-persistence/src/main/java/org/apache/openjpa/persistence/HintHandler.java
AU        openjpa-persistence/src/main/java/org/apache/openjpa/persistence/LoadFetchGroup.java
AU        openjpa-persistence/src/main/java/org/apache/openjpa/persistence/InverseLogical.java
AU        openjpa-persistence/src/main/java/org/apache/openjpa/persistence/OptimisticLockException.java
AU        openjpa-persistence/src/main/java/org/apache/openjpa/persistence/Externalizer.java
AU        openjpa-persistence/src/main/java/org/apache/openjpa/persistence/PersistentCollection.java
AU        openjpa-persistence/src/main/java/org/apache/openjpa/persistence/PersistenceMetaDataDefaults.java
AU        openjpa-persistence/src/main/java/org/apache/openjpa/persistence/LockTimeoutException.java
AU        openjpa-persistence/src/main/java/org/apache/openjpa/persistence/ElementDependent.java
AU        openjpa-persistence/src/main/java/org/apache/openjpa/persistence/TupleFactory.java
A         openjpa-persistence/src/main/java/org/apache/openjpa/persistence/osgi
AU        openjpa-persistence/src/main/java/org/apache/openjpa/persistence/osgi/PersistenceActivator.java
AU        openjpa-persistence/src/main/java/org/apache/openjpa/persistence/osgi/BundleDelegatingClassLoader.java
AU        openjpa-persistence/src/main/java/org/apache/openjpa/persistence/osgi/BundleUtils.java
AU        openjpa-persistence/src/main/java/org/apache/openjpa/persistence/osgi/package.html
AU        openjpa-persistence/src/main/java/org/apache/openjpa/persistence/OpenJPAQuery.java
AU        openjpa-persistence/src/main/java/org/apache/openjpa/persistence/FetchPlanImpl.java
AU        openjpa-persistence/src/main/java/org/apache/openjpa/persistence/JPAProperties.java
AU        openjpa-persistence/src/main/java/org/apache/openjpa/persistence/HintValueConverter.java
AU        openjpa-persistence/src/main/java/org/apache/openjpa/persistence/NoResultException.java
A         openjpa-persistence/src/main/appended-resources
A         openjpa-persistence/src/main/appended-resources/META-INF
AU        openjpa-persistence/src/main/appended-resources/META-INF/NOTICE.vm
AU        openjpa-persistence/src/main/appended-resources/META-INF/LICENSE.vm
A         openjpa-persistence/src/main/resources
A         openjpa-persistence/src/main/resources/META-INF
A         openjpa-persistence/src/main/resources/META-INF/services
A         openjpa-persistence/src/main/resources/META-INF/services/org.apache.openjpa.lib.conf.ProductDerivation
A         openjpa-persistence/src/main/resources/META-INF/services/javax.persistence.spi.PersistenceProvider
A         openjpa-persistence/src/main/resources/META-INF/services/org.apache.openjpa.kernel.exps.ExpressionParser
A         openjpa-persistence/src/main/resources/org
A         openjpa-persistence/src/main/resources/org/apache
A         openjpa-persistence/src/main/resources/org/apache/openjpa
A         openjpa-persistence/src/main/resources/org/apache/openjpa/persistence
AU        openjpa-persistence/src/main/resources/org/apache/openjpa/persistence/localizer.properties
A         openjpa-persistence/src/main/resources/org/apache/openjpa/persistence/orm-xsd.rsrc
A         openjpa-persistence/src/main/resources/org/apache/openjpa/persistence/orm_2_0-xsd.rsrc
A         openjpa-persistence/src/main/resources/org/apache/openjpa/persistence/criteria
AU        openjpa-persistence/src/main/resources/org/apache/openjpa/persistence/criteria/localizer.properties
AU        openjpa-persistence/src/main/resources/org/apache/openjpa/persistence/extendable-orm.xsd
AU        openjpa-persistence/src/main/resources/org/apache/openjpa/persistence/openjpa-orm.xsd
A         openjpa-persistence/src/main/resources/org/apache/openjpa/persistence/meta
AU        openjpa-persistence/src/main/resources/org/apache/openjpa/persistence/meta/localizer.properties
A         openjpa-persistence/src/main/resources/org/apache/openjpa/persistence/persistence-xsd.rsrc
A         openjpa-persistence/src/main/resources/org/apache/openjpa/persistence/persistence_2_0-xsd.rsrc
A         openjpa-persistence/src/main/resources/org/apache/openjpa/persistence/validation
AU        openjpa-persistence/src/main/resources/org/apache/openjpa/persistence/validation/localizer.properties
A         openjpa-persistence/src/main/resources/org/apache/openjpa/persistence/util
AU        openjpa-persistence/src/main/resources/org/apache/openjpa/persistence/util/localizer.properties
AU        openjpa-persistence/pom.xml
 U        .
At revision 1425250
Parsing POMs
[trunk] $ /home/hudson/tools/java/latest1.6/bin/java -Xmx1280m -XX:MaxPermSize=512m -cp /home/jenkins/jenkins-slave/maven-agent.jar:/home/jenkins/jenkins-slave/classworlds.jar hudson.maven.agent.Main /home/hudson/tools/maven/apache-maven-2.2.1 /home/jenkins/jenkins-slave/slave.jar /home/jenkins/jenkins-slave/maven-interceptor.jar 55827 /home/jenkins/jenkins-slave/maven2.1-interceptor.jar
<===[JENKINS REMOTING CAPACITY]===>channel started
   log4j:WARN No appenders could be found for logger (org.apache.commons.beanutils.converters.BooleanConverter).
log4j:WARN Please initialize the log4j system properly.
Executing Maven:  -B -f <https://builds.apache.org/job/OpenJPA-trunk-deploy/ws/trunk/pom.xml> -Dmaven.repo.local=/home/jenkins/jenkins-slave/maven-repositories/0 clean deploy
[INFO] Scanning for projects...
[INFO] Reactor build order: 
[INFO]   OpenJPA Parent POM
[INFO]   OpenJPA Utilities Library
[INFO]   OpenJPA Kernel
[INFO]   OpenJPA JDBC
[INFO]   OpenJPA Persistence
[INFO]   OpenJPA Persistence JDBC
[INFO]   OpenJPA Persistence Locking Tests
[INFO]   OpenJPA tools
[INFO]   OpenJPA Maven Plugin
[INFO]   OpenJPA XML Store
[INFO]   OpenJPA Slice
[INFO]   OpenJPA JEST
[INFO]   OpenJPA Aggregate Jar
[INFO]   OpenJPA Aggregate Jar with Dependencies
[INFO]   OpenJPA Project Docs and Assemblies
[INFO]   OpenJPA Examples
[INFO]   OpenJPA Examples - Simple
[INFO]   OpenJPA Examples - image-gallery
[INFO]   OpenJPA Examples - OpenBooks
[INFO]   OpenJPA Integration Tests
[INFO]   OpenJPA Integration Tests - Daytrader
[INFO]   OpenJPA Integration Tests - Examples
[INFO]   OpenJPA Integration Tests - SLF4JLogFactory
[INFO]   OpenJPA Integration Tests - JPA TCK
[INFO]   OpenJPA Integration Tests - Bean Validation
[INFO]   OpenJPA Integration Tests - JMX Platform MBeans
[INFO]   OpenJPA Fetching Statistic Tool
[INFO]   OpenJPA Fetching Statistic Tool -- WAS Bundle
[INFO] ------------------------------------------------------------------------
[INFO] Building OpenJPA Parent POM
[INFO]    task-segment: [clean, deploy]
[INFO] ------------------------------------------------------------------------
[INFO] [clean:clean {execution: default-clean}]
[INFO] [buildnumber:create {execution: default}]
[INFO] Checking for local modifications: skipped.
[INFO] Updating project files from SCM: skipped.
[INFO] Executing: /bin/sh -c cd <https://builds.apache.org/job/OpenJPA-trunk-deploy/ws/trunk> && svn --non-interactive info
[INFO] Working directory: <https://builds.apache.org/job/OpenJPA-trunk-deploy/ws/trunk>
[INFO] Storing buildNumber: 1425073 at timestamp: December 22, 2012 at 6:48 AM
[INFO] Executing: /bin/sh -c cd <https://builds.apache.org/job/OpenJPA-trunk-deploy/ws/trunk> && svn --non-interactive info
[INFO] Working directory: <https://builds.apache.org/job/OpenJPA-trunk-deploy/ws/trunk>
[INFO] Storing buildScmBranch: trunk
[INFO] [enforcer:enforce {execution: default}]
[INFO] Setting property: classpath.resource.loader.class => 'org.codehaus.plexus.velocity.ContextClassLoaderResourceLoader'.
[INFO] Setting property: velocimacro.messages.on => 'false'.
[INFO] Setting property: resource.loader => 'classpath'.
[INFO] Setting property: resource.manager.logwhenfound => 'false'.
[INFO] [checkstyle:checkstyle {execution: default}]
[INFO] Source directory does not exist - skipping report.
[INFO] Setting property: classpath.resource.loader.class => 'org.codehaus.plexus.velocity.ContextClassLoaderResourceLoader'.
[INFO] Setting property: velocimacro.messages.on => 'false'.
[INFO] Setting property: resource.loader => 'classpath'.
[INFO] Setting property: resource.manager.logwhenfound => 'false'.
[INFO] [remote-resources:process {execution: default}]
[INFO] [compiler:testCompile {execution: test-source-compile}]
[INFO] No sources to compile
[INFO] [site:attach-descriptor {execution: default-attach-descriptor}]
[INFO] Unable to load parent project from a relative path: Could not find the model file '<https://builds.apache.org/job/OpenJPA-trunk-deploy/ws/pom.xml'.> for project unknown
[INFO] Parent project loaded from repository.
[INFO] [ianal:verify-legal-files {execution: default}]
[INFO] [apache-rat:check {execution: default}]
[INFO] Exclude: **/.*/**
[INFO] Exclude: **/target/**/*
[INFO] [install:install {execution: default-install}]
[INFO] Installing <https://builds.apache.org/job/OpenJPA-trunk-deploy/ws/trunk/pom.xml> to /home/jenkins/jenkins-slave/maven-repositories/0/org/apache/openjpa/openjpa-parent/2.3.0-SNAPSHOT/openjpa-parent-2.3.0-SNAPSHOT.pom
[INFO] [deploy:deploy {execution: default-deploy}]
[INFO] Retrieving previous build number from apache.snapshots.https
[WARNING] *** CHECKSUM FAILED - Checksum failed on download: local = '9d5fd65079bde97d007f19b48102fb8a7e46fcb0'; remote = '4ffde31c9ef0b5d2f51232c7e6e18d905b561fda' - RETRYING
[WARNING] *** CHECKSUM FAILED - Checksum failed on download: local = '9d5fd65079bde97d007f19b48102fb8a7e46fcb0'; remote = '4ffde31c9ef0b5d2f51232c7e6e18d905b561fda' - IGNORING
Uploading: https://repository.apache.org/content/repositories/snapshots/org/apache/openjpa/openjpa-parent/2.3.0-SNAPSHOT/openjpa-parent-2.3.0-20121222.064843-100.pom
52K uploaded  (openjpa-parent-2.3.0-20121222.064843-100.pom)
[INFO] Uploading site descriptor for openjpa-parent 2.3.0-20121222.064843-100 site.xml
[INFO] Retrieving previous metadata from apache.snapshots.https
[WARNING] *** CHECKSUM FAILED - Checksum failed on download: local = '9d5fd65079bde97d007f19b48102fb8a7e46fcb0'; remote = '4ffde31c9ef0b5d2f51232c7e6e18d905b561fda' - RETRYING
[WARNING] *** CHECKSUM FAILED - Checksum failed on download: local = '9d5fd65079bde97d007f19b48102fb8a7e46fcb0'; remote = '4ffde31c9ef0b5d2f51232c7e6e18d905b561fda' - IGNORING
[INFO] Uploading repository metadata for: 'snapshot org.apache.openjpa:openjpa-parent:2.3.0-SNAPSHOT'
[INFO] Retrieving previous metadata from apache.snapshots.https
[INFO] Uploading repository metadata for: 'artifact org.apache.openjpa:openjpa-parent'
[JENKINS] Archiving <https://builds.apache.org/job/OpenJPA-trunk-deploy/ws/trunk/pom.xml> to /home/hudson/hudson/jobs/OpenJPA-trunk-deploy/modules/org.apache.openjpa$openjpa-parent/builds/2012-12-22_06-47-48/archive/org.apache.openjpa/openjpa-parent/2.3.0-SNAPSHOT/openjpa-parent-2.3.0-SNAPSHOT.pom
[JENKINS] Archiving /home/jenkins/jenkins-slave/maven-repositories/0/org/apache/openjpa/openjpa-parent/2.3.0-SNAPSHOT/openjpa-parent-2.3.0-SNAPSHOT.pom to /home/hudson/hudson/jobs/OpenJPA-trunk-deploy/modules/org.apache.openjpa$openjpa-parent/builds/2012-12-22_06-47-48/archive/org.apache.openjpa/openjpa-parent/2.3.0-20121222.064843-100/openjpa-parent-2.3.0-20121222.064843-100.pom
[INFO] ------------------------------------------------------------------------
[INFO] Building OpenJPA Utilities Library
[INFO]    task-segment: [clean, deploy]
[INFO] ------------------------------------------------------------------------
[INFO] [clean:clean {execution: default-clean}]
[INFO] [buildnumber:create {execution: default}]
[INFO] [enforcer:enforce {execution: default}]
[INFO] [checkstyle:checkstyle {execution: default}]
[INFO] Starting audit...
Audit done.

[WARNING] Unable to locate Source XRef to link to - DISABLED
[INFO] [remote-resources:process {execution: default}]
[INFO] [resources:resources {execution: default-resources}]
[INFO] Using 'UTF-8' encoding to copy filtered resources.
[INFO] Copying 9 resources
[INFO] Copying 3 resources
[INFO] [compiler:compile {execution: default-compile}]
[INFO] Compiling 161 source files to <https://builds.apache.org/job/OpenJPA-trunk-deploy/ws/trunk/openjpa-lib/target/classes>
[INFO] -------------------------------------------------------------
[ERROR] COMPILATION ERROR : 
[INFO] -------------------------------------------------------------
[ERROR] <https://builds.apache.org/job/OpenJPA-trunk-deploy/ws/trunk/openjpa-lib/src/main/java/org/apache/openjpa/lib/conf/Configuration.java>:[32,37] package org.apache.openjpa.persistence does not exist
[INFO] 1 error
[INFO] -------------------------------------------------------------
[JENKINS] Archiving <https://builds.apache.org/job/OpenJPA-trunk-deploy/ws/trunk/openjpa-lib/pom.xml> to /home/hudson/hudson/jobs/OpenJPA-trunk-deploy/modules/org.apache.openjpa$openjpa-lib/builds/2012-12-22_06-47-48/archive/org.apache.openjpa/openjpa-lib/2.3.0-SNAPSHOT/openjpa-lib-2.3.0-SNAPSHOT.pom
[INFO] ------------------------------------------------------------------------
[ERROR] BUILD FAILURE
[INFO] ------------------------------------------------------------------------
[INFO] Compilation failure
<https://builds.apache.org/job/OpenJPA-trunk-deploy/ws/trunk/openjpa-lib/src/main/java/org/apache/openjpa/lib/conf/Configuration.java>:[32,37] package org.apache.openjpa.persistence does not exist

[INFO] ------------------------------------------------------------------------
[INFO] For more information, run Maven with the -e switch
[INFO] ------------------------------------------------------------------------
[INFO] Total time: 39 seconds
[INFO] Finished at: Sat Dec 22 06:48:59 UTC 2012
[INFO] Final Memory: 63M/482M
[INFO] ------------------------------------------------------------------------
Sending e-mails to: commits@openjpa.apache.org
channel stopped