You are viewing a plain text version of this content. The canonical link for it is here.
Posted to commits@sling.apache.org by Apache Jenkins Server <je...@builds.apache.org> on 2018/10/19 21:13:16 UTC

Build failed in Jenkins: sling-org-apache-sling-launchpad-testing-1.8 #226

See <https://builds.apache.org/job/sling-org-apache-sling-launchpad-testing-1.8/226/display/redirect?page=changes>

Changes:

[rombert] SLING-7935 - Consolidate all 'launchpad-testing' modules into a single

------------------------------------------
Started by an SCM change
[EnvInject] - Loading node environment variables.
Building remotely on H33 (ubuntu xenial) in workspace <https://builds.apache.org/job/sling-org-apache-sling-launchpad-testing-1.8/ws/>
[WS-CLEANUP] Deleting project workspace...
[WS-CLEANUP] Done
Cloning the remote Git repository
Cloning repository https://github.com/apache/sling-org-apache-sling-launchpad-testing.git
 > git init <https://builds.apache.org/job/sling-org-apache-sling-launchpad-testing-1.8/ws/> # timeout=10
Fetching upstream changes from https://github.com/apache/sling-org-apache-sling-launchpad-testing.git
 > git --version # timeout=10
 > git fetch --tags --progress https://github.com/apache/sling-org-apache-sling-launchpad-testing.git +refs/heads/*:refs/remotes/origin/*
 > git config remote.origin.url https://github.com/apache/sling-org-apache-sling-launchpad-testing.git # timeout=10
 > git config --add remote.origin.fetch +refs/heads/*:refs/remotes/origin/* # timeout=10
 > git config remote.origin.url https://github.com/apache/sling-org-apache-sling-launchpad-testing.git # timeout=10
Fetching upstream changes from https://github.com/apache/sling-org-apache-sling-launchpad-testing.git
 > git fetch --tags --progress https://github.com/apache/sling-org-apache-sling-launchpad-testing.git +refs/heads/*:refs/remotes/origin/*
 > git rev-parse origin/master^{commit} # timeout=10
Checking out Revision 19f71e11e2fa56ba723cb1797cb2c91e9ae3dd0a (origin/master)
 > git config core.sparsecheckout # timeout=10
 > git checkout -f 19f71e11e2fa56ba723cb1797cb2c91e9ae3dd0a
Commit message: "SLING-7935 - Consolidate all 'launchpad-testing' modules into a single git repository"
 > git rev-list --no-walk 138ff27264968dfab0e4ea4fa254838990e8e4b3 # timeout=10
Parsing POMs
Modules changed, recalculating dependency graph
Established TCP socket on 41141
maven33-agent.jar already up to date
maven33-interceptor.jar already up to date
maven3-interceptor-commons.jar already up to date
[sling-org-apache-sling-launchpad-testing-1.8] $ /home/jenkins/tools/java/latest1.8/bin/java -Xmx4g -Xms4g -cp /home/jenkins/jenkins-slave/maven33-agent.jar:/home/jenkins/tools/maven/apache-maven-3.3.9/boot/plexus-classworlds-2.5.2.jar:/home/jenkins/tools/maven/apache-maven-3.3.9/conf/logging jenkins.maven3.agent.Maven33Main /home/jenkins/tools/maven/apache-maven-3.3.9 /home/jenkins/jenkins-slave/slave.jar /home/jenkins/jenkins-slave/maven33-interceptor.jar /home/jenkins/jenkins-slave/maven3-interceptor-commons.jar 41141
<===[JENKINS REMOTING CAPACITY]===>   channel started
Executing Maven:  -B -f <https://builds.apache.org/job/sling-org-apache-sling-launchpad-testing-1.8/ws/pom.xml> -Dmaven.repo.local=/home/jenkins/jenkins-slave/maven-repositories/0 -U clean deploy
[INFO] Scanning for projects...
[INFO] Downloading: https://repo.maven.apache.org/maven2/org/apache/sling/org.apache.sling.launchpad.test-bundles/maven-metadata.xml
[INFO] Downloading: http://repository.apache.org/snapshots/org/apache/sling/org.apache.sling.launchpad.test-bundles/maven-metadata.xml
[INFO] Downloaded: https://repo.maven.apache.org/maven2/org/apache/sling/org.apache.sling.launchpad.test-bundles/maven-metadata.xml (393 B at 1.1 KB/sec)
[INFO] Downloaded: http://repository.apache.org/snapshots/org/apache/sling/org.apache.sling.launchpad.test-bundles/maven-metadata.xml (465 B at 1.1 KB/sec)
[INFO] Downloading: http://repository.apache.org/snapshots/org/apache/sling/org.apache.sling.launchpad.test-bundles/12-SNAPSHOT/maven-metadata.xml
[INFO] Downloaded: http://repository.apache.org/snapshots/org/apache/sling/org.apache.sling.launchpad.test-bundles/12-SNAPSHOT/maven-metadata.xml (1007 B at 3.4 KB/sec)
[INFO] Downloading: http://repository.apache.org/snapshots/org/apache/sling/org.apache.sling.launchpad.test-bundles/12-SNAPSHOT/org.apache.sling.launchpad.test-bundles-12-20181019.210539-1.txt
[INFO] Downloaded: http://repository.apache.org/snapshots/org/apache/sling/org.apache.sling.launchpad.test-bundles/12-SNAPSHOT/org.apache.sling.launchpad.test-bundles-12-20181019.210539-1.txt (2 KB at 5.3 KB/sec)
[INFO] Downloading: http://repository.apache.org/snapshots/org/apache/sling/org.apache.sling.starter/maven-metadata.xml
[INFO] Downloading: https://repo.maven.apache.org/maven2/org/apache/sling/org.apache.sling.starter/maven-metadata.xml
[INFO] Downloaded: https://repo.maven.apache.org/maven2/org/apache/sling/org.apache.sling.starter/maven-metadata.xml (338 B at 15.0 KB/sec)
[INFO] Downloaded: http://repository.apache.org/snapshots/org/apache/sling/org.apache.sling.starter/maven-metadata.xml (367 B at 1.2 KB/sec)
[INFO] Downloading: http://repository.apache.org/snapshots/org/apache/sling/org.apache.sling.starter/12-SNAPSHOT/maven-metadata.xml
[INFO] Downloaded: http://repository.apache.org/snapshots/org/apache/sling/org.apache.sling.starter/12-SNAPSHOT/maven-metadata.xml (2 KB at 4.7 KB/sec)
[INFO] Downloading: http://repository.apache.org/snapshots/org/apache/sling/org.apache.sling.starter/12-SNAPSHOT/org.apache.sling.starter-12-20181019.145904-1-slingfeature.txt
[INFO] Downloaded: http://repository.apache.org/snapshots/org/apache/sling/org.apache.sling.starter/12-SNAPSHOT/org.apache.sling.starter-12-20181019.145904-1-slingfeature.txt (50 KB at 159.7 KB/sec)
[INFO] Extended Maven classpath (scope 'provided') by the dependencies extracted from the Sling model.
[INFO]                                                                         
[INFO] ------------------------------------------------------------------------
[INFO] Building Apache Sling Launchpad Testing 12-SNAPSHOT
[INFO] ------------------------------------------------------------------------
[INFO] Downloading: http://repository.apache.org/snapshots/org/apache/sling/org.apache.sling.launchpad.integration-tests/12-SNAPSHOT/maven-metadata.xml
[INFO] Downloading: http://repository.apache.org/snapshots/org/apache/sling/org.apache.sling.launchpad.integration-tests/12-SNAPSHOT/org.apache.sling.launchpad.integration-tests-12-SNAPSHOT.pom
[WARNING] The POM for org.apache.sling:org.apache.sling.launchpad.integration-tests:jar:12-SNAPSHOT is missing, no dependency information available
[INFO] Downloading: http://repository.apache.org/snapshots/org/apache/sling/org.apache.sling.starter/12-SNAPSHOT/org.apache.sling.starter-12-20181019.145904-1.pom
[INFO] Downloaded: http://repository.apache.org/snapshots/org/apache/sling/org.apache.sling.starter/12-SNAPSHOT/org.apache.sling.starter-12-20181019.145904-1.pom (8 KB at 24.6 KB/sec)
[INFO] Downloading: http://repository.apache.org/snapshots/org/apache/sling/org.apache.sling.launchpad.test-bundles/12-SNAPSHOT/org.apache.sling.launchpad.test-bundles-12-20181019.210539-1.pom
[INFO] Downloaded: http://repository.apache.org/snapshots/org/apache/sling/org.apache.sling.launchpad.test-bundles/12-SNAPSHOT/org.apache.sling.launchpad.test-bundles-12-20181019.210539-1.pom (4 KB at 10.1 KB/sec)
[INFO] Downloading: https://repo.maven.apache.org/maven2/org/slf4j/log4j-over-slf4j/1.7.6/log4j-over-slf4j-1.7.6.pom
[INFO] Downloaded: https://repo.maven.apache.org/maven2/org/slf4j/log4j-over-slf4j/1.7.6/log4j-over-slf4j-1.7.6.pom (2 KB at 98.0 KB/sec)
[INFO] Downloading: https://repo.maven.apache.org/maven2/org/apache/felix/org.apache.felix.configadmin/1.9.10/org.apache.felix.configadmin-1.9.10.pom
[INFO] Downloaded: https://repo.maven.apache.org/maven2/org/apache/felix/org.apache.felix.configadmin/1.9.10/org.apache.felix.configadmin-1.9.10.pom (14 KB at 451.3 KB/sec)
[INFO] Downloading: https://repo.maven.apache.org/maven2/org/apache/sling/org.apache.sling.junit.remote/1.0.12/org.apache.sling.junit.remote-1.0.12.pom
[INFO] Downloaded: https://repo.maven.apache.org/maven2/org/apache/sling/org.apache.sling.junit.remote/1.0.12/org.apache.sling.junit.remote-1.0.12.pom (6 KB at 256.9 KB/sec)
[INFO] Downloading: https://repo.maven.apache.org/maven2/org/apache/sling/org.apache.sling.testing.tools/1.0.16/org.apache.sling.testing.tools-1.0.16.pom
[INFO] Downloaded: https://repo.maven.apache.org/maven2/org/apache/sling/org.apache.sling.testing.tools/1.0.16/org.apache.sling.testing.tools-1.0.16.pom (6 KB at 60.0 KB/sec)
[INFO] Downloading: https://repo.maven.apache.org/maven2/org/apache/sling/org.apache.sling.junit.scriptable/1.0.12/org.apache.sling.junit.scriptable-1.0.12.pom
[INFO] Downloaded: https://repo.maven.apache.org/maven2/org/apache/sling/org.apache.sling.junit.scriptable/1.0.12/org.apache.sling.junit.scriptable-1.0.12.pom (6 KB at 220.2 KB/sec)
[INFO] Downloading: http://repository.apache.org/snapshots/org/apache/sling/org.apache.sling.launchpad.test-fragment/maven-metadata.xml
[INFO] Downloading: https://repo.maven.apache.org/maven2/org/apache/sling/org.apache.sling.launchpad.test-fragment/maven-metadata.xml
[INFO] Downloaded: https://repo.maven.apache.org/maven2/org/apache/sling/org.apache.sling.launchpad.test-fragment/maven-metadata.xml (430 B at 21.0 KB/sec)
[INFO] Downloaded: http://repository.apache.org/snapshots/org/apache/sling/org.apache.sling.launchpad.test-fragment/maven-metadata.xml (550 B at 1.8 KB/sec)
[INFO] Downloading: http://repository.apache.org/snapshots/org/apache/sling/org.apache.sling.launchpad.test-fragment/12-SNAPSHOT/maven-metadata.xml
[INFO] Downloaded: http://repository.apache.org/snapshots/org/apache/sling/org.apache.sling.launchpad.test-fragment/12-SNAPSHOT/maven-metadata.xml (1008 B at 3.3 KB/sec)
[INFO] Downloading: http://repository.apache.org/snapshots/org/apache/sling/org.apache.sling.launchpad.test-fragment/12-SNAPSHOT/org.apache.sling.launchpad.test-fragment-12-20181019.171341-1.pom
[INFO] Downloaded: http://repository.apache.org/snapshots/org/apache/sling/org.apache.sling.launchpad.test-fragment/12-SNAPSHOT/org.apache.sling.launchpad.test-fragment-12-20181019.171341-1.pom (3 KB at 9.9 KB/sec)
[INFO] Downloading: http://repository.apache.org/snapshots/org/apache/sling/org.apache.sling.launchpad.test-services-war/maven-metadata.xml
[INFO] Downloading: https://repo.maven.apache.org/maven2/org/apache/sling/org.apache.sling.launchpad.test-services-war/maven-metadata.xml
[INFO] Downloaded: https://repo.maven.apache.org/maven2/org/apache/sling/org.apache.sling.launchpad.test-services-war/maven-metadata.xml (465 B at 23.9 KB/sec)
[INFO] Downloaded: http://repository.apache.org/snapshots/org/apache/sling/org.apache.sling.launchpad.test-services-war/maven-metadata.xml (594 B at 1.9 KB/sec)
[INFO] Downloading: http://repository.apache.org/snapshots/org/apache/sling/org.apache.sling.launchpad.test-services-war/12-SNAPSHOT/maven-metadata.xml
[INFO] Downloaded: http://repository.apache.org/snapshots/org/apache/sling/org.apache.sling.launchpad.test-services-war/12-SNAPSHOT/maven-metadata.xml (1012 B at 3.3 KB/sec)
[INFO] Downloading: http://repository.apache.org/snapshots/org/apache/sling/org.apache.sling.launchpad.test-services-war/12-SNAPSHOT/org.apache.sling.launchpad.test-services-war-12-20181019.171426-1.pom
[INFO] Downloaded: http://repository.apache.org/snapshots/org/apache/sling/org.apache.sling.launchpad.test-services-war/12-SNAPSHOT/org.apache.sling.launchpad.test-services-war-12-20181019.171426-1.pom (6 KB at 18.8 KB/sec)
[INFO] Downloading: http://repository.apache.org/snapshots/org/apache/sling/org.apache.sling.launchpad.test-services/maven-metadata.xml
[INFO] Downloading: https://repo.maven.apache.org/maven2/org/apache/sling/org.apache.sling.launchpad.test-services/maven-metadata.xml
[INFO] Downloaded: https://repo.maven.apache.org/maven2/org/apache/sling/org.apache.sling.launchpad.test-services/maven-metadata.xml (502 B at 24.5 KB/sec)
[INFO] Downloaded: http://repository.apache.org/snapshots/org/apache/sling/org.apache.sling.launchpad.test-services/maven-metadata.xml (590 B at 1.9 KB/sec)
[INFO] Downloading: http://repository.apache.org/snapshots/org/apache/sling/org.apache.sling.launchpad.test-services/12-SNAPSHOT/maven-metadata.xml
[INFO] Downloaded: http://repository.apache.org/snapshots/org/apache/sling/org.apache.sling.launchpad.test-services/12-SNAPSHOT/maven-metadata.xml (1008 B at 3.3 KB/sec)
[INFO] Downloading: http://repository.apache.org/snapshots/org/apache/sling/org.apache.sling.launchpad.test-services/12-SNAPSHOT/org.apache.sling.launchpad.test-services-12-20181019.165434-1.pom
[INFO] Downloaded: http://repository.apache.org/snapshots/org/apache/sling/org.apache.sling.launchpad.test-services/12-SNAPSHOT/org.apache.sling.launchpad.test-services-12-20181019.165434-1.pom (10 KB at 33.5 KB/sec)
[INFO] Downloading: https://repo.maven.apache.org/maven2/org/apache/sling/org.apache.sling.testing.samples.failingtests/1.0.6/org.apache.sling.testing.samples.failingtests-1.0.6.pom
[INFO] Downloaded: https://repo.maven.apache.org/maven2/org/apache/sling/org.apache.sling.testing.samples.failingtests/1.0.6/org.apache.sling.testing.samples.failingtests-1.0.6.pom (5 KB at 45.5 KB/sec)
[INFO] Downloading: https://repo.maven.apache.org/maven2/org/apache/sling/org.apache.sling.auth.form/1.0.12/org.apache.sling.auth.form-1.0.12.pom
[INFO] Downloaded: https://repo.maven.apache.org/maven2/org/apache/sling/org.apache.sling.auth.form/1.0.12/org.apache.sling.auth.form-1.0.12.pom (7 KB at 359.6 KB/sec)
[INFO] Downloading: https://repo.maven.apache.org/maven2/org/apache/sling/org.apache.sling.extensions.webconsolesecurityprovider/1.2.0/org.apache.sling.extensions.webconsolesecurityprovider-1.2.0.pom
[INFO] Downloaded: https://repo.maven.apache.org/maven2/org/apache/sling/org.apache.sling.extensions.webconsolesecurityprovider/1.2.0/org.apache.sling.extensions.webconsolesecurityprovider-1.2.0.pom (6 KB at 309.2 KB/sec)
[INFO] Downloading: https://repo.maven.apache.org/maven2/org/apache/sling/org.apache.sling.starter.content/1.0.2/org.apache.sling.starter.content-1.0.2.pom
[INFO] Downloaded: https://repo.maven.apache.org/maven2/org/apache/sling/org.apache.sling.starter.content/1.0.2/org.apache.sling.starter.content-1.0.2.pom (5 KB at 251.4 KB/sec)
[INFO] Downloading: https://repo.maven.apache.org/maven2/org/apache/felix/org.apache.felix.http.sslfilter/1.2.6/org.apache.felix.http.sslfilter-1.2.6.pom
[INFO] Downloaded: https://repo.maven.apache.org/maven2/org/apache/felix/org.apache.felix.http.sslfilter/1.2.6/org.apache.felix.http.sslfilter-1.2.6.pom (5 KB at 263.5 KB/sec)
[INFO] Downloading: https://repo.maven.apache.org/maven2/org/apache/felix/org.apache.felix.scr/2.1.12/org.apache.felix.scr-2.1.12.pom
[INFO] Downloaded: https://repo.maven.apache.org/maven2/org/apache/felix/org.apache.felix.scr/2.1.12/org.apache.felix.scr-2.1.12.pom (15 KB at 652.3 KB/sec)
[INFO] Downloading: http://repository.apache.org/snapshots/org/apache/sling/org.apache.sling.launchpad.integration-tests/12-SNAPSHOT/org.apache.sling.launchpad.integration-tests-12-SNAPSHOT.jar
[INFO] Downloading: http://repository.apache.org/snapshots/org/apache/sling/org.apache.sling.launchpad.test-fragment/12-SNAPSHOT/org.apache.sling.launchpad.test-fragment-12-20181019.171341-1.jar
[INFO] Downloading: http://repository.apache.org/snapshots/org/apache/sling/org.apache.sling.launchpad.test-services-war/12-SNAPSHOT/org.apache.sling.launchpad.test-services-war-12-20181019.171426-1.war
[INFO] Downloading: http://repository.apache.org/snapshots/org/apache/sling/org.apache.sling.launchpad.test-services/12-SNAPSHOT/org.apache.sling.launchpad.test-services-12-20181019.165434-1.jar
[INFO] Downloaded: http://repository.apache.org/snapshots/org/apache/sling/org.apache.sling.launchpad.test-fragment/12-SNAPSHOT/org.apache.sling.launchpad.test-fragment-12-20181019.171341-1.jar (9 KB at 30.0 KB/sec)
[INFO] Downloaded: http://repository.apache.org/snapshots/org/apache/sling/org.apache.sling.launchpad.test-services-war/12-SNAPSHOT/org.apache.sling.launchpad.test-services-war-12-20181019.171426-1.war (14 KB at 46.0 KB/sec)
[INFO] Downloaded: http://repository.apache.org/snapshots/org/apache/sling/org.apache.sling.launchpad.test-services/12-SNAPSHOT/org.apache.sling.launchpad.test-services-12-20181019.165434-1.jar (180 KB at 360.6 KB/sec)
[INFO] Downloading: https://repo.maven.apache.org/maven2/org/apache/felix/org.apache.felix.configadmin/1.9.10/org.apache.felix.configadmin-1.9.10.jar
[INFO] Downloading: https://repo.maven.apache.org/maven2/org/apache/sling/org.apache.sling.junit.remote/1.0.12/org.apache.sling.junit.remote-1.0.12.jar
[INFO] Downloading: https://repo.maven.apache.org/maven2/org/apache/sling/org.apache.sling.testing.tools/1.0.16/org.apache.sling.testing.tools-1.0.16.jar
[INFO] Downloading: https://repo.maven.apache.org/maven2/org/apache/sling/org.apache.sling.junit.scriptable/1.0.12/org.apache.sling.junit.scriptable-1.0.12.jar
[INFO] Downloading: https://repo.maven.apache.org/maven2/org/apache/sling/org.apache.sling.testing.samples.failingtests/1.0.6/org.apache.sling.testing.samples.failingtests-1.0.6.jar
[INFO] Downloaded: https://repo.maven.apache.org/maven2/org/apache/sling/org.apache.sling.testing.samples.failingtests/1.0.6/org.apache.sling.testing.samples.failingtests-1.0.6.jar (11 KB at 210.1 KB/sec)
[INFO] Downloading: https://repo.maven.apache.org/maven2/org/apache/sling/org.apache.sling.auth.form/1.0.12/org.apache.sling.auth.form-1.0.12.jar
[INFO] Downloaded: https://repo.maven.apache.org/maven2/org/apache/sling/org.apache.sling.junit.scriptable/1.0.12/org.apache.sling.junit.scriptable-1.0.12.jar (24 KB at 462.5 KB/sec)
[INFO] Downloading: https://repo.maven.apache.org/maven2/org/apache/sling/org.apache.sling.extensions.webconsolesecurityprovider/1.2.0/org.apache.sling.extensions.webconsolesecurityprovider-1.2.0.jar
[INFO] Downloaded: https://repo.maven.apache.org/maven2/org/apache/felix/org.apache.felix.configadmin/1.9.10/org.apache.felix.configadmin-1.9.10.jar (152 KB at 2714.0 KB/sec)
[INFO] Downloading: https://repo.maven.apache.org/maven2/org/apache/sling/org.apache.sling.starter.content/1.0.2/org.apache.sling.starter.content-1.0.2.jar
[INFO] Downloaded: https://repo.maven.apache.org/maven2/org/apache/sling/org.apache.sling.extensions.webconsolesecurityprovider/1.2.0/org.apache.sling.extensions.webconsolesecurityprovider-1.2.0.jar (24 KB at 341.3 KB/sec)
[INFO] Downloading: https://repo.maven.apache.org/maven2/org/apache/felix/org.apache.felix.http.sslfilter/1.2.6/org.apache.felix.http.sslfilter-1.2.6.jar
[INFO] Downloaded: https://repo.maven.apache.org/maven2/org/apache/sling/org.apache.sling.auth.form/1.0.12/org.apache.sling.auth.form-1.0.12.jar (59 KB at 783.8 KB/sec)
[INFO] Downloading: https://repo.maven.apache.org/maven2/org/apache/felix/org.apache.felix.scr/2.1.12/org.apache.felix.scr-2.1.12.jar
[INFO] Downloaded: https://repo.maven.apache.org/maven2/org/apache/felix/org.apache.felix.http.sslfilter/1.2.6/org.apache.felix.http.sslfilter-1.2.6.jar (25 KB at 276.6 KB/sec)
[INFO] Downloaded: https://repo.maven.apache.org/maven2/org/apache/sling/org.apache.sling.starter.content/1.0.2/org.apache.sling.starter.content-1.0.2.jar (144 KB at 1594.1 KB/sec)
[INFO] Downloaded: https://repo.maven.apache.org/maven2/org/apache/sling/org.apache.sling.junit.remote/1.0.12/org.apache.sling.junit.remote-1.0.12.jar (33 KB at 265.0 KB/sec)
[INFO] Downloaded: https://repo.maven.apache.org/maven2/org/apache/felix/org.apache.felix.scr/2.1.12/org.apache.felix.scr-2.1.12.jar (408 KB at 3042.7 KB/sec)
[INFO] Downloaded: https://repo.maven.apache.org/maven2/org/apache/sling/org.apache.sling.testing.tools/1.0.16/org.apache.sling.testing.tools-1.0.16.jar (79 KB at 390.7 KB/sec)
[WARNING] Attempt to (de-)serialize anonymous class hudson.maven.reporters.MavenArtifactArchiver$2; see: https://jenkins.io/redirect/serialization-of-anonymous-classes/
[JENKINS] Archiving disabled
[WARNING] Attempt to (de-)serialize anonymous class hudson.maven.reporters.MavenFingerprinter$1; see: https://jenkins.io/redirect/serialization-of-anonymous-classes/
[JENKINS] Archiving disabled
[INFO] ------------------------------------------------------------------------
[INFO] BUILD FAILURE
[INFO] ------------------------------------------------------------------------
[INFO] Total time: 18.776 s
[INFO] Finished at: 2018-10-19T21:13:13+00:00
[INFO] Final Memory: 70M/3925M
[INFO] ------------------------------------------------------------------------
Waiting for Jenkins to finish collecting data
[ERROR] Failed to execute goal on project org.apache.sling.launchpad.testing: Could not resolve dependencies for project org.apache.sling:org.apache.sling.launchpad.testing:slingstart:12-SNAPSHOT: Could not find artifact org.apache.sling:org.apache.sling.launchpad.integration-tests:jar:12-SNAPSHOT in Nexus (http://repository.apache.org/snapshots) -> [Help 1]
[ERROR] 
[ERROR] To see the full stack trace of the errors, re-run Maven with the -e switch.
[ERROR] Re-run Maven using the -X switch to enable full debug logging.
[ERROR] 
[ERROR] For more information about the errors and possible solutions, please read the following articles:
[ERROR] [Help 1] http://cwiki.apache.org/confluence/display/MAVEN/DependencyResolutionException
channel stopped
Archiving artifacts
Recording test results

Jenkins build is back to stable : sling-org-apache-sling-launchpad-testing-1.8 #249

Posted by Apache Jenkins Server <je...@builds.apache.org>.
See <https://builds.apache.org/job/sling-org-apache-sling-launchpad-testing-1.8/249/display/redirect?page=changes>


Jenkins build is still unstable: sling-org-apache-sling-launchpad-testing-1.8 #248

Posted by Apache Jenkins Server <je...@builds.apache.org>.
See <https://builds.apache.org/job/sling-org-apache-sling-launchpad-testing-1.8/248/display/redirect>


Jenkins build is still unstable: sling-org-apache-sling-launchpad-testing-1.8 #247

Posted by Apache Jenkins Server <je...@builds.apache.org>.
See <https://builds.apache.org/job/sling-org-apache-sling-launchpad-testing-1.8/247/display/redirect>


Jenkins build is still unstable: sling-org-apache-sling-launchpad-testing-1.8 #246

Posted by Apache Jenkins Server <je...@builds.apache.org>.
See <https://builds.apache.org/job/sling-org-apache-sling-launchpad-testing-1.8/246/display/redirect>


Jenkins build is still unstable: sling-org-apache-sling-launchpad-testing-1.8 #245

Posted by Apache Jenkins Server <je...@builds.apache.org>.
See <https://builds.apache.org/job/sling-org-apache-sling-launchpad-testing-1.8/245/display/redirect>


Jenkins build is still unstable: sling-org-apache-sling-launchpad-testing-1.8 #244

Posted by Apache Jenkins Server <je...@builds.apache.org>.
See <https://builds.apache.org/job/sling-org-apache-sling-launchpad-testing-1.8/244/display/redirect>


Jenkins build is still unstable: sling-org-apache-sling-launchpad-testing-1.8 #243

Posted by Apache Jenkins Server <je...@builds.apache.org>.
See <https://builds.apache.org/job/sling-org-apache-sling-launchpad-testing-1.8/243/display/redirect>


Jenkins build is still unstable: sling-org-apache-sling-launchpad-testing-1.8 #242

Posted by Apache Jenkins Server <je...@builds.apache.org>.
See <https://builds.apache.org/job/sling-org-apache-sling-launchpad-testing-1.8/242/display/redirect>


Jenkins build is still unstable: sling-org-apache-sling-launchpad-testing-1.8 #241

Posted by Apache Jenkins Server <je...@builds.apache.org>.
See <https://builds.apache.org/job/sling-org-apache-sling-launchpad-testing-1.8/241/display/redirect>


Jenkins build is still unstable: sling-org-apache-sling-launchpad-testing-1.8 #240

Posted by Apache Jenkins Server <je...@builds.apache.org>.
See <https://builds.apache.org/job/sling-org-apache-sling-launchpad-testing-1.8/240/display/redirect>


Jenkins build is still unstable: sling-org-apache-sling-launchpad-testing-1.8 #239

Posted by Apache Jenkins Server <je...@builds.apache.org>.
See <https://builds.apache.org/job/sling-org-apache-sling-launchpad-testing-1.8/239/display/redirect>


Jenkins build is still unstable: sling-org-apache-sling-launchpad-testing-1.8 #238

Posted by Apache Jenkins Server <je...@builds.apache.org>.
See <https://builds.apache.org/job/sling-org-apache-sling-launchpad-testing-1.8/238/display/redirect>


Jenkins build is still unstable: sling-org-apache-sling-launchpad-testing-1.8 #237

Posted by Apache Jenkins Server <je...@builds.apache.org>.
See <https://builds.apache.org/job/sling-org-apache-sling-launchpad-testing-1.8/237/display/redirect>


Jenkins build is still unstable: sling-org-apache-sling-launchpad-testing-1.8 #236

Posted by Apache Jenkins Server <je...@builds.apache.org>.
See <https://builds.apache.org/job/sling-org-apache-sling-launchpad-testing-1.8/236/display/redirect>


Jenkins build is still unstable: sling-org-apache-sling-launchpad-testing-1.8 #235

Posted by Apache Jenkins Server <je...@builds.apache.org>.
See <https://builds.apache.org/job/sling-org-apache-sling-launchpad-testing-1.8/235/display/redirect>


Jenkins build is still unstable: sling-org-apache-sling-launchpad-testing-1.8 #234

Posted by Apache Jenkins Server <je...@builds.apache.org>.
See <https://builds.apache.org/job/sling-org-apache-sling-launchpad-testing-1.8/234/display/redirect>


Jenkins build is still unstable: sling-org-apache-sling-launchpad-testing-1.8 #233

Posted by Apache Jenkins Server <je...@builds.apache.org>.
See <https://builds.apache.org/job/sling-org-apache-sling-launchpad-testing-1.8/233/display/redirect>


Jenkins build is unstable: sling-org-apache-sling-launchpad-testing-1.8 #232

Posted by Apache Jenkins Server <je...@builds.apache.org>.
See <https://builds.apache.org/job/sling-org-apache-sling-launchpad-testing-1.8/232/display/redirect>


Build failed in Jenkins: sling-org-apache-sling-launchpad-testing-1.8 #231

Posted by Apache Jenkins Server <je...@builds.apache.org>.
See <https://builds.apache.org/job/sling-org-apache-sling-launchpad-testing-1.8/231/display/redirect>

------------------------------------------
Started by upstream project "sling-org-apache-sling-launchpad-test-bundles-1.8" build number 67
originally caused by:
 Started by upstream project "sling-org-apache-sling-launchpad-test-services-1.8" build number 65
 originally caused by:
  Started by timer
[EnvInject] - Loading node environment variables.
Building remotely on ubuntu-4 (ubuntu trusty) in workspace <https://builds.apache.org/job/sling-org-apache-sling-launchpad-testing-1.8/ws/>
[WS-CLEANUP] Deleting project workspace...
[WS-CLEANUP] Done
Cloning the remote Git repository
Cloning repository https://github.com/apache/sling-org-apache-sling-launchpad-testing.git
 > git init <https://builds.apache.org/job/sling-org-apache-sling-launchpad-testing-1.8/ws/> # timeout=10
Fetching upstream changes from https://github.com/apache/sling-org-apache-sling-launchpad-testing.git
 > git --version # timeout=10
 > git fetch --tags --progress https://github.com/apache/sling-org-apache-sling-launchpad-testing.git +refs/heads/*:refs/remotes/origin/*
 > git config remote.origin.url https://github.com/apache/sling-org-apache-sling-launchpad-testing.git # timeout=10
 > git config --add remote.origin.fetch +refs/heads/*:refs/remotes/origin/* # timeout=10
 > git config remote.origin.url https://github.com/apache/sling-org-apache-sling-launchpad-testing.git # timeout=10
Fetching upstream changes from https://github.com/apache/sling-org-apache-sling-launchpad-testing.git
 > git fetch --tags --progress https://github.com/apache/sling-org-apache-sling-launchpad-testing.git +refs/heads/*:refs/remotes/origin/*
 > git rev-parse origin/master^{commit} # timeout=10
Checking out Revision 11a7575dedfad03e7e357506e8a44bc30a7b9de1 (origin/master)
 > git config core.sparsecheckout # timeout=10
 > git checkout -f 11a7575dedfad03e7e357506e8a44bc30a7b9de1
Commit message: "SLING-7935 - Consolidate all 'launchpad-testing' modules into a single git repository"
 > git rev-list --no-walk 11a7575dedfad03e7e357506e8a44bc30a7b9de1 # timeout=10
Parsing POMs
Established TCP socket on 35858
maven33-agent.jar already up to date
maven33-interceptor.jar already up to date
maven3-interceptor-commons.jar already up to date
[sling-org-apache-sling-launchpad-testing-1.8] $ /home/jenkins/tools/java/latest1.8/bin/java -Xmx4g -Xms4g -cp /home/jenkins/jenkins-slave/maven33-agent.jar:/home/jenkins/tools/maven/apache-maven-3.3.9/boot/plexus-classworlds-2.5.2.jar:/home/jenkins/tools/maven/apache-maven-3.3.9/conf/logging jenkins.maven3.agent.Maven33Main /home/jenkins/tools/maven/apache-maven-3.3.9 /home/jenkins/jenkins-slave/slave.jar /home/jenkins/jenkins-slave/maven33-interceptor.jar /home/jenkins/jenkins-slave/maven3-interceptor-commons.jar 35858
<===[JENKINS REMOTING CAPACITY]===>   channel started
Executing Maven:  -B -f <https://builds.apache.org/job/sling-org-apache-sling-launchpad-testing-1.8/ws/pom.xml> -Dmaven.repo.local=/home/jenkins/jenkins-slave/maven-repositories/1 -U clean deploy
[INFO] Scanning for projects...
[INFO] Downloading: http://repository.apache.org/snapshots/org/apache/sling/org.apache.sling.launchpad.test-bundles/12-SNAPSHOT/maven-metadata.xml
[INFO] Downloaded: http://repository.apache.org/snapshots/org/apache/sling/org.apache.sling.launchpad.test-bundles/12-SNAPSHOT/maven-metadata.xml (1007 B at 2.4 KB/sec)
[INFO] Downloading: http://repository.apache.org/snapshots/org/apache/sling/org.apache.sling.launchpad.test-bundles/12-SNAPSHOT/org.apache.sling.launchpad.test-bundles-12-20181022.062540-4.txt
[INFO] Downloaded: http://repository.apache.org/snapshots/org/apache/sling/org.apache.sling.launchpad.test-bundles/12-SNAPSHOT/org.apache.sling.launchpad.test-bundles-12-20181022.062540-4.txt (2 KB at 5.6 KB/sec)
[INFO] Downloading: http://repository.apache.org/snapshots/org/apache/sling/org.apache.sling.starter/12-SNAPSHOT/maven-metadata.xml
[INFO] Downloaded: http://repository.apache.org/snapshots/org/apache/sling/org.apache.sling.starter/12-SNAPSHOT/maven-metadata.xml (2 KB at 4.6 KB/sec)
[INFO] Extended Maven classpath (scope 'provided') by the dependencies extracted from the Sling model.
[INFO]                                                                         
[INFO] ------------------------------------------------------------------------
[INFO] Building Apache Sling Launchpad Testing 12-SNAPSHOT
[INFO] ------------------------------------------------------------------------
[INFO] Downloading: http://repository.apache.org/snapshots/org/apache/sling/org.apache.sling.launchpad.integration-tests/12-SNAPSHOT/maven-metadata.xml
[INFO] Downloading: http://repository.apache.org/snapshots/org/apache/sling/org.apache.sling.launchpad.integration-tests/12-SNAPSHOT/org.apache.sling.launchpad.integration-tests-12-SNAPSHOT.pom
[WARNING] The POM for org.apache.sling:org.apache.sling.launchpad.integration-tests:jar:12-SNAPSHOT is missing, no dependency information available
[INFO] Downloading: http://repository.apache.org/snapshots/org/apache/sling/org.apache.sling.launchpad.test-bundles/12-SNAPSHOT/org.apache.sling.launchpad.test-bundles-12-20181022.062540-4.pom
[INFO] Downloaded: http://repository.apache.org/snapshots/org/apache/sling/org.apache.sling.launchpad.test-bundles/12-SNAPSHOT/org.apache.sling.launchpad.test-bundles-12-20181022.062540-4.pom (4 KB at 10.7 KB/sec)
[INFO] Downloading: http://repository.apache.org/snapshots/org/apache/sling/org.apache.sling.launchpad.test-fragment/12-SNAPSHOT/maven-metadata.xml
[INFO] Downloaded: http://repository.apache.org/snapshots/org/apache/sling/org.apache.sling.launchpad.test-fragment/12-SNAPSHOT/maven-metadata.xml (1008 B at 3.3 KB/sec)
[INFO] Downloading: http://repository.apache.org/snapshots/org/apache/sling/org.apache.sling.launchpad.test-fragment/12-SNAPSHOT/org.apache.sling.launchpad.test-fragment-12-20181021.001545-2.pom
[INFO] Downloaded: http://repository.apache.org/snapshots/org/apache/sling/org.apache.sling.launchpad.test-fragment/12-SNAPSHOT/org.apache.sling.launchpad.test-fragment-12-20181021.001545-2.pom (3 KB at 9.6 KB/sec)
[INFO] Downloading: http://repository.apache.org/snapshots/org/apache/sling/org.apache.sling.launchpad.test-services-war/12-SNAPSHOT/maven-metadata.xml
[INFO] Downloaded: http://repository.apache.org/snapshots/org/apache/sling/org.apache.sling.launchpad.test-services-war/12-SNAPSHOT/maven-metadata.xml (1012 B at 3.2 KB/sec)
[INFO] Downloading: http://repository.apache.org/snapshots/org/apache/sling/org.apache.sling.launchpad.test-services/12-SNAPSHOT/maven-metadata.xml
[INFO] Downloaded: http://repository.apache.org/snapshots/org/apache/sling/org.apache.sling.launchpad.test-services/12-SNAPSHOT/maven-metadata.xml (1008 B at 3.3 KB/sec)
[INFO] Downloading: http://repository.apache.org/snapshots/org/apache/sling/org.apache.sling.launchpad.test-services/12-SNAPSHOT/org.apache.sling.launchpad.test-services-12-20181022.062437-2.pom
[INFO] Downloaded: http://repository.apache.org/snapshots/org/apache/sling/org.apache.sling.launchpad.test-services/12-SNAPSHOT/org.apache.sling.launchpad.test-services-12-20181022.062437-2.pom (10 KB at 33.5 KB/sec)
[INFO] Downloading: http://repository.apache.org/snapshots/org/apache/sling/org.apache.sling.launchpad.integration-tests/12-SNAPSHOT/org.apache.sling.launchpad.integration-tests-12-SNAPSHOT.jar
[INFO] Downloading: http://repository.apache.org/snapshots/org/apache/sling/org.apache.sling.launchpad.test-fragment/12-SNAPSHOT/org.apache.sling.launchpad.test-fragment-12-20181021.001545-2.jar
[INFO] Downloading: http://repository.apache.org/snapshots/org/apache/sling/org.apache.sling.launchpad.test-services/12-SNAPSHOT/org.apache.sling.launchpad.test-services-12-20181022.062437-2.jar
[INFO] Downloaded: http://repository.apache.org/snapshots/org/apache/sling/org.apache.sling.launchpad.test-fragment/12-SNAPSHOT/org.apache.sling.launchpad.test-fragment-12-20181021.001545-2.jar (9 KB at 30.9 KB/sec)
[INFO] Downloaded: http://repository.apache.org/snapshots/org/apache/sling/org.apache.sling.launchpad.test-services/12-SNAPSHOT/org.apache.sling.launchpad.test-services-12-20181022.062437-2.jar (180 KB at 368.6 KB/sec)
[WARNING] Attempt to (de-)serialize anonymous class hudson.maven.reporters.MavenArtifactArchiver$2; see: https://jenkins.io/redirect/serialization-of-anonymous-classes/
[JENKINS] Archiving disabled
[WARNING] Attempt to (de-)serialize anonymous class hudson.maven.reporters.MavenFingerprinter$1; see: https://jenkins.io/redirect/serialization-of-anonymous-classes/
[JENKINS] Archiving disabled
[INFO] ------------------------------------------------------------------------
[INFO] BUILD FAILURE
[INFO] ------------------------------------------------------------------------
[INFO] Total time: 22.820 s
[INFO] Finished at: 2018-10-22T06:26:52+00:00
[INFO] Final Memory: 58M/3925M
[INFO] ------------------------------------------------------------------------
Waiting for Jenkins to finish collecting data
[ERROR] Failed to execute goal on project org.apache.sling.launchpad.testing: Could not resolve dependencies for project org.apache.sling:org.apache.sling.launchpad.testing:slingstart:12-SNAPSHOT: Could not find artifact org.apache.sling:org.apache.sling.launchpad.integration-tests:jar:12-SNAPSHOT in Nexus (http://repository.apache.org/snapshots) -> [Help 1]
[ERROR] 
[ERROR] To see the full stack trace of the errors, re-run Maven with the -e switch.
[ERROR] Re-run Maven using the -X switch to enable full debug logging.
[ERROR] 
[ERROR] For more information about the errors and possible solutions, please read the following articles:
[ERROR] [Help 1] http://cwiki.apache.org/confluence/display/MAVEN/DependencyResolutionException
channel stopped
Archiving artifacts
Recording test results

Build failed in Jenkins: sling-org-apache-sling-launchpad-testing-1.8 #230

Posted by Apache Jenkins Server <je...@builds.apache.org>.
See <https://builds.apache.org/job/sling-org-apache-sling-launchpad-testing-1.8/230/display/redirect>

------------------------------------------
Started by timer
[EnvInject] - Loading node environment variables.
Building remotely on ubuntu-4 (ubuntu trusty) in workspace <https://builds.apache.org/job/sling-org-apache-sling-launchpad-testing-1.8/ws/>
[WS-CLEANUP] Deleting project workspace...
[WS-CLEANUP] Done
Cloning the remote Git repository
Cloning repository https://github.com/apache/sling-org-apache-sling-launchpad-testing.git
 > git init <https://builds.apache.org/job/sling-org-apache-sling-launchpad-testing-1.8/ws/> # timeout=10
Fetching upstream changes from https://github.com/apache/sling-org-apache-sling-launchpad-testing.git
 > git --version # timeout=10
 > git fetch --tags --progress https://github.com/apache/sling-org-apache-sling-launchpad-testing.git +refs/heads/*:refs/remotes/origin/*
 > git config remote.origin.url https://github.com/apache/sling-org-apache-sling-launchpad-testing.git # timeout=10
 > git config --add remote.origin.fetch +refs/heads/*:refs/remotes/origin/* # timeout=10
 > git config remote.origin.url https://github.com/apache/sling-org-apache-sling-launchpad-testing.git # timeout=10
Fetching upstream changes from https://github.com/apache/sling-org-apache-sling-launchpad-testing.git
 > git fetch --tags --progress https://github.com/apache/sling-org-apache-sling-launchpad-testing.git +refs/heads/*:refs/remotes/origin/*
 > git rev-parse origin/master^{commit} # timeout=10
Checking out Revision 11a7575dedfad03e7e357506e8a44bc30a7b9de1 (origin/master)
 > git config core.sparsecheckout # timeout=10
 > git checkout -f 11a7575dedfad03e7e357506e8a44bc30a7b9de1
Commit message: "SLING-7935 - Consolidate all 'launchpad-testing' modules into a single git repository"
 > git rev-list --no-walk 11a7575dedfad03e7e357506e8a44bc30a7b9de1 # timeout=10
Parsing POMs
Established TCP socket on 42783
maven33-agent.jar already up to date
maven33-interceptor.jar already up to date
maven3-interceptor-commons.jar already up to date
[sling-org-apache-sling-launchpad-testing-1.8] $ /home/jenkins/tools/java/latest1.8/bin/java -Xmx4g -Xms4g -cp /home/jenkins/jenkins-slave/maven33-agent.jar:/home/jenkins/tools/maven/apache-maven-3.3.9/boot/plexus-classworlds-2.5.2.jar:/home/jenkins/tools/maven/apache-maven-3.3.9/conf/logging jenkins.maven3.agent.Maven33Main /home/jenkins/tools/maven/apache-maven-3.3.9 /home/jenkins/jenkins-slave/slave.jar /home/jenkins/jenkins-slave/maven33-interceptor.jar /home/jenkins/jenkins-slave/maven3-interceptor-commons.jar 42783
<===[JENKINS REMOTING CAPACITY]===>   channel started
Executing Maven:  -B -f <https://builds.apache.org/job/sling-org-apache-sling-launchpad-testing-1.8/ws/pom.xml> -Dmaven.repo.local=/home/jenkins/jenkins-slave/maven-repositories/0 -U clean deploy
[INFO] Scanning for projects...
[INFO] Downloading: http://repository.apache.org/snapshots/org/apache/sling/org.apache.sling.launchpad.test-bundles/12-SNAPSHOT/maven-metadata.xml
[INFO] Downloaded: http://repository.apache.org/snapshots/org/apache/sling/org.apache.sling.launchpad.test-bundles/12-SNAPSHOT/maven-metadata.xml (1007 B at 2.1 KB/sec)
[INFO] Downloading: http://repository.apache.org/snapshots/org/apache/sling/org.apache.sling.launchpad.test-bundles/12-SNAPSHOT/org.apache.sling.launchpad.test-bundles-12-20181021.001650-3.txt
[INFO] Downloaded: http://repository.apache.org/snapshots/org/apache/sling/org.apache.sling.launchpad.test-bundles/12-SNAPSHOT/org.apache.sling.launchpad.test-bundles-12-20181021.001650-3.txt (2 KB at 5.1 KB/sec)
[INFO] Downloading: http://repository.apache.org/snapshots/org/apache/sling/org.apache.sling.starter/12-SNAPSHOT/maven-metadata.xml
[INFO] Downloaded: http://repository.apache.org/snapshots/org/apache/sling/org.apache.sling.starter/12-SNAPSHOT/maven-metadata.xml (2 KB at 4.0 KB/sec)
[INFO] Extended Maven classpath (scope 'provided') by the dependencies extracted from the Sling model.
[INFO]                                                                         
[INFO] ------------------------------------------------------------------------
[INFO] Building Apache Sling Launchpad Testing 12-SNAPSHOT
[INFO] ------------------------------------------------------------------------
[INFO] Downloading: http://repository.apache.org/snapshots/org/apache/sling/org.apache.sling.launchpad.integration-tests/12-SNAPSHOT/maven-metadata.xml
[INFO] Downloading: http://repository.apache.org/snapshots/org/apache/sling/org.apache.sling.launchpad.integration-tests/12-SNAPSHOT/org.apache.sling.launchpad.integration-tests-12-SNAPSHOT.pom
[WARNING] The POM for org.apache.sling:org.apache.sling.launchpad.integration-tests:jar:12-SNAPSHOT is missing, no dependency information available
[INFO] Downloading: http://repository.apache.org/snapshots/org/apache/sling/org.apache.sling.launchpad.test-bundles/12-SNAPSHOT/org.apache.sling.launchpad.test-bundles-12-20181021.001650-3.pom
[INFO] Downloaded: http://repository.apache.org/snapshots/org/apache/sling/org.apache.sling.launchpad.test-bundles/12-SNAPSHOT/org.apache.sling.launchpad.test-bundles-12-20181021.001650-3.pom (4 KB at 10.2 KB/sec)
[INFO] Downloading: http://repository.apache.org/snapshots/org/apache/sling/org.apache.sling.launchpad.test-fragment/12-SNAPSHOT/maven-metadata.xml
[INFO] Downloaded: http://repository.apache.org/snapshots/org/apache/sling/org.apache.sling.launchpad.test-fragment/12-SNAPSHOT/maven-metadata.xml (1008 B at 3.0 KB/sec)
[INFO] Downloading: http://repository.apache.org/snapshots/org/apache/sling/org.apache.sling.launchpad.test-fragment/12-SNAPSHOT/org.apache.sling.launchpad.test-fragment-12-20181021.001545-2.pom
[INFO] Downloaded: http://repository.apache.org/snapshots/org/apache/sling/org.apache.sling.launchpad.test-fragment/12-SNAPSHOT/org.apache.sling.launchpad.test-fragment-12-20181021.001545-2.pom (3 KB at 8.9 KB/sec)
[INFO] Downloading: http://repository.apache.org/snapshots/org/apache/sling/org.apache.sling.launchpad.test-services-war/12-SNAPSHOT/maven-metadata.xml
[INFO] Downloaded: http://repository.apache.org/snapshots/org/apache/sling/org.apache.sling.launchpad.test-services-war/12-SNAPSHOT/maven-metadata.xml (1012 B at 2.9 KB/sec)
[INFO] Downloading: http://repository.apache.org/snapshots/org/apache/sling/org.apache.sling.launchpad.test-services/12-SNAPSHOT/maven-metadata.xml
[INFO] Downloaded: http://repository.apache.org/snapshots/org/apache/sling/org.apache.sling.launchpad.test-services/12-SNAPSHOT/maven-metadata.xml (1008 B at 2.9 KB/sec)
[INFO] Downloading: http://repository.apache.org/snapshots/org/apache/sling/org.apache.sling.launchpad.integration-tests/12-SNAPSHOT/org.apache.sling.launchpad.integration-tests-12-SNAPSHOT.jar
[INFO] Downloading: http://repository.apache.org/snapshots/org/apache/sling/org.apache.sling.launchpad.test-fragment/12-SNAPSHOT/org.apache.sling.launchpad.test-fragment-12-20181021.001545-2.jar
[INFO] Downloaded: http://repository.apache.org/snapshots/org/apache/sling/org.apache.sling.launchpad.test-fragment/12-SNAPSHOT/org.apache.sling.launchpad.test-fragment-12-20181021.001545-2.jar (9 KB at 28.8 KB/sec)
[WARNING] Attempt to (de-)serialize anonymous class hudson.maven.reporters.MavenArtifactArchiver$2; see: https://jenkins.io/redirect/serialization-of-anonymous-classes/
[JENKINS] Archiving disabled
[WARNING] Attempt to (de-)serialize anonymous class hudson.maven.reporters.MavenFingerprinter$1; see: https://jenkins.io/redirect/serialization-of-anonymous-classes/
[JENKINS] Archiving disabled
[INFO] ------------------------------------------------------------------------
[INFO] BUILD FAILURE
[INFO] ------------------------------------------------------------------------
[INFO] Total time: 16.459 s
[INFO] Finished at: 2018-10-21T15:11:58+00:00
[INFO] Final Memory: 68M/3925M
[INFO] ------------------------------------------------------------------------
Waiting for Jenkins to finish collecting data
[ERROR] Failed to execute goal on project org.apache.sling.launchpad.testing: Could not resolve dependencies for project org.apache.sling:org.apache.sling.launchpad.testing:slingstart:12-SNAPSHOT: Could not find artifact org.apache.sling:org.apache.sling.launchpad.integration-tests:jar:12-SNAPSHOT in Nexus (http://repository.apache.org/snapshots) -> [Help 1]
[ERROR] 
[ERROR] To see the full stack trace of the errors, re-run Maven with the -e switch.
[ERROR] Re-run Maven using the -X switch to enable full debug logging.
[ERROR] 
[ERROR] For more information about the errors and possible solutions, please read the following articles:
[ERROR] [Help 1] http://cwiki.apache.org/confluence/display/MAVEN/DependencyResolutionException
channel stopped
Archiving artifacts
Recording test results

Build failed in Jenkins: sling-org-apache-sling-launchpad-testing-1.8 #229

Posted by Apache Jenkins Server <je...@builds.apache.org>.
See <https://builds.apache.org/job/sling-org-apache-sling-launchpad-testing-1.8/229/display/redirect>

------------------------------------------
Started by upstream project "sling-org-apache-sling-launchpad-test-bundles-1.8" build number 66
originally caused by:
 Started by upstream project "sling-org-apache-sling-launchpad-test-fragment-1.8" build number 59
 originally caused by:
  Started by timer
[EnvInject] - Loading node environment variables.
Building remotely on H38 (ubuntu xenial) in workspace <https://builds.apache.org/job/sling-org-apache-sling-launchpad-testing-1.8/ws/>
[WS-CLEANUP] Deleting project workspace...
Cloning the remote Git repository
Cloning repository https://github.com/apache/sling-org-apache-sling-launchpad-testing.git
 > git init <https://builds.apache.org/job/sling-org-apache-sling-launchpad-testing-1.8/ws/> # timeout=10
Fetching upstream changes from https://github.com/apache/sling-org-apache-sling-launchpad-testing.git
 > git --version # timeout=10
 > git fetch --tags --progress https://github.com/apache/sling-org-apache-sling-launchpad-testing.git +refs/heads/*:refs/remotes/origin/*
 > git config remote.origin.url https://github.com/apache/sling-org-apache-sling-launchpad-testing.git # timeout=10
 > git config --add remote.origin.fetch +refs/heads/*:refs/remotes/origin/* # timeout=10
 > git config remote.origin.url https://github.com/apache/sling-org-apache-sling-launchpad-testing.git # timeout=10
Fetching upstream changes from https://github.com/apache/sling-org-apache-sling-launchpad-testing.git
 > git fetch --tags --progress https://github.com/apache/sling-org-apache-sling-launchpad-testing.git +refs/heads/*:refs/remotes/origin/*
 > git rev-parse origin/master^{commit} # timeout=10
Checking out Revision 11a7575dedfad03e7e357506e8a44bc30a7b9de1 (origin/master)
 > git config core.sparsecheckout # timeout=10
 > git checkout -f 11a7575dedfad03e7e357506e8a44bc30a7b9de1
Commit message: "SLING-7935 - Consolidate all 'launchpad-testing' modules into a single git repository"
 > git rev-list --no-walk 11a7575dedfad03e7e357506e8a44bc30a7b9de1 # timeout=10
Parsing POMs
Established TCP socket on 39812
maven33-agent.jar already up to date
maven33-interceptor.jar already up to date
maven3-interceptor-commons.jar already up to date
[sling-org-apache-sling-launchpad-testing-1.8] $ /home/jenkins/tools/java/latest1.8/bin/java -Xmx4g -Xms4g -cp /home/jenkins/jenkins-slave/maven33-agent.jar:/home/jenkins/tools/maven/apache-maven-3.3.9/boot/plexus-classworlds-2.5.2.jar:/home/jenkins/tools/maven/apache-maven-3.3.9/conf/logging jenkins.maven3.agent.Maven33Main /home/jenkins/tools/maven/apache-maven-3.3.9 /home/jenkins/jenkins-slave/slave.jar /home/jenkins/jenkins-slave/maven33-interceptor.jar /home/jenkins/jenkins-slave/maven3-interceptor-commons.jar 39812
<===[JENKINS REMOTING CAPACITY]===>   channel started
Executing Maven:  -B -f <https://builds.apache.org/job/sling-org-apache-sling-launchpad-testing-1.8/ws/pom.xml> -Dmaven.repo.local=/home/jenkins/jenkins-slave/maven-repositories/1 -U clean deploy
[INFO] Scanning for projects...
[INFO] Downloading: http://repository.apache.org/snapshots/org/apache/sling/org.apache.sling.launchpad.test-bundles/12-SNAPSHOT/maven-metadata.xml
[INFO] Downloaded: http://repository.apache.org/snapshots/org/apache/sling/org.apache.sling.launchpad.test-bundles/12-SNAPSHOT/maven-metadata.xml (1007 B at 2.4 KB/sec)
[INFO] Downloading: http://repository.apache.org/snapshots/org/apache/sling/org.apache.sling.launchpad.test-bundles/12-SNAPSHOT/org.apache.sling.launchpad.test-bundles-12-20181021.001650-3.txt
[INFO] Downloaded: http://repository.apache.org/snapshots/org/apache/sling/org.apache.sling.launchpad.test-bundles/12-SNAPSHOT/org.apache.sling.launchpad.test-bundles-12-20181021.001650-3.txt (2 KB at 5.5 KB/sec)
[INFO] Downloading: http://repository.apache.org/snapshots/org/apache/sling/org.apache.sling.starter/12-SNAPSHOT/maven-metadata.xml
[INFO] Downloaded: http://repository.apache.org/snapshots/org/apache/sling/org.apache.sling.starter/12-SNAPSHOT/maven-metadata.xml (2 KB at 4.4 KB/sec)
[INFO] Extended Maven classpath (scope 'provided') by the dependencies extracted from the Sling model.
[INFO]                                                                         
[INFO] ------------------------------------------------------------------------
[INFO] Building Apache Sling Launchpad Testing 12-SNAPSHOT
[INFO] ------------------------------------------------------------------------
[INFO] Downloading: https://repo.maven.apache.org/maven2/org/codehaus/mojo/animal-sniffer-maven-plugin/1.16/animal-sniffer-maven-plugin-1.16.pom
[INFO] Downloaded: https://repo.maven.apache.org/maven2/org/codehaus/mojo/animal-sniffer-maven-plugin/1.16/animal-sniffer-maven-plugin-1.16.pom (6 KB at 16.8 KB/sec)
[INFO] Downloading: https://repo.maven.apache.org/maven2/org/codehaus/mojo/animal-sniffer-parent/1.16/animal-sniffer-parent-1.16.pom
[INFO] Downloaded: https://repo.maven.apache.org/maven2/org/codehaus/mojo/animal-sniffer-parent/1.16/animal-sniffer-parent-1.16.pom (6 KB at 236.1 KB/sec)
[INFO] Downloading: https://repo.maven.apache.org/maven2/org/codehaus/mojo/mojo-parent/36/mojo-parent-36.pom
[INFO] Downloaded: https://repo.maven.apache.org/maven2/org/codehaus/mojo/mojo-parent/36/mojo-parent-36.pom (28 KB at 699.9 KB/sec)
[INFO] Downloading: https://repo.maven.apache.org/maven2/org/codehaus/mojo/animal-sniffer-maven-plugin/1.16/animal-sniffer-maven-plugin-1.16.jar
[INFO] Downloaded: https://repo.maven.apache.org/maven2/org/codehaus/mojo/animal-sniffer-maven-plugin/1.16/animal-sniffer-maven-plugin-1.16.jar (33 KB at 971.0 KB/sec)
[INFO] Downloading: http://repository.apache.org/snapshots/org/apache/sling/org.apache.sling.launchpad.integration-tests/12-SNAPSHOT/maven-metadata.xml
[INFO] Downloading: http://repository.apache.org/snapshots/org/apache/sling/org.apache.sling.launchpad.integration-tests/12-SNAPSHOT/org.apache.sling.launchpad.integration-tests-12-SNAPSHOT.pom
[WARNING] The POM for org.apache.sling:org.apache.sling.launchpad.integration-tests:jar:12-SNAPSHOT is missing, no dependency information available
[INFO] Downloading: http://repository.apache.org/snapshots/org/apache/sling/org.apache.sling.launchpad.test-bundles/12-SNAPSHOT/org.apache.sling.launchpad.test-bundles-12-20181021.001650-3.pom
[INFO] Downloaded: http://repository.apache.org/snapshots/org/apache/sling/org.apache.sling.launchpad.test-bundles/12-SNAPSHOT/org.apache.sling.launchpad.test-bundles-12-20181021.001650-3.pom (4 KB at 10.8 KB/sec)
[INFO] Downloading: http://repository.apache.org/snapshots/org/apache/sling/org.apache.sling.launchpad.test-fragment/12-SNAPSHOT/maven-metadata.xml
[INFO] Downloaded: http://repository.apache.org/snapshots/org/apache/sling/org.apache.sling.launchpad.test-fragment/12-SNAPSHOT/maven-metadata.xml (1008 B at 3.2 KB/sec)
[INFO] Downloading: http://repository.apache.org/snapshots/org/apache/sling/org.apache.sling.launchpad.test-fragment/12-SNAPSHOT/org.apache.sling.launchpad.test-fragment-12-20181021.001545-2.pom
[INFO] Downloaded: http://repository.apache.org/snapshots/org/apache/sling/org.apache.sling.launchpad.test-fragment/12-SNAPSHOT/org.apache.sling.launchpad.test-fragment-12-20181021.001545-2.pom (3 KB at 9.5 KB/sec)
[INFO] Downloading: http://repository.apache.org/snapshots/org/apache/sling/org.apache.sling.launchpad.test-services-war/12-SNAPSHOT/maven-metadata.xml
[INFO] Downloaded: http://repository.apache.org/snapshots/org/apache/sling/org.apache.sling.launchpad.test-services-war/12-SNAPSHOT/maven-metadata.xml (1012 B at 3.5 KB/sec)
[INFO] Downloading: http://repository.apache.org/snapshots/org/apache/sling/org.apache.sling.launchpad.test-services/12-SNAPSHOT/maven-metadata.xml
[INFO] Downloaded: http://repository.apache.org/snapshots/org/apache/sling/org.apache.sling.launchpad.test-services/12-SNAPSHOT/maven-metadata.xml (1008 B at 3.3 KB/sec)
[INFO] Downloading: http://repository.apache.org/snapshots/org/apache/sling/org.apache.sling.launchpad.integration-tests/12-SNAPSHOT/org.apache.sling.launchpad.integration-tests-12-SNAPSHOT.jar
[INFO] Downloading: http://repository.apache.org/snapshots/org/apache/sling/org.apache.sling.launchpad.test-fragment/12-SNAPSHOT/org.apache.sling.launchpad.test-fragment-12-20181021.001545-2.jar
[INFO] Downloaded: http://repository.apache.org/snapshots/org/apache/sling/org.apache.sling.launchpad.test-fragment/12-SNAPSHOT/org.apache.sling.launchpad.test-fragment-12-20181021.001545-2.jar (9 KB at 30.6 KB/sec)
[WARNING] Attempt to (de-)serialize anonymous class hudson.maven.reporters.MavenArtifactArchiver$2; see: https://jenkins.io/redirect/serialization-of-anonymous-classes/
[JENKINS] Archiving disabled
[WARNING] Attempt to (de-)serialize anonymous class hudson.maven.reporters.MavenFingerprinter$1; see: https://jenkins.io/redirect/serialization-of-anonymous-classes/
[JENKINS] Archiving disabled
[INFO] ------------------------------------------------------------------------
[INFO] BUILD FAILURE
[INFO] ------------------------------------------------------------------------
[INFO] Total time: 14.328 s
[INFO] Finished at: 2018-10-21T00:18:00+00:00
[INFO] Final Memory: 60M/3925M
[INFO] ------------------------------------------------------------------------
Waiting for Jenkins to finish collecting data
[ERROR] Failed to execute goal on project org.apache.sling.launchpad.testing: Could not resolve dependencies for project org.apache.sling:org.apache.sling.launchpad.testing:slingstart:12-SNAPSHOT: Could not find artifact org.apache.sling:org.apache.sling.launchpad.integration-tests:jar:12-SNAPSHOT in Nexus (http://repository.apache.org/snapshots) -> [Help 1]
[ERROR] 
[ERROR] To see the full stack trace of the errors, re-run Maven with the -e switch.
[ERROR] Re-run Maven using the -X switch to enable full debug logging.
[ERROR] 
[ERROR] For more information about the errors and possible solutions, please read the following articles:
[ERROR] [Help 1] http://cwiki.apache.org/confluence/display/MAVEN/DependencyResolutionException
channel stopped
Archiving artifacts
Recording test results

Build failed in Jenkins: sling-org-apache-sling-launchpad-testing-1.8 #228

Posted by Apache Jenkins Server <je...@builds.apache.org>.
See <https://builds.apache.org/job/sling-org-apache-sling-launchpad-testing-1.8/228/display/redirect>

------------------------------------------
Started by upstream project "sling-org-apache-sling-starter-1.8" build number 183
originally caused by:
 Started by timer
[EnvInject] - Loading node environment variables.
Building remotely on ubuntu-4 (ubuntu trusty) in workspace <https://builds.apache.org/job/sling-org-apache-sling-launchpad-testing-1.8/ws/>
[WS-CLEANUP] Deleting project workspace...
[WS-CLEANUP] Done
Cloning the remote Git repository
Cloning repository https://github.com/apache/sling-org-apache-sling-launchpad-testing.git
 > git init <https://builds.apache.org/job/sling-org-apache-sling-launchpad-testing-1.8/ws/> # timeout=10
Fetching upstream changes from https://github.com/apache/sling-org-apache-sling-launchpad-testing.git
 > git --version # timeout=10
 > git fetch --tags --progress https://github.com/apache/sling-org-apache-sling-launchpad-testing.git +refs/heads/*:refs/remotes/origin/*
 > git config remote.origin.url https://github.com/apache/sling-org-apache-sling-launchpad-testing.git # timeout=10
 > git config --add remote.origin.fetch +refs/heads/*:refs/remotes/origin/* # timeout=10
 > git config remote.origin.url https://github.com/apache/sling-org-apache-sling-launchpad-testing.git # timeout=10
Fetching upstream changes from https://github.com/apache/sling-org-apache-sling-launchpad-testing.git
 > git fetch --tags --progress https://github.com/apache/sling-org-apache-sling-launchpad-testing.git +refs/heads/*:refs/remotes/origin/*
 > git rev-parse origin/master^{commit} # timeout=10
Checking out Revision 11a7575dedfad03e7e357506e8a44bc30a7b9de1 (origin/master)
 > git config core.sparsecheckout # timeout=10
 > git checkout -f 11a7575dedfad03e7e357506e8a44bc30a7b9de1
Commit message: "SLING-7935 - Consolidate all 'launchpad-testing' modules into a single git repository"
 > git rev-list --no-walk 11a7575dedfad03e7e357506e8a44bc30a7b9de1 # timeout=10
Parsing POMs
Established TCP socket on 36931
maven33-agent.jar already up to date
maven33-interceptor.jar already up to date
maven3-interceptor-commons.jar already up to date
[sling-org-apache-sling-launchpad-testing-1.8] $ /home/jenkins/tools/java/latest1.8/bin/java -Xmx4g -Xms4g -cp /home/jenkins/jenkins-slave/maven33-agent.jar:/home/jenkins/tools/maven/apache-maven-3.3.9/boot/plexus-classworlds-2.5.2.jar:/home/jenkins/tools/maven/apache-maven-3.3.9/conf/logging jenkins.maven3.agent.Maven33Main /home/jenkins/tools/maven/apache-maven-3.3.9 /home/jenkins/jenkins-slave/slave.jar /home/jenkins/jenkins-slave/maven33-interceptor.jar /home/jenkins/jenkins-slave/maven3-interceptor-commons.jar 36931
<===[JENKINS REMOTING CAPACITY]===>   channel started
Executing Maven:  -B -f <https://builds.apache.org/job/sling-org-apache-sling-launchpad-testing-1.8/ws/pom.xml> -Dmaven.repo.local=/home/jenkins/jenkins-slave/maven-repositories/0 -U clean deploy
[INFO] Scanning for projects...
[INFO] Downloading: http://repository.apache.org/snapshots/org/apache/sling/org.apache.sling.launchpad.test-bundles/12-SNAPSHOT/maven-metadata.xml
[INFO] Downloaded: http://repository.apache.org/snapshots/org/apache/sling/org.apache.sling.launchpad.test-bundles/12-SNAPSHOT/maven-metadata.xml (1007 B at 2.3 KB/sec)
[INFO] Downloading: http://repository.apache.org/snapshots/org/apache/sling/org.apache.sling.launchpad.test-bundles/12-SNAPSHOT/org.apache.sling.launchpad.test-bundles-12-20181019.220256-2.txt
[INFO] Downloaded: http://repository.apache.org/snapshots/org/apache/sling/org.apache.sling.launchpad.test-bundles/12-SNAPSHOT/org.apache.sling.launchpad.test-bundles-12-20181019.220256-2.txt (2 KB at 5.1 KB/sec)
[INFO] Downloading: http://repository.apache.org/snapshots/org/apache/sling/org.apache.sling.starter/12-SNAPSHOT/maven-metadata.xml
[INFO] Downloaded: http://repository.apache.org/snapshots/org/apache/sling/org.apache.sling.starter/12-SNAPSHOT/maven-metadata.xml (2 KB at 4.2 KB/sec)
[INFO] Downloading: http://repository.apache.org/snapshots/org/apache/sling/org.apache.sling.starter/12-SNAPSHOT/org.apache.sling.starter-12-20181020.065851-2-slingfeature.txt
[INFO] Downloaded: http://repository.apache.org/snapshots/org/apache/sling/org.apache.sling.starter/12-SNAPSHOT/org.apache.sling.starter-12-20181020.065851-2-slingfeature.txt (50 KB at 163.3 KB/sec)
[INFO] Extended Maven classpath (scope 'provided') by the dependencies extracted from the Sling model.
[INFO]                                                                         
[INFO] ------------------------------------------------------------------------
[INFO] Building Apache Sling Launchpad Testing 12-SNAPSHOT
[INFO] ------------------------------------------------------------------------
[INFO] Downloading: http://repository.apache.org/snapshots/org/apache/sling/org.apache.sling.launchpad.integration-tests/12-SNAPSHOT/maven-metadata.xml
[INFO] Downloading: http://repository.apache.org/snapshots/org/apache/sling/org.apache.sling.launchpad.integration-tests/12-SNAPSHOT/org.apache.sling.launchpad.integration-tests-12-SNAPSHOT.pom
[WARNING] The POM for org.apache.sling:org.apache.sling.launchpad.integration-tests:jar:12-SNAPSHOT is missing, no dependency information available
[INFO] Downloading: http://repository.apache.org/snapshots/org/apache/sling/org.apache.sling.starter/12-SNAPSHOT/org.apache.sling.starter-12-20181020.065851-2.pom
[INFO] Downloaded: http://repository.apache.org/snapshots/org/apache/sling/org.apache.sling.starter/12-SNAPSHOT/org.apache.sling.starter-12-20181020.065851-2.pom (8 KB at 23.9 KB/sec)
[INFO] Downloading: http://repository.apache.org/snapshots/org/apache/sling/org.apache.sling.launchpad.test-bundles/12-SNAPSHOT/org.apache.sling.launchpad.test-bundles-12-20181019.220256-2.pom
[INFO] Downloaded: http://repository.apache.org/snapshots/org/apache/sling/org.apache.sling.launchpad.test-bundles/12-SNAPSHOT/org.apache.sling.launchpad.test-bundles-12-20181019.220256-2.pom (4 KB at 10.6 KB/sec)
[INFO] Downloading: http://repository.apache.org/snapshots/org/apache/sling/org.apache.sling.launchpad.test-fragment/12-SNAPSHOT/maven-metadata.xml
[INFO] Downloaded: http://repository.apache.org/snapshots/org/apache/sling/org.apache.sling.launchpad.test-fragment/12-SNAPSHOT/maven-metadata.xml (1008 B at 2.9 KB/sec)
[INFO] Downloading: http://repository.apache.org/snapshots/org/apache/sling/org.apache.sling.launchpad.test-fragment/12-SNAPSHOT/org.apache.sling.launchpad.test-fragment-12-20181019.171341-1.pom
[INFO] Downloaded: http://repository.apache.org/snapshots/org/apache/sling/org.apache.sling.launchpad.test-fragment/12-SNAPSHOT/org.apache.sling.launchpad.test-fragment-12-20181019.171341-1.pom (3 KB at 9.7 KB/sec)
[INFO] Downloading: http://repository.apache.org/snapshots/org/apache/sling/org.apache.sling.launchpad.test-services-war/12-SNAPSHOT/maven-metadata.xml
[INFO] Downloaded: http://repository.apache.org/snapshots/org/apache/sling/org.apache.sling.launchpad.test-services-war/12-SNAPSHOT/maven-metadata.xml (1012 B at 3.2 KB/sec)
[INFO] Downloading: http://repository.apache.org/snapshots/org/apache/sling/org.apache.sling.launchpad.test-services-war/12-SNAPSHOT/org.apache.sling.launchpad.test-services-war-12-20181019.171426-1.pom
[INFO] Downloaded: http://repository.apache.org/snapshots/org/apache/sling/org.apache.sling.launchpad.test-services-war/12-SNAPSHOT/org.apache.sling.launchpad.test-services-war-12-20181019.171426-1.pom (6 KB at 18.7 KB/sec)
[INFO] Downloading: http://repository.apache.org/snapshots/org/apache/sling/org.apache.sling.launchpad.test-services/12-SNAPSHOT/maven-metadata.xml
[INFO] Downloaded: http://repository.apache.org/snapshots/org/apache/sling/org.apache.sling.launchpad.test-services/12-SNAPSHOT/maven-metadata.xml (1008 B at 3.2 KB/sec)
[INFO] Downloading: http://repository.apache.org/snapshots/org/apache/sling/org.apache.sling.launchpad.test-services/12-SNAPSHOT/org.apache.sling.launchpad.test-services-12-20181019.165434-1.pom
[INFO] Downloaded: http://repository.apache.org/snapshots/org/apache/sling/org.apache.sling.launchpad.test-services/12-SNAPSHOT/org.apache.sling.launchpad.test-services-12-20181019.165434-1.pom (10 KB at 32.0 KB/sec)
[INFO] Downloading: http://repository.apache.org/snapshots/org/apache/sling/org.apache.sling.launchpad.integration-tests/12-SNAPSHOT/org.apache.sling.launchpad.integration-tests-12-SNAPSHOT.jar
[INFO] Downloading: http://repository.apache.org/snapshots/org/apache/sling/org.apache.sling.starter/12-SNAPSHOT/org.apache.sling.starter-12-20181020.065851-2.jar
[INFO] Downloading: http://repository.apache.org/snapshots/org/apache/sling/org.apache.sling.launchpad.test-fragment/12-SNAPSHOT/org.apache.sling.launchpad.test-fragment-12-20181019.171341-1.jar
[INFO] Downloading: http://repository.apache.org/snapshots/org/apache/sling/org.apache.sling.launchpad.test-services-war/12-SNAPSHOT/org.apache.sling.launchpad.test-services-war-12-20181019.171426-1.war
[INFO] Downloading: http://repository.apache.org/snapshots/org/apache/sling/org.apache.sling.launchpad.test-services/12-SNAPSHOT/org.apache.sling.launchpad.test-services-12-20181019.165434-1.jar
[INFO] Downloaded: http://repository.apache.org/snapshots/org/apache/sling/org.apache.sling.launchpad.test-fragment/12-SNAPSHOT/org.apache.sling.launchpad.test-fragment-12-20181019.171341-1.jar (9 KB at 29.5 KB/sec)
[INFO] Downloaded: http://repository.apache.org/snapshots/org/apache/sling/org.apache.sling.launchpad.test-services-war/12-SNAPSHOT/org.apache.sling.launchpad.test-services-war-12-20181019.171426-1.war (14 KB at 44.2 KB/sec)
[INFO] Downloaded: http://repository.apache.org/snapshots/org/apache/sling/org.apache.sling.launchpad.test-services/12-SNAPSHOT/org.apache.sling.launchpad.test-services-12-20181019.165434-1.jar (180 KB at 342.0 KB/sec)
[INFO] Downloaded: http://repository.apache.org/snapshots/org/apache/sling/org.apache.sling.starter/12-SNAPSHOT/org.apache.sling.starter-12-20181020.065851-2.jar (71851 KB at 25799.2 KB/sec)
[WARNING] Attempt to (de-)serialize anonymous class hudson.maven.reporters.MavenArtifactArchiver$2; see: https://jenkins.io/redirect/serialization-of-anonymous-classes/
[JENKINS] Archiving disabled
[WARNING] Attempt to (de-)serialize anonymous class hudson.maven.reporters.MavenFingerprinter$1; see: https://jenkins.io/redirect/serialization-of-anonymous-classes/
[JENKINS] Archiving disabled
[INFO] ------------------------------------------------------------------------
[INFO] BUILD FAILURE
[INFO] ------------------------------------------------------------------------
[INFO] Total time: 21.223 s
[INFO] Finished at: 2018-10-20T07:00:16+00:00
[INFO] Final Memory: 48M/3925M
[INFO] ------------------------------------------------------------------------
Waiting for Jenkins to finish collecting data
[ERROR] Failed to execute goal on project org.apache.sling.launchpad.testing: Could not resolve dependencies for project org.apache.sling:org.apache.sling.launchpad.testing:slingstart:12-SNAPSHOT: Could not find artifact org.apache.sling:org.apache.sling.launchpad.integration-tests:jar:12-SNAPSHOT in Nexus (http://repository.apache.org/snapshots) -> [Help 1]
[ERROR] 
[ERROR] To see the full stack trace of the errors, re-run Maven with the -e switch.
[ERROR] Re-run Maven using the -X switch to enable full debug logging.
[ERROR] 
[ERROR] For more information about the errors and possible solutions, please read the following articles:
[ERROR] [Help 1] http://cwiki.apache.org/confluence/display/MAVEN/DependencyResolutionException
channel stopped
Archiving artifacts
Recording test results

Build failed in Jenkins: sling-org-apache-sling-launchpad-testing-1.8 #227

Posted by Apache Jenkins Server <je...@builds.apache.org>.
See <https://builds.apache.org/job/sling-org-apache-sling-launchpad-testing-1.8/227/display/redirect?page=changes>

Changes:

[rombert] SLING-7935 - Consolidate all 'launchpad-testing' modules into a single

------------------------------------------
Started by an SCM change
Started by an SCM change
Started by upstream project "sling-org-apache-sling-launchpad-test-bundles-1.8" build number 65
originally caused by:
 Started by an SCM change
 Started by an SCM change
[EnvInject] - Loading node environment variables.
Building remotely on ubuntu-eu2 (ubuntu trusty) in workspace <https://builds.apache.org/job/sling-org-apache-sling-launchpad-testing-1.8/ws/>
[WS-CLEANUP] Deleting project workspace...
[WS-CLEANUP] Done
Cloning the remote Git repository
Cloning repository https://github.com/apache/sling-org-apache-sling-launchpad-testing.git
 > git init <https://builds.apache.org/job/sling-org-apache-sling-launchpad-testing-1.8/ws/> # timeout=10
Fetching upstream changes from https://github.com/apache/sling-org-apache-sling-launchpad-testing.git
 > git --version # timeout=10
 > git fetch --tags --progress https://github.com/apache/sling-org-apache-sling-launchpad-testing.git +refs/heads/*:refs/remotes/origin/*
 > git config remote.origin.url https://github.com/apache/sling-org-apache-sling-launchpad-testing.git # timeout=10
 > git config --add remote.origin.fetch +refs/heads/*:refs/remotes/origin/* # timeout=10
 > git config remote.origin.url https://github.com/apache/sling-org-apache-sling-launchpad-testing.git # timeout=10
Fetching upstream changes from https://github.com/apache/sling-org-apache-sling-launchpad-testing.git
 > git fetch --tags --progress https://github.com/apache/sling-org-apache-sling-launchpad-testing.git +refs/heads/*:refs/remotes/origin/*
 > git rev-parse origin/master^{commit} # timeout=10
Checking out Revision 11a7575dedfad03e7e357506e8a44bc30a7b9de1 (origin/master)
 > git config core.sparsecheckout # timeout=10
 > git checkout -f 11a7575dedfad03e7e357506e8a44bc30a7b9de1
Commit message: "SLING-7935 - Consolidate all 'launchpad-testing' modules into a single git repository"
 > git rev-list --no-walk 19f71e11e2fa56ba723cb1797cb2c91e9ae3dd0a # timeout=10
Parsing POMs
Established TCP socket on 42931
maven33-agent.jar already up to date
maven33-interceptor.jar already up to date
maven3-interceptor-commons.jar already up to date
[sling-org-apache-sling-launchpad-testing-1.8] $ /home/jenkins/tools/java/latest1.8/bin/java -Xmx4g -Xms4g -cp /home/jenkins/jenkins-slave/maven33-agent.jar:/home/jenkins/tools/maven/apache-maven-3.3.9/boot/plexus-classworlds-2.5.2.jar:/home/jenkins/tools/maven/apache-maven-3.3.9/conf/logging jenkins.maven3.agent.Maven33Main /home/jenkins/tools/maven/apache-maven-3.3.9 /home/jenkins/jenkins-slave/slave.jar /home/jenkins/jenkins-slave/maven33-interceptor.jar /home/jenkins/jenkins-slave/maven3-interceptor-commons.jar 42931
<===[JENKINS REMOTING CAPACITY]===>   channel started
Executing Maven:  -B -f <https://builds.apache.org/job/sling-org-apache-sling-launchpad-testing-1.8/ws/pom.xml> -Dmaven.repo.local=/home/jenkins/jenkins-slave/maven-repositories/1 -U clean deploy
[INFO] Scanning for projects...
[INFO] Downloading: http://repository.apache.org/snapshots/org/apache/sling/org.apache.sling.launchpad.test-bundles/12-SNAPSHOT/maven-metadata.xml
[INFO] Downloaded: http://repository.apache.org/snapshots/org/apache/sling/org.apache.sling.launchpad.test-bundles/12-SNAPSHOT/maven-metadata.xml (1007 B at 2.2 KB/sec)
[INFO] Downloading: http://repository.apache.org/snapshots/org/apache/sling/org.apache.sling.starter/12-SNAPSHOT/maven-metadata.xml
[INFO] Downloaded: http://repository.apache.org/snapshots/org/apache/sling/org.apache.sling.starter/12-SNAPSHOT/maven-metadata.xml (2 KB at 3.7 KB/sec)
[INFO] Extended Maven classpath (scope 'provided') by the dependencies extracted from the Sling model.
[INFO]                                                                         
[INFO] ------------------------------------------------------------------------
[INFO] Building Apache Sling Launchpad Testing 12-SNAPSHOT
[INFO] ------------------------------------------------------------------------
[INFO] Downloading: http://repository.apache.org/snapshots/org/apache/sling/org.apache.sling.launchpad.integration-tests/12-SNAPSHOT/maven-metadata.xml
[INFO] Downloading: http://repository.apache.org/snapshots/org/apache/sling/org.apache.sling.launchpad.integration-tests/12-SNAPSHOT/org.apache.sling.launchpad.integration-tests-12-SNAPSHOT.pom
[WARNING] The POM for org.apache.sling:org.apache.sling.launchpad.integration-tests:jar:12-SNAPSHOT is missing, no dependency information available
[INFO] Downloading: http://repository.apache.org/snapshots/org/apache/sling/org.apache.sling.launchpad.test-fragment/12-SNAPSHOT/maven-metadata.xml
[INFO] Downloaded: http://repository.apache.org/snapshots/org/apache/sling/org.apache.sling.launchpad.test-fragment/12-SNAPSHOT/maven-metadata.xml (1008 B at 2.6 KB/sec)
[INFO] Downloading: http://repository.apache.org/snapshots/org/apache/sling/org.apache.sling.launchpad.test-services-war/12-SNAPSHOT/maven-metadata.xml
[INFO] Downloaded: http://repository.apache.org/snapshots/org/apache/sling/org.apache.sling.launchpad.test-services-war/12-SNAPSHOT/maven-metadata.xml (1012 B at 2.6 KB/sec)
[INFO] Downloading: http://repository.apache.org/snapshots/org/apache/sling/org.apache.sling.launchpad.test-services/12-SNAPSHOT/maven-metadata.xml
[INFO] Downloaded: http://repository.apache.org/snapshots/org/apache/sling/org.apache.sling.launchpad.test-services/12-SNAPSHOT/maven-metadata.xml (1008 B at 2.6 KB/sec)
[INFO] Downloading: http://repository.apache.org/snapshots/org/apache/sling/org.apache.sling.launchpad.integration-tests/12-SNAPSHOT/org.apache.sling.launchpad.integration-tests-12-SNAPSHOT.jar
[WARNING] Attempt to (de-)serialize anonymous class hudson.maven.reporters.MavenArtifactArchiver$2; see: https://jenkins.io/redirect/serialization-of-anonymous-classes/
[JENKINS] Archiving disabled
[WARNING] Attempt to (de-)serialize anonymous class hudson.maven.reporters.MavenFingerprinter$1; see: https://jenkins.io/redirect/serialization-of-anonymous-classes/
[JENKINS] Archiving disabled[INFO] ------------------------------------------------------------------------
[INFO] BUILD FAILURE
[INFO] ------------------------------------------------------------------------
[INFO] Total time: 9.420 s
[INFO] Finished at: 2018-10-19T22:04:55+00:00

[INFO] Final Memory: 49M/3925M
[INFO] ------------------------------------------------------------------------
Waiting for Jenkins to finish collecting data[ERROR] Failed to execute goal on project org.apache.sling.launchpad.testing: Could not resolve dependencies for project org.apache.sling:org.apache.sling.launchpad.testing:slingstart:12-SNAPSHOT: Could not find artifact org.apache.sling:org.apache.sling.launchpad.integration-tests:jar:12-SNAPSHOT in Nexus (http://repository.apache.org/snapshots) -> [Help 1]
[ERROR] 
[ERROR] To see the full stack trace of the errors, re-run Maven with the -e switch.
[ERROR] Re-run Maven using the -X switch to enable full debug logging.
[ERROR] 
[ERROR] For more information about the errors and possible solutions, please read the following articles:
[ERROR] [Help 1] http://cwiki.apache.org/confluence/display/MAVEN/DependencyResolutionException

channel stopped
Archiving artifacts
Recording test results