You are viewing a plain text version of this content. The canonical link for it is here.
Posted to builds@beam.apache.org by Apache Jenkins Server <je...@builds.apache.org> on 2021/08/02 12:44:29 UTC

Build failed in Jenkins: beam_PreCommit_Java_Cron #4327

See <https://ci-beam.apache.org/job/beam_PreCommit_Java_Cron/4327/display/redirect>

Changes:


------------------------------------------
[...truncated 726.24 KB...]
<https://ci-beam.apache.org/job/beam_PreCommit_Java_Cron/ws/src/sdks/java/core/src/main/java/org/apache/beam/sdk/io/TextIO.java>:500: warning - Tag @link: can't find watchForNewFiles(Duration, TerminationCondition) in org.apache.beam.sdk.io.Read
<https://ci-beam.apache.org/job/beam_PreCommit_Java_Cron/ws/src/sdks/java/core/src/main/java/org/apache/beam/sdk/io/TextIO.java>:495: warning - Tag @link: can't find withEmptyMatchTreatment in org.apache.beam.sdk.io.Read
<https://ci-beam.apache.org/job/beam_PreCommit_Java_Cron/ws/src/sdks/java/core/src/main/java/org/apache/beam/sdk/io/TextIO.java>:561: warning - Tag @link: can't find withDelimiter in org.apache.beam.sdk.io.Read
<https://ci-beam.apache.org/job/beam_PreCommit_Java_Cron/ws/src/sdks/java/core/src/main/java/org/apache/beam/sdk/io/TextIO.java>:721: warning - Tag @link: can't find to(FilenamePolicy) in org.apache.beam.sdk.io.TextIO.TypedWrite
<https://ci-beam.apache.org/job/beam_PreCommit_Java_Cron/ws/src/sdks/java/core/src/main/java/org/apache/beam/sdk/io/TextIO.java>:795: warning - Tag @link: can't find to(DynamicDestinations) in org.apache.beam.sdk.io.TextIO.TypedWrite
<https://ci-beam.apache.org/job/beam_PreCommit_Java_Cron/ws/src/sdks/java/core/src/main/java/org/apache/beam/sdk/io/TextIO.java>:821: warning - Tag @link: can't find to(FilenamePolicy) in org.apache.beam.sdk.io.TextIO.TypedWrite
<https://ci-beam.apache.org/job/beam_PreCommit_Java_Cron/ws/src/sdks/java/core/src/main/java/org/apache/beam/sdk/io/TextIO.java>:821: warning - Tag @link: can't find to(DynamicDestinations) in org.apache.beam.sdk.io.TextIO.TypedWrite
<https://ci-beam.apache.org/job/beam_PreCommit_Java_Cron/ws/src/sdks/java/core/src/main/java/org/apache/beam/sdk/io/TextIO.java>:833: warning - Tag @link: can't find to(FilenamePolicy) in org.apache.beam.sdk.io.TextIO.TypedWrite
<https://ci-beam.apache.org/job/beam_PreCommit_Java_Cron/ws/src/sdks/java/core/src/main/java/org/apache/beam/sdk/io/TextIO.java>:833: warning - Tag @link: can't find to(DynamicDestinations) in org.apache.beam.sdk.io.TextIO.TypedWrite
<https://ci-beam.apache.org/job/beam_PreCommit_Java_Cron/ws/src/sdks/java/core/src/main/java/org/apache/beam/sdk/io/TextIO.java>:1094: warning - Tag @link: can't find to(DynamicDestinations) in org.apache.beam.sdk.io.TextIO.TypedWrite
<https://ci-beam.apache.org/job/beam_PreCommit_Java_Cron/ws/src/sdks/java/core/src/main/java/org/apache/beam/sdk/io/TextIO.java>:1081: warning - Tag @link: can't find to(FilenamePolicy) in org.apache.beam.sdk.io.TextIO.TypedWrite
<https://ci-beam.apache.org/job/beam_PreCommit_Java_Cron/ws/src/sdks/java/core/src/main/java/org/apache/beam/sdk/io/TextIO.java>:1107: warning - Tag @link: can't find to(SerializableFunction, Params) in org.apache.beam.sdk.io.TextIO.TypedWrite
<https://ci-beam.apache.org/job/beam_PreCommit_Java_Cron/ws/src/sdks/java/core/src/main/java/org/apache/beam/sdk/io/TextIO.java>:1195: warning - Tag @link: can't find to(DynamicDestinations) in org.apache.beam.sdk.io.TextIO.Write
<https://ci-beam.apache.org/job/beam_PreCommit_Java_Cron/ws/src/sdks/java/core/src/main/java/org/apache/beam/sdk/io/TextIO.java>:1195: warning - Tag @link: can't find to(SerializableFunction, Params) in org.apache.beam.sdk.io.TextIO.Write
<https://ci-beam.apache.org/job/beam_PreCommit_Java_Cron/ws/src/sdks/java/core/src/main/java/org/apache/beam/sdk/io/TextIO.java>:1163: warning - Tag @link: can't find withWritableByteChannelFactory(WritableByteChannelFactory) in org.apache.beam.sdk.io.TextIO.TypedWrite

> Task :sdks:java:io:hadoop-common:compileTestJava
Note: <https://ci-beam.apache.org/job/beam_PreCommit_Java_Cron/ws/src/sdks/java/io/hadoop-common/src/test/java/org/apache/beam/sdk/io/hadoop/SerializableConfigurationTest.java> uses or overrides a deprecated API.
Note: Recompile with -Xlint:deprecation for details.

> Task :sdks:java:io:hadoop-common:testClasses
> Task :sdks:java:io:hadoop-common:analyzeTestClassesDependencies SKIPPED
> Task :sdks:java:io:hadoop-common:analyzeDependencies
> Task :sdks:java:io:hadoop-common:checkstyleMain
> Task :sdks:java:io:hadoop-common:checkstyleTest
> Task :sdks:java:extensions:protobuf:test
> Task :sdks:java:extensions:protobuf:check
> Task :sdks:java:extensions:protobuf:build
> Task :sdks:java:io:azure:compileJava
> Task :sdks:java:io:azure:classes
> Task :sdks:java:io:azure:jar
> Task :sdks:java:io:azure:assemble
> Task :sdks:java:container:java8:copyDockerfileDependencies
> Task :release:go-licenses:java:createLicenses
> Task :sdks:java:container:java8:copyGolangLicenses

> Task :sdks:java:core:javadoc
<https://ci-beam.apache.org/job/beam_PreCommit_Java_Cron/ws/src/sdks/java/core/src/main/java/org/apache/beam/sdk/values/PCollection.java>:310: warning - Tag @link:illegal character: "60" in "PCollection<Row>"
<https://ci-beam.apache.org/job/beam_PreCommit_Java_Cron/ws/src/sdks/java/core/src/main/java/org/apache/beam/sdk/values/PCollection.java>:310: warning - Tag @link:illegal character: "62" in "PCollection<Row>"

> Task :runners:samza:compileTestJava
Note: Some input files use or override a deprecated API.
Note: Recompile with -Xlint:deprecation for details.
Note: Some input files use unchecked or unsafe operations.
Note: Recompile with -Xlint:unchecked for details.

> Task :runners:samza:testClasses
> Task :runners:samza:analyzeTestClassesDependencies SKIPPED
> Task :runners:samza:analyzeDependencies
> Task :sdks:java:io:azure:analyzeClassesDependencies
> Task :sdks:java:io:hadoop-common:javadoc
> Task :runners:samza:checkstyleMain

> Task :sdks:java:container:pullLicenses
Copying already-fetched licenses from <https://ci-beam.apache.org/job/beam_PreCommit_Java_Cron/ws/src/sdks/java/container/build/reports/dependency-license> to <https://ci-beam.apache.org/job/beam_PreCommit_Java_Cron/ws/src/sdks/java/container/build/target/java_third_party_licenses>

> Task :sdks:java:io:hadoop-common:spotbugsMain
> Task :sdks:java:io:hadoop-common:spotbugsTest SKIPPED

> Task :sdks:java:core:javadoc
<https://ci-beam.apache.org/job/beam_PreCommit_Java_Cron/ws/src/sdks/java/core/src/main/java/org/apache/beam/sdk/schemas/SchemaRegistry.java>:291: warning - Tag @link:illegal character: "42" in "* NoSuchSchemaException"
<https://ci-beam.apache.org/job/beam_PreCommit_Java_Cron/ws/src/sdks/java/core/src/main/java/org/apache/beam/sdk/schemas/SchemaRegistry.java>:299: warning - Tag @link:illegal character: "42" in "* NoSuchSchemaException"
<https://ci-beam.apache.org/job/beam_PreCommit_Java_Cron/ws/src/sdks/java/core/src/main/java/org/apache/beam/sdk/options/SdkHarnessOptions.java>:127: warning - Tag @link: can't find addOverrideForName(String, LogLevel) in org.apache.beam.sdk.options.SdkHarnessOptions.SdkHarnessLogLevelOverrides
<https://ci-beam.apache.org/job/beam_PreCommit_Java_Cron/ws/src/sdks/java/core/src/main/java/org/apache/beam/sdk/options/SdkHarnessOptions.java>:139: warning - Tag @link: can't find addOverrideForName(String, LogLevel) in org.apache.beam.sdk.options.SdkHarnessOptions.SdkHarnessLogLevelOverrides
<https://ci-beam.apache.org/job/beam_PreCommit_Java_Cron/ws/src/sdks/java/core/src/main/java/org/apache/beam/sdk/state/StateSpecs.java>:89: warning - Tag @see: can't find combining(Coder, CombineFn) in org.apache.beam.sdk.state.StateSpecs
<https://ci-beam.apache.org/job/beam_PreCommit_Java_Cron/ws/src/sdks/java/core/src/main/java/org/apache/beam/sdk/state/StateSpecs.java>:107: warning - Tag @see: can't find combining(Coder, CombineFnWithContext) in org.apache.beam.sdk.state.StateSpecs
<https://ci-beam.apache.org/job/beam_PreCommit_Java_Cron/ws/src/sdks/java/core/src/main/java/org/apache/beam/sdk/state/StateSpecs.java>:118: warning - Tag @link: can't find combining(CombineFn) in org.apache.beam.sdk.state.StateSpecs
<https://ci-beam.apache.org/job/beam_PreCommit_Java_Cron/ws/src/sdks/java/core/src/main/java/org/apache/beam/sdk/state/StateSpecs.java>:137: warning - Tag @link: can't find combining(CombineFnWithContext) in org.apache.beam.sdk.state.StateSpecs

> Task :runners:samza:checkstyleTest
> Task :sdks:java:extensions:sql:hcatalog:compileJava
> Task :sdks:java:extensions:sql:hcatalog:classes

> Task :sdks:java:container:pullLicenses
Already using interpreter /usr/bin/python3
Using base prefix '/usr'
New python executable in <https://ci-beam.apache.org/job/beam_PreCommit_Java_Cron/ws/src/sdks/java/container/build/virtualenv/bin/python3>
Also creating executable in <https://ci-beam.apache.org/job/beam_PreCommit_Java_Cron/ws/src/sdks/java/container/build/virtualenv/bin/python>
Installing setuptools, pip, wheel...

> Task :sdks:java:io:azure:compileTestJava
Note: <https://ci-beam.apache.org/job/beam_PreCommit_Java_Cron/ws/src/sdks/java/io/azure/src/test/java/org/apache/beam/sdk/io/azure/blobstore/AzfsResourceIdTest.java> uses or overrides a deprecated API.
Note: Recompile with -Xlint:deprecation for details.
Note: <https://ci-beam.apache.org/job/beam_PreCommit_Java_Cron/ws/src/sdks/java/io/azure/src/test/java/org/apache/beam/sdk/io/azure/blobstore/AzureBlobStoreFileSystemTest.java> uses unchecked or unsafe operations.
Note: Recompile with -Xlint:unchecked for details.

> Task :sdks:java:io:azure:testClasses
> Task :sdks:java:io:azure:analyzeTestClassesDependencies SKIPPED
> Task :sdks:java:io:azure:analyzeDependencies
> Task :sdks:java:io:azure:checkstyleMain
> Task :sdks:java:io:azure:checkstyleTest

> Task :sdks:java:core:javadoc
59 warnings

> Task :sdks:java:io:common:test
> Task :sdks:java:io:common:check
> Task :sdks:java:io:common:build
> Task :sdks:java:extensions:sql:hcatalog:javadoc
> Task :sdks:java:io:azure:javadoc
> Task :sdks:java:core:spotbugsTest SKIPPED
> Task :sdks:java:io:hadoop-common:test

> Task :sdks:java:container:pullLicenses
done.

> Task :runners:samza:job-server:distZip
> Task :runners:samza:job-server:compileTestJava NO-SOURCE
> Task :runners:samza:job-server:testClasses UP-TO-DATE
> Task :runners:samza:job-server:packageTests
> Task :runners:samza:job-server:assemble
> Task :runners:samza:javadoc

> Task :sdks:java:container:pullLicenses
DEPRECATION: Python 3.5 reached the end of its life on September 13th, 2020. Please upgrade your Python as Python 3.5 is no longer maintained. pip 21.0 will drop support for Python 3.5 in January 2021. pip 21.0 will remove support for this functionality.
Collecting beautifulsoup4<5.0,>=4.9.0
  Using cached beautifulsoup4-4.9.3-py3-none-any.whl (115 kB)
Collecting future<1.0.0,>=0.16.0
  Using cached future-0.18.2-py3-none-any.whl
Collecting pyyaml<6.0.0,>=3.12
  Using cached PyYAML-5.3.1-cp35-cp35m-linux_x86_64.whl
Collecting tenacity<6.0,>=5.0.2
  Using cached tenacity-5.1.5-py2.py3-none-any.whl (34 kB)
Collecting soupsieve>1.2
  Using cached soupsieve-2.1-py3-none-any.whl (32 kB)
Collecting six>=1.9.0

> Task :sdks:java:io:azure:spotbugsMain
> Task :runners:samza:spotbugsTest SKIPPED
> Task :runners:samza:job-server:analyzeClassesDependencies
> Task :runners:samza:job-server:analyzeTestClassesDependencies SKIPPED
> Task :runners:samza:job-server:analyzeDependencies
> Task :runners:samza:job-server:checkstyleMain NO-SOURCE
> Task :runners:samza:job-server:checkstyleTest NO-SOURCE
> Task :runners:samza:job-server:javadoc NO-SOURCE
> Task :runners:samza:job-server:spotbugsMain NO-SOURCE
> Task :runners:samza:job-server:spotbugsTest SKIPPED
> Task :runners:samza:job-server:test NO-SOURCE
> Task :runners:samza:job-server:check

> Task :sdks:java:container:pullLicenses
  Using cached six-1.16.0-py2.py3-none-any.whl (11 kB)
Installing collected packages: soupsieve, six, tenacity, pyyaml, future, beautifulsoup4
Successfully installed beautifulsoup4-4.9.3 future-0.18.2 pyyaml-5.3.1 six-1.16.0 soupsieve-2.1 tenacity-5.1.5
Executing <https://ci-beam.apache.org/job/beam_PreCommit_Java_Cron/ws/src/sdks/java/container/build/virtualenv/bin/python> <https://ci-beam.apache.org/job/beam_PreCommit_Java_Cron/ws/src/sdks/java/container/license_scripts/pull_licenses_java.py> --license_index=<https://ci-beam.apache.org/job/beam_PreCommit_Java_Cron/ws/src/sdks/java/container/build/reports/dependency-license/index.json>        --output_dir=<https://ci-beam.apache.org/job/beam_PreCommit_Java_Cron/ws/src/sdks/java/container/build/target/java_third_party_licenses>        --dep_url_yaml=<https://ci-beam.apache.org/job/beam_PreCommit_Java_Cron/ws/src/sdks/java/container/license_scripts/dep_urls_java.yaml> 
INFO:root:Pulling license for 207 dependencies using 16 threads.
INFO:root:pull_licenses_java.py succeed. It took 2.154547 seconds with 16 threads.
Copying licenses from <https://ci-beam.apache.org/job/beam_PreCommit_Java_Cron/ws/src/sdks/java/container/build/target/java_third_party_licenses> to <https://ci-beam.apache.org/job/beam_PreCommit_Java_Cron/ws/src/sdks/java/container/build/target/third_party_licenses.>

> Task :sdks:go:installDependencies
> Task :sdks:java:io:azure:spotbugsTest SKIPPED

> Task :sdks:java:container:pullLicenses
Finished license_scripts.sh

> Task :sdks:java:io:hadoop-common:check
> Task :sdks:java:io:hadoop-common:build
> Task :sdks:java:io:hadoop-common:buildDependents
> Task :sdks:java:javadoc:allJavadoc
> Task :sdks:java:container:java8:copyJavaThirdPartyLicenses NO-SOURCE
> Task :runners:samza:spotbugsMain
> Task :sdks:java:extensions:sql:jdbc:shadowJarTest
> Task :sdks:java:core:spotbugsMain
> Task :sdks:java:core:test
> Task :sdks:java:io:azure:test
> Task :sdks:java:io:azure:check
> Task :sdks:java:io:azure:build
> Task :sdks:java:io:azure:buildDependents
> Task :runners:samza:test
> Task :runners:samza:job-server:shadowJar
> Task :sdks:go:buildLinuxAmd64

> Task :sdks:java:io:elasticsearch-tests:elasticsearch-tests-6:test

org.apache.beam.sdk.io.elasticsearch.ElasticsearchIOTest > testSplit FAILED
    java.lang.AssertionError at ElasticsearchIOTest.java:149

> Task :sdks:java:extensions:sql:jdbc:preCommit
> Task :sdks:go:goBuild
> Task :runners:samza:check
> Task :runners:samza:build

> Task :sdks:java:container:resolveBuildDependencies
Resolving ./github.com/apache/beam/sdks/go@<https://ci-beam.apache.org/job/beam_PreCommit_Java_Cron/ws/src/sdks/go>

> Task :sdks:java:container:installDependencies
> Task :sdks:java:container:buildLinuxAmd64
> Task :sdks:java:container:goBuild
> Task :sdks:java:container:java8:copySdkHarnessLauncher
> Task :sdks:java:container:java8:dockerPrepare
> Task :runners:samza:job-server:build
> Task :runners:samza:job-server:buildDependents
> Task :runners:samza:buildDependents
> Task :runners:java-job-service:buildDependents
> Task :sdks:java:container:java8:docker
> Task :sdks:java:core:validateShadedJarDoesntLeakNonProjectClasses
> Task :sdks:java:core:check
> Task :sdks:java:core:build
> Task :sdks:java:core:buildNeeded
> Task :sdks:java:io:elasticsearch-tests:elasticsearch-tests-5:check
> Task :sdks:java:io:elasticsearch-tests:elasticsearch-tests-5:build
> Task :sdks:java:io:elasticsearch-tests:elasticsearch-tests-5:buildDependents
> Task :sdks:java:io:elasticsearch-tests:elasticsearch-tests-7:check
> Task :sdks:java:io:elasticsearch-tests:elasticsearch-tests-7:build
> Task :sdks:java:io:elasticsearch-tests:elasticsearch-tests-7:buildDependents

> Task :sdks:java:io:elasticsearch-tests:elasticsearch-tests-6:test FAILED

23 tests completed, 1 failed

> Task :sdks:java:testing:nexmark:check
> Task :sdks:java:testing:nexmark:build
> Task :sdks:java:testing:nexmark:buildDependents
> Task :sdks:java:extensions:sql:zetasql:buildDependents
> Task :sdks:java:extensions:sql:buildDependents
> Task :sdks:java:io:google-cloud-platform:buildDependents
> Task :sdks:java:io:kafka:buildDependents
> Task :sdks:java:extensions:join-library:buildDependents
> Task :sdks:java:io:mongodb:buildDependents
> Task :sdks:java:io:synthetic:buildDependents
> Task :sdks:java:io:thrift:buildDependents
> Task :sdks:java:expansion-service:buildDependents
> Task :sdks:java:extensions:arrow:buildDependents
> Task :sdks:java:extensions:protobuf:buildDependents
> Task :sdks:java:testing:test-utils:buildDependents

FAILURE: Build failed with an exception.

* What went wrong:
Execution failed for task ':sdks:java:io:elasticsearch-tests:elasticsearch-tests-6:test'.
> There were failing tests. See the report at: file://<https://ci-beam.apache.org/job/beam_PreCommit_Java_Cron/ws/src/sdks/java/io/elasticsearch-tests/elasticsearch-tests-6/build/reports/tests/test/index.html>

* Try:
Run with --stacktrace option to get the stack trace. Run with --info or --debug option to get more log output. Run with --scan to get full insights.

* Get more help at https://help.gradle.org

Deprecated Gradle features were used in this build, making it incompatible with Gradle 7.0.
Use '--warning-mode all' to show the individual deprecation warnings.
See https://docs.gradle.org/6.8.3/userguide/command_line_interface.html#sec:command_line_warnings

BUILD FAILED in 42m 3s
1144 actionable tasks: 1022 executed, 120 from cache, 2 up-to-date

Publishing build scan...
https://gradle.com/s/yx6cpzbpbcxei

Build step 'Invoke Gradle script' changed build result to FAILURE
Build step 'Invoke Gradle script' marked build as failure

---------------------------------------------------------------------
To unsubscribe, e-mail: builds-unsubscribe@beam.apache.org
For additional commands, e-mail: builds-help@beam.apache.org


Jenkins build is back to normal : beam_PreCommit_Java_Cron #4328

Posted by Apache Jenkins Server <je...@builds.apache.org>.
See <https://ci-beam.apache.org/job/beam_PreCommit_Java_Cron/4328/display/redirect?page=changes>


---------------------------------------------------------------------
To unsubscribe, e-mail: builds-unsubscribe@beam.apache.org
For additional commands, e-mail: builds-help@beam.apache.org