You are viewing a plain text version of this content. The canonical link for it is here.
Posted to commits@sling.apache.org by Apache Jenkins Server <je...@builds.apache.org> on 2018/10/28 12:42:02 UTC

Build failed in Jenkins: sling-org-apache-sling-feature-launcher-1.8 #116

See <https://builds.apache.org/job/sling-org-apache-sling-feature-launcher-1.8/116/display/redirect>

------------------------------------------
Started by upstream project "sling-org-apache-sling-feature-io-1.8" build number 97
originally caused by:
 Started by an SCM change
[EnvInject] - Loading node environment variables.
Building remotely on H30 (ubuntu xenial) in workspace <https://builds.apache.org/job/sling-org-apache-sling-feature-launcher-1.8/ws/>
[WS-CLEANUP] Deleting project workspace...
Cloning the remote Git repository
Cloning repository https://github.com/apache/sling-org-apache-sling-feature-launcher.git
 > git init <https://builds.apache.org/job/sling-org-apache-sling-feature-launcher-1.8/ws/> # timeout=10
Fetching upstream changes from https://github.com/apache/sling-org-apache-sling-feature-launcher.git
 > git --version # timeout=10
 > git fetch --tags --progress https://github.com/apache/sling-org-apache-sling-feature-launcher.git +refs/heads/*:refs/remotes/origin/*
 > git config remote.origin.url https://github.com/apache/sling-org-apache-sling-feature-launcher.git # timeout=10
 > git config --add remote.origin.fetch +refs/heads/*:refs/remotes/origin/* # timeout=10
 > git config remote.origin.url https://github.com/apache/sling-org-apache-sling-feature-launcher.git # timeout=10
Fetching upstream changes from https://github.com/apache/sling-org-apache-sling-feature-launcher.git
 > git fetch --tags --progress https://github.com/apache/sling-org-apache-sling-feature-launcher.git +refs/heads/*:refs/remotes/origin/*
 > git rev-parse origin/master^{commit} # timeout=10
Checking out Revision 2df753332b1a2aceffe38977c76e6bd66636c59f (origin/master)
 > git config core.sparsecheckout # timeout=10
 > git checkout -f 2df753332b1a2aceffe38977c76e6bd66636c59f
Commit message: "Add log statement"
 > git rev-list --no-walk 2df753332b1a2aceffe38977c76e6bd66636c59f # timeout=10
Parsing POMs
Established TCP socket on 38065
maven33-agent.jar already up to date
maven33-interceptor.jar already up to date
maven3-interceptor-commons.jar already up to date
[sling-org-apache-sling-feature-launcher-1.8] $ /home/jenkins/tools/java/latest1.8/bin/java -Xmx4g -Xms4g -cp /home/jenkins/jenkins-slave/maven33-agent.jar:/home/jenkins/tools/maven/apache-maven-3.3.9/boot/plexus-classworlds-2.5.2.jar:/home/jenkins/tools/maven/apache-maven-3.3.9/conf/logging jenkins.maven3.agent.Maven33Main /home/jenkins/tools/maven/apache-maven-3.3.9 /home/jenkins/jenkins-slave/slave.jar /home/jenkins/jenkins-slave/maven33-interceptor.jar /home/jenkins/jenkins-slave/maven3-interceptor-commons.jar 38065
<===[JENKINS REMOTING CAPACITY]===>   channel started
Executing Maven:  -B -f <https://builds.apache.org/job/sling-org-apache-sling-feature-launcher-1.8/ws/pom.xml> -Dmaven.repo.local=/home/jenkins/jenkins-slave/maven-repositories/1 -U clean deploy
[INFO] Scanning for projects...
[INFO]                                                                         
[INFO] ------------------------------------------------------------------------
[INFO] Building Apache Sling Feature Launcher 0.1.0-SNAPSHOT
[INFO] ------------------------------------------------------------------------
[INFO] Downloading: https://repo.maven.apache.org/maven2/org/osgi/osgi.core/7.0.0/osgi.core-7.0.0.pom
[INFO] Downloaded: https://repo.maven.apache.org/maven2/org/osgi/osgi.core/7.0.0/osgi.core-7.0.0.pom (2 KB at 4.0 KB/sec)
[INFO] Downloading: http://repository.apache.org/snapshots/org/apache/sling/org.apache.sling.feature/0.1.3-SNAPSHOT/maven-metadata.xml
[INFO] Downloaded: http://repository.apache.org/snapshots/org/apache/sling/org.apache.sling.feature/0.1.3-SNAPSHOT/maven-metadata.xml (1008 B at 3.2 KB/sec)
[INFO] Downloading: http://repository.apache.org/snapshots/org/apache/sling/org.apache.sling.feature/0.1.3-SNAPSHOT/org.apache.sling.feature-0.1.3-20181026.153153-46.pom
[INFO] Downloaded: http://repository.apache.org/snapshots/org/apache/sling/org.apache.sling.feature/0.1.3-SNAPSHOT/org.apache.sling.feature-0.1.3-20181026.153153-46.pom (5 KB at 13.7 KB/sec)
[INFO] Downloading: http://repository.apache.org/snapshots/org/apache/sling/org.apache.sling.feature.io/0.1.3-SNAPSHOT/maven-metadata.xml
[INFO] Downloaded: http://repository.apache.org/snapshots/org/apache/sling/org.apache.sling.feature.io/0.1.3-SNAPSHOT/maven-metadata.xml (1011 B at 3.2 KB/sec)
[INFO] Downloading: http://repository.apache.org/snapshots/org/apache/sling/org.apache.sling.feature.io/0.1.3-SNAPSHOT/org.apache.sling.feature.io-0.1.3-20181028.124055-71.pom
[INFO] Downloaded: http://repository.apache.org/snapshots/org/apache/sling/org.apache.sling.feature.io/0.1.3-SNAPSHOT/org.apache.sling.feature.io-0.1.3-20181028.124055-71.pom (6 KB at 18.3 KB/sec)
[INFO] Downloading: https://repo.maven.apache.org/maven2/org/apache/sling/org.apache.sling.launchpad.api/1.2.0/org.apache.sling.launchpad.api-1.2.0.pom
[INFO] Downloaded: https://repo.maven.apache.org/maven2/org/apache/sling/org.apache.sling.launchpad.api/1.2.0/org.apache.sling.launchpad.api-1.2.0.pom (3 KB at 101.2 KB/sec)
[INFO] Downloading: https://repo.maven.apache.org/maven2/org/apache/felix/org.apache.felix.converter/1.0.0/org.apache.felix.converter-1.0.0.pom
[INFO] Downloaded: https://repo.maven.apache.org/maven2/org/apache/felix/org.apache.felix.converter/1.0.0/org.apache.felix.converter-1.0.0.pom (6 KB at 213.9 KB/sec)
[INFO] Downloading: https://repo.maven.apache.org/maven2/org/osgi/org.osgi.util.function/1.0.0/org.osgi.util.function-1.0.0.pom
[INFO] Downloaded: https://repo.maven.apache.org/maven2/org/osgi/org.osgi.util.function/1.0.0/org.osgi.util.function-1.0.0.pom (2 KB at 60.1 KB/sec)
[INFO] Downloading: https://repo.maven.apache.org/maven2/org/apache/sling/org.apache.sling.commons.johnzon/1.1.0/org.apache.sling.commons.johnzon-1.1.0.pom
[INFO] Downloaded: https://repo.maven.apache.org/maven2/org/apache/sling/org.apache.sling.commons.johnzon/1.1.0/org.apache.sling.commons.johnzon-1.1.0.pom (4 KB at 163.2 KB/sec)
[INFO] Downloading: https://repo.maven.apache.org/maven2/org/apache/geronimo/specs/geronimo-json_1.1_spec/1.0/geronimo-json_1.1_spec-1.0.pom
[INFO] Downloaded: https://repo.maven.apache.org/maven2/org/apache/geronimo/specs/geronimo-json_1.1_spec/1.0/geronimo-json_1.1_spec-1.0.pom (4 KB at 234.0 KB/sec)
[INFO] Downloading: https://repo.maven.apache.org/maven2/org/mockito/mockito-core/2.8.9/mockito-core-2.8.9.pom
[INFO] Downloaded: https://repo.maven.apache.org/maven2/org/mockito/mockito-core/2.8.9/mockito-core-2.8.9.pom (3 KB at 129.9 KB/sec)
[INFO] Downloading: https://repo.maven.apache.org/maven2/net/bytebuddy/byte-buddy/1.6.14/byte-buddy-1.6.14.pom
[INFO] Downloaded: https://repo.maven.apache.org/maven2/net/bytebuddy/byte-buddy/1.6.14/byte-buddy-1.6.14.pom (12 KB at 479.6 KB/sec)
[INFO] Downloading: https://repo.maven.apache.org/maven2/net/bytebuddy/byte-buddy-parent/1.6.14/byte-buddy-parent-1.6.14.pom
[INFO] Downloaded: https://repo.maven.apache.org/maven2/net/bytebuddy/byte-buddy-parent/1.6.14/byte-buddy-parent-1.6.14.pom (26 KB at 1159.4 KB/sec)
[INFO] Downloading: https://repo.maven.apache.org/maven2/net/bytebuddy/byte-buddy-agent/1.6.14/byte-buddy-agent-1.6.14.pom
[INFO] Downloaded: https://repo.maven.apache.org/maven2/net/bytebuddy/byte-buddy-agent/1.6.14/byte-buddy-agent-1.6.14.pom (5 KB at 231.1 KB/sec)
[INFO] Downloading: https://repo.maven.apache.org/maven2/org/objenesis/objenesis/2.5/objenesis-2.5.pom
[INFO] Downloaded: https://repo.maven.apache.org/maven2/org/objenesis/objenesis/2.5/objenesis-2.5.pom (3 KB at 151.0 KB/sec)
[INFO] Downloading: https://repo.maven.apache.org/maven2/org/objenesis/objenesis-parent/2.5/objenesis-parent-2.5.pom
[INFO] Downloaded: https://repo.maven.apache.org/maven2/org/objenesis/objenesis-parent/2.5/objenesis-parent-2.5.pom (17 KB at 700.9 KB/sec)
[INFO] Downloading: https://repo.maven.apache.org/maven2/org/osgi/osgi.core/7.0.0/osgi.core-7.0.0.jar
[INFO] Downloading: https://repo.maven.apache.org/maven2/org/apache/sling/org.apache.sling.launchpad.api/1.2.0/org.apache.sling.launchpad.api-1.2.0.jar
[INFO] Downloading: https://repo.maven.apache.org/maven2/org/apache/felix/org.apache.felix.converter/1.0.0/org.apache.felix.converter-1.0.0.jar
[INFO] Downloading: https://repo.maven.apache.org/maven2/org/osgi/org.osgi.util.function/1.0.0/org.osgi.util.function-1.0.0.jar
[INFO] Downloading: https://repo.maven.apache.org/maven2/commons-cli/commons-cli/1.3.1/commons-cli-1.3.1.jar
[INFO] Downloaded: https://repo.maven.apache.org/maven2/org/apache/sling/org.apache.sling.launchpad.api/1.2.0/org.apache.sling.launchpad.api-1.2.0.jar (11 KB at 218.1 KB/sec)
[INFO] Downloading: https://repo.maven.apache.org/maven2/org/apache/sling/org.apache.sling.commons.johnzon/1.1.0/org.apache.sling.commons.johnzon-1.1.0.jar
[INFO] Downloaded: https://repo.maven.apache.org/maven2/org/osgi/org.osgi.util.function/1.0.0/org.osgi.util.function-1.0.0.jar (13 KB at 260.7 KB/sec)
[INFO] Downloading: https://repo.maven.apache.org/maven2/org/apache/geronimo/specs/geronimo-json_1.1_spec/1.0/geronimo-json_1.1_spec-1.0.jar
[INFO] Downloaded: https://repo.maven.apache.org/maven2/commons-cli/commons-cli/1.3.1/commons-cli-1.3.1.jar (52 KB at 976.3 KB/sec)
[INFO] Downloading: https://repo.maven.apache.org/maven2/org/mockito/mockito-core/2.8.9/mockito-core-2.8.9.jar
[INFO] Downloaded: https://repo.maven.apache.org/maven2/org/apache/felix/org.apache.felix.converter/1.0.0/org.apache.felix.converter-1.0.0.jar (111 KB at 1759.5 KB/sec)
[INFO] Downloading: https://repo.maven.apache.org/maven2/net/bytebuddy/byte-buddy/1.6.14/byte-buddy-1.6.14.jar
[INFO] Downloaded: https://repo.maven.apache.org/maven2/org/apache/geronimo/specs/geronimo-json_1.1_spec/1.0/geronimo-json_1.1_spec-1.0.jar (35 KB at 528.1 KB/sec)
[INFO] Downloading: https://repo.maven.apache.org/maven2/net/bytebuddy/byte-buddy-agent/1.6.14/byte-buddy-agent-1.6.14.jar
[INFO] Downloaded: https://repo.maven.apache.org/maven2/org/apache/sling/org.apache.sling.commons.johnzon/1.1.0/org.apache.sling.commons.johnzon-1.1.0.jar (138 KB at 1737.5 KB/sec)
[INFO] Downloading: https://repo.maven.apache.org/maven2/org/objenesis/objenesis/2.5/objenesis-2.5.jar
[INFO] Downloaded: https://repo.maven.apache.org/maven2/net/bytebuddy/byte-buddy-agent/1.6.14/byte-buddy-agent-1.6.14.jar (42 KB at 481.9 KB/sec)
[INFO] Downloaded: https://repo.maven.apache.org/maven2/org/objenesis/objenesis/2.5/objenesis-2.5.jar (54 KB at 525.9 KB/sec)
[INFO] Downloaded: https://repo.maven.apache.org/maven2/org/mockito/mockito-core/2.8.9/mockito-core-2.8.9.jar (520 KB at 4477.4 KB/sec)
[INFO] Downloaded: https://repo.maven.apache.org/maven2/org/osgi/osgi.core/7.0.0/osgi.core-7.0.0.jar (481 KB at 2880.2 KB/sec)
[INFO] Downloaded: https://repo.maven.apache.org/maven2/net/bytebuddy/byte-buddy/1.6.14/byte-buddy-1.6.14.jar (2731 KB at 11144.5 KB/sec)
[INFO] Downloading: http://repository.apache.org/snapshots/org/apache/sling/org.apache.sling.feature/0.1.3-SNAPSHOT/org.apache.sling.feature-0.1.3-20181026.153153-46.jar
[INFO] Downloading: http://repository.apache.org/snapshots/org/apache/sling/org.apache.sling.feature.io/0.1.3-SNAPSHOT/org.apache.sling.feature.io-0.1.3-20181028.124055-71.jar
[INFO] Downloaded: http://repository.apache.org/snapshots/org/apache/sling/org.apache.sling.feature.io/0.1.3-SNAPSHOT/org.apache.sling.feature.io-0.1.3-20181028.124055-71.jar (159 KB at 312.5 KB/sec)
[INFO] Downloaded: http://repository.apache.org/snapshots/org/apache/sling/org.apache.sling.feature/0.1.3-SNAPSHOT/org.apache.sling.feature-0.1.3-20181026.153153-46.jar (105 KB at 206.0 KB/sec)
[INFO] 
[INFO] --- maven-clean-plugin:3.0.0:clean (default-clean) @ org.apache.sling.feature.launcher ---
[INFO] 
[INFO] --- maven-enforcer-plugin:3.0.0-M1:enforce (enforce-property-values) @ org.apache.sling.feature.launcher ---
[INFO] 
[INFO] --- maven-enforcer-plugin:3.0.0-M1:enforce (enforce-java) @ org.apache.sling.feature.launcher ---
[INFO] 
[INFO] --- maven-enforcer-plugin:3.0.0-M1:enforce (ban-maven-scr-plugin) @ org.apache.sling.feature.launcher ---
[INFO] 
[INFO] --- maven-remote-resources-plugin:1.5:process (process-resource-bundles) @ org.apache.sling.feature.launcher ---
[INFO] 
[INFO] --- maven-remote-resources-plugin:1.5:process (default) @ org.apache.sling.feature.launcher ---
[INFO] 
[INFO] --- maven-resources-plugin:2.7:resources (default-resources) @ org.apache.sling.feature.launcher ---
[INFO] Using 'UTF-8' encoding to copy filtered resources.
[INFO] Copying 1 resource
[INFO] Copying 3 resources
[INFO] Copying 3 resources
[INFO] 
[INFO] --- maven-compiler-plugin:3.7.0:compile (default-compile) @ org.apache.sling.feature.launcher ---
[INFO] Changes detected - recompiling the module!
[INFO] Compiling 14 source files to <https://builds.apache.org/job/sling-org-apache-sling-feature-launcher-1.8/ws/target/classes>
[INFO] <https://builds.apache.org/job/sling-org-apache-sling-feature-launcher-1.8/ws/src/main/java/org/apache/sling/feature/launcher/impl/Main.java>: <https://builds.apache.org/job/sling-org-apache-sling-feature-launcher-1.8/ws/src/main/java/org/apache/sling/feature/launcher/impl/Main.java> uses or overrides a deprecated API.
[INFO] <https://builds.apache.org/job/sling-org-apache-sling-feature-launcher-1.8/ws/src/main/java/org/apache/sling/feature/launcher/impl/Main.java>: Recompile with -Xlint:deprecation for details.
[INFO] <https://builds.apache.org/job/sling-org-apache-sling-feature-launcher-1.8/ws/src/main/java/org/apache/sling/feature/launcher/impl/launchers/FrameworkLauncher.java>: <https://builds.apache.org/job/sling-org-apache-sling-feature-launcher-1.8/ws/src/main/java/org/apache/sling/feature/launcher/impl/launchers/FrameworkLauncher.java> uses unchecked or unsafe operations.
[INFO] <https://builds.apache.org/job/sling-org-apache-sling-feature-launcher-1.8/ws/src/main/java/org/apache/sling/feature/launcher/impl/launchers/FrameworkLauncher.java>: Recompile with -Xlint:unchecked for details.
[INFO] Some messages have been simplified; recompile with -Xdiags:verbose to get full output
[INFO] -------------------------------------------------------------
[ERROR] COMPILATION ERROR : 
[INFO] -------------------------------------------------------------
[ERROR] <https://builds.apache.org/job/sling-org-apache-sling-feature-launcher-1.8/ws/src/main/java/org/apache/sling/feature/launcher/impl/extensions/handlers/RepoInitHandler.java>:[42,103] incompatible types: java.util.Map<java.lang.String,java.lang.Object> cannot be converted to java.util.Dictionary<java.lang.String,java.lang.Object>
[ERROR] <https://builds.apache.org/job/sling-org-apache-sling-feature-launcher-1.8/ws/src/main/java/org/apache/sling/feature/launcher/impl/FeatureProcessor.java>:[129,112] incompatible types: java.util.Map<java.lang.String,java.lang.Object> cannot be converted to java.util.Dictionary<java.lang.String,java.lang.Object>
[ERROR] <https://builds.apache.org/job/sling-org-apache-sling-feature-launcher-1.8/ws/src/main/java/org/apache/sling/feature/launcher/impl/FeatureProcessor.java>:[131,96] incompatible types: java.util.Map<java.lang.String,java.lang.Object> cannot be converted to java.util.Dictionary<java.lang.String,java.lang.Object>
[INFO] 3 errors 
[INFO] -------------------------------------------------------------
[WARNING] Attempt to (de-)serialize anonymous class hudson.maven.reporters.MavenArtifactArchiver$2; see: https://jenkins.io/redirect/serialization-of-anonymous-classes/
[JENKINS] Archiving disabled
[WARNING] Attempt to (de-)serialize anonymous class hudson.maven.reporters.MavenFingerprinter$1; see: https://jenkins.io/redirect/serialization-of-anonymous-classes/
[JENKINS] Archiving disabled
[INFO] ------------------------------------------------------------------------
[INFO] BUILD FAILURE
[INFO] ------------------------------------------------------------------------
[INFO] Total time: 17.567 s
[INFO] Finished at: 2018-10-28T12:42:00+00:00
[INFO] Final Memory: 48M/3925M
[INFO] ------------------------------------------------------------------------
Waiting for Jenkins to finish collecting data
[ERROR] Failed to execute goal org.apache.maven.plugins:maven-compiler-plugin:3.7.0:compile (default-compile) on project org.apache.sling.feature.launcher: Compilation failure: Compilation failure:
[ERROR] <https://builds.apache.org/job/sling-org-apache-sling-feature-launcher-1.8/ws/src/main/java/org/apache/sling/feature/launcher/impl/extensions/handlers/RepoInitHandler.java>:[42,103] incompatible types: java.util.Map<java.lang.String,java.lang.Object> cannot be converted to java.util.Dictionary<java.lang.String,java.lang.Object>
[ERROR] <https://builds.apache.org/job/sling-org-apache-sling-feature-launcher-1.8/ws/src/main/java/org/apache/sling/feature/launcher/impl/FeatureProcessor.java>:[129,112] incompatible types: java.util.Map<java.lang.String,java.lang.Object> cannot be converted to java.util.Dictionary<java.lang.String,java.lang.Object>
[ERROR] <https://builds.apache.org/job/sling-org-apache-sling-feature-launcher-1.8/ws/src/main/java/org/apache/sling/feature/launcher/impl/FeatureProcessor.java>:[131,96] incompatible types: java.util.Map<java.lang.String,java.lang.Object> cannot be converted to java.util.Dictionary<java.lang.String,java.lang.Object>
[ERROR] -> [Help 1]
[ERROR] 
[ERROR] To see the full stack trace of the errors, re-run Maven with the -e switch.
[ERROR] Re-run Maven using the -X switch to enable full debug logging.
[ERROR] 
[ERROR] For more information about the errors and possible solutions, please read the following articles:
[ERROR] [Help 1] http://cwiki.apache.org/confluence/display/MAVEN/MojoFailureException
channel stopped
Recording test results

Jenkins build is back to normal : sling-org-apache-sling-feature-launcher-1.8 #117

Posted by Apache Jenkins Server <je...@builds.apache.org>.
See <https://builds.apache.org/job/sling-org-apache-sling-feature-launcher-1.8/117/display/redirect>