You are viewing a plain text version of this content. The canonical link for it is here.
Posted to dev@zookeeper.apache.org by Apache Jenkins Server <je...@builds.apache.org> on 2017/08/06 10:40:35 UTC

ZooKeeper_branch35_openjdk7 - Build # 624 - Failure

See https://builds.apache.org/job/ZooKeeper_branch35_openjdk7/624/

###################################################################################
########################## LAST 60 LINES OF THE CONSOLE ###########################
[...truncated 71.22 MB...]
    [junit] 2017-08-06 10:40:31,628 [myid:] - INFO  [ProcessThread(sid:0 cport:22240)::PrepRequestProcessor@611] - Processed session termination for sessionid: 0x105e105e9ec0000
    [junit] 2017-08-06 10:40:31,629 [myid:] - INFO  [SyncThread:0:MBeanRegistry@128] - Unregister MBean [org.apache.ZooKeeperService:name0=StandaloneServer_port22240,name1=Connections,name2=127.0.0.1,name3=0x105e105e9ec0000]
    [junit] 2017-08-06 10:40:31,629 [myid:] - INFO  [main:ZooKeeper@1334] - Session: 0x105e105e9ec0000 closed
    [junit] 2017-08-06 10:40:31,629 [myid:] - INFO  [main-EventThread:ClientCnxn$EventThread@513] - EventThread shut down for session: 0x105e105e9ec0000
    [junit] 2017-08-06 10:40:31,629 [myid:] - INFO  [main:JUnit4ZKTestRunner$LoggedInvokeMethod@82] - Memory used 228796
    [junit] 2017-08-06 10:40:31,630 [myid:] - INFO  [main:JUnit4ZKTestRunner$LoggedInvokeMethod@87] - Number of threads 2431
    [junit] 2017-08-06 10:40:31,630 [myid:] - INFO  [main:JUnit4ZKTestRunner$LoggedInvokeMethod@102] - FINISHED TEST METHOD testWatcherAutoResetWithLocal
    [junit] 2017-08-06 10:40:31,630 [myid:] - INFO  [main:ClientBase@586] - tearDown starting
    [junit] 2017-08-06 10:40:31,630 [myid:] - INFO  [main:ClientBase@556] - STOPPING server
    [junit] 2017-08-06 10:40:31,630 [myid:] - INFO  [main:NettyServerCnxnFactory@464] - shutdown called 0.0.0.0/0.0.0.0:22240
    [junit] 2017-08-06 10:40:31,633 [myid:] - INFO  [main:ZooKeeperServer@541] - shutting down
    [junit] 2017-08-06 10:40:31,633 [myid:] - ERROR [main:ZooKeeperServer@505] - ZKShutdownHandler is not registered, so ZooKeeper server won't take any action on ERROR or SHUTDOWN server state changes
    [junit] 2017-08-06 10:40:31,633 [myid:] - INFO  [main:SessionTrackerImpl@232] - Shutting down
    [junit] 2017-08-06 10:40:31,633 [myid:] - INFO  [main:PrepRequestProcessor@1005] - Shutting down
    [junit] 2017-08-06 10:40:31,633 [myid:] - INFO  [main:SyncRequestProcessor@191] - Shutting down
    [junit] 2017-08-06 10:40:31,633 [myid:] - INFO  [ProcessThread(sid:0 cport:22240)::PrepRequestProcessor@155] - PrepRequestProcessor exited loop!
    [junit] 2017-08-06 10:40:31,634 [myid:] - INFO  [SyncThread:0:SyncRequestProcessor@169] - SyncRequestProcessor exited!
    [junit] 2017-08-06 10:40:31,634 [myid:] - INFO  [main:FinalRequestProcessor@481] - shutdown of request processor complete
    [junit] 2017-08-06 10:40:31,634 [myid:] - INFO  [main:MBeanRegistry@128] - Unregister MBean [org.apache.ZooKeeperService:name0=StandaloneServer_port22240,name1=InMemoryDataTree]
    [junit] 2017-08-06 10:40:31,634 [myid:] - INFO  [main:MBeanRegistry@128] - Unregister MBean [org.apache.ZooKeeperService:name0=StandaloneServer_port22240]
    [junit] 2017-08-06 10:40:31,634 [myid:] - INFO  [main:FourLetterWordMain@87] - connecting to 127.0.0.1 22240
    [junit] 2017-08-06 10:40:31,635 [myid:] - INFO  [main:JMXEnv@146] - ensureOnly:[]
    [junit] 2017-08-06 10:40:31,642 [myid:] - INFO  [main:ClientBase@611] - fdcount after test is: 7167 at start it was 7167
    [junit] 2017-08-06 10:40:31,642 [myid:] - INFO  [main:ZKTestCase$1@68] - SUCCEEDED testWatcherAutoResetWithLocal
    [junit] 2017-08-06 10:40:31,642 [myid:] - INFO  [main:ZKTestCase$1@63] - FINISHED testWatcherAutoResetWithLocal
    [junit] Tests run: 103, Failures: 0, Errors: 0, Skipped: 0, Time elapsed: 420.877 sec, Thread: 5, Class: org.apache.zookeeper.test.NioNettySuiteTest
    [junit] 2017-08-06 10:40:31,816 [myid:127.0.0.1:22123] - INFO  [main-SendThread(127.0.0.1:22123):ClientCnxn$SendThread@1113] - Opening socket connection to server 127.0.0.1/127.0.0.1:22123. Will not attempt to authenticate using SASL (unknown error)
    [junit] 2017-08-06 10:40:31,817 [myid:127.0.0.1:22123] - WARN  [main-SendThread(127.0.0.1:22123):ClientCnxn$SendThread@1235] - Session 0x305e1026d720000 for server 127.0.0.1/127.0.0.1:22123, unexpected error, closing socket connection and attempting reconnect
    [junit] java.net.ConnectException: Connection refused
    [junit] 	at sun.nio.ch.SocketChannelImpl.checkConnect(Native Method)
    [junit] 	at sun.nio.ch.SocketChannelImpl.finishConnect(SocketChannelImpl.java:739)
    [junit] 	at org.apache.zookeeper.ClientCnxnSocketNIO.doTransport(ClientCnxnSocketNIO.java:357)
    [junit] 	at org.apache.zookeeper.ClientCnxn$SendThread.run(ClientCnxn.java:1214)
    [junit] 2017-08-06 10:40:31,916 [myid:127.0.0.1:22043] - INFO  [main-SendThread(127.0.0.1:22043):ClientCnxn$SendThread@1113] - Opening socket connection to server 127.0.0.1/127.0.0.1:22043. Will not attempt to authenticate using SASL (unknown error)
    [junit] 2017-08-06 10:40:31,918 [myid:127.0.0.1:22043] - WARN  [main-SendThread(127.0.0.1:22043):ClientCnxn$SendThread@1235] - Session 0x105e0ffe1b80001 for server 127.0.0.1/127.0.0.1:22043, unexpected error, closing socket connection and attempting reconnect
    [junit] java.net.ConnectException: Connection refused
    [junit] 	at sun.nio.ch.SocketChannelImpl.checkConnect(Native Method)
    [junit] 	at sun.nio.ch.SocketChannelImpl.finishConnect(SocketChannelImpl.java:739)
    [junit] 	at org.apache.zookeeper.ClientCnxnSocketNIO.doTransport(ClientCnxnSocketNIO.java:357)
    [junit] 	at org.apache.zookeeper.ClientCnxn$SendThread.run(ClientCnxn.java:1214)
    [junit] 2017-08-06 10:40:32,078 [myid:127.0.0.1:22058] - INFO  [main-SendThread(127.0.0.1:22058):ClientCnxn$SendThread@1113] - Opening socket connection to server 127.0.0.1/127.0.0.1:22058. Will not attempt to authenticate using SASL (unknown error)
    [junit] 2017-08-06 10:40:32,079 [myid:127.0.0.1:22058] - WARN  [main-SendThread(127.0.0.1:22058):ClientCnxn$SendThread@1235] - Session 0x105e10035e40000 for server 127.0.0.1/127.0.0.1:22058, unexpected error, closing socket connection and attempting reconnect
    [junit] java.net.ConnectException: Connection refused
    [junit] 	at sun.nio.ch.SocketChannelImpl.checkConnect(Native Method)
    [junit] 	at sun.nio.ch.SocketChannelImpl.finishConnect(SocketChannelImpl.java:739)
    [junit] 	at org.apache.zookeeper.ClientCnxnSocketNIO.doTransport(ClientCnxnSocketNIO.java:357)
    [junit] 	at org.apache.zookeeper.ClientCnxn$SendThread.run(ClientCnxn.java:1214)

fail.build.on.test.failure:

BUILD FAILED
/home/jenkins/jenkins-slave/workspace/ZooKeeper_branch35_openjdk7/build.xml:1226: The following error occurred while executing this line:
/home/jenkins/jenkins-slave/workspace/ZooKeeper_branch35_openjdk7/build.xml:1230: Tests failed!

Total time: 10 minutes 8 seconds
Build step 'Invoke Ant' marked build as failure
Recording test results
Email was triggered for: Failure - Any
Sending email for trigger: Failure - Any



###################################################################################
############################## FAILED TESTS (if any) ##############################
2 tests failed.
FAILED:  org.apache.zookeeper.server.quorum.ReconfigRecoveryTest.testCurrentServersAreObserversInNextConfig

Error Message:
waiting for server 1 being up

Stack Trace:
junit.framework.AssertionFailedError: waiting for server 1 being up
	at org.apache.zookeeper.server.quorum.ReconfigRecoveryTest.testCurrentServersAreObserversInNextConfig(ReconfigRecoveryTest.java:223)
	at org.apache.zookeeper.JUnit4ZKTestRunner$LoggedInvokeMethod.evaluate(JUnit4ZKTestRunner.java:79)


FAILED:  org.apache.zookeeper.test.ChrootClientTest.testNonExistingOpCode

Error Message:
expected:<-4> but was:<-6>

Stack Trace:
junit.framework.AssertionFailedError: expected:<-4> but was:<-6>
	at org.apache.zookeeper.test.ClientTest.testNonExistingOpCode(ClientTest.java:853)
	at org.apache.zookeeper.JUnit4ZKTestRunner$LoggedInvokeMethod.evaluate(JUnit4ZKTestRunner.java:79)