You are viewing a plain text version of this content. The canonical link for it is here.
Posted to commits@jena.apache.org by Apache Jenkins Server <je...@builds.apache.org> on 2012/10/20 02:35:13 UTC
Build failed in Jenkins: Jena_LARQ_Snapshot #37
See <https://builds.apache.org/job/Jena_LARQ_Snapshot/37/changes>
Changes:
[andy] Revert versions
------------------------------------------
Started by an SCM change
Building remotely on ubuntu4 in workspace <https://builds.apache.org/job/Jena_LARQ_Snapshot/ws/>
Cleaning local Directory jena-larq
Checking out http://svn.apache.org/repos/asf/jena/trunk/jena-larq
A BUILD
AU .classpath
AU NOTICE
AU LICENSE
AU .project
A DEPENDENCIES
A src
A src/test
A src/test/java
A src/test/java/org
A src/test/java/org/apache
A src/test/java/org/apache/jena
A src/test/java/org/apache/jena/larq
AU src/test/java/org/apache/jena/larq/TestLuceneNRT.java
AU src/test/java/org/apache/jena/larq/TestLARQUtils.java
AU src/test/java/org/apache/jena/larq/TestLARQ_Script.java
AU src/test/java/org/apache/jena/larq/TS_LARQ.java
AU src/test/java/org/apache/jena/larq/TestLARQ_Code.java
AU src/test/java/org/apache/jena/larq/TestAssemblerLARQ.java
AU src/test/java/org/apache/jena/larq/TestLARQ_Examples.java
A src/test/java/org/apache/jena/larq/examples
AU src/test/java/org/apache/jena/larq/examples/ExLucene1.java
AU src/test/java/org/apache/jena/larq/examples/ExLucene2.java
AU src/test/java/org/apache/jena/larq/examples/ExLucene3.java
AU src/test/java/org/apache/jena/larq/examples/ExLucene4.java
AU src/test/java/org/apache/jena/larq/examples/ExLucene5.java
A src/test/java/dev
AU src/test/java/dev/Report_LARQ_Dataset.java
AU src/test/java/dev/Run_Assembler.java
AU src/test/java/dev/Report_LARQ_TDB.java
AU src/test/java/dev/Run.java
AU src/test/java/dev/Report_LARQ_Concurrent.java
A src/test/resources
A src/test/resources/LARQ
A src/test/resources/LARQ/larq-q-4.rq
A src/test/resources/LARQ/larq-q-5.rq
A src/test/resources/LARQ/larq-q-6.rq
A src/test/resources/LARQ/larq-q-7.rq
A src/test/resources/LARQ/larq-q-8.rq
A src/test/resources/LARQ/larq-q-9.rq
A src/test/resources/LARQ/results-1.srj
A src/test/resources/LARQ/results-2.srj
A src/test/resources/LARQ/results-3.srj
A src/test/resources/LARQ/results-4.srj
A src/test/resources/LARQ/results-5.srj
A src/test/resources/LARQ/results-6.srj
A src/test/resources/LARQ/results-7.srj
A src/test/resources/LARQ/results-8.srj
A src/test/resources/LARQ/results-9.srj
A src/test/resources/LARQ/data-1.ttl
A src/test/resources/LARQ/data-2.ttl
A src/test/resources/LARQ/data.ttl
A src/test/resources/LARQ/data-3.ttl
A src/test/resources/LARQ/larq-q-1.rq
A src/test/resources/LARQ/larq-q-2.rq
A src/test/resources/LARQ/larq-q-3.rq
A src/test/resources/tdb.ttl
A src/main
A src/main/java
A src/main/java/larq
AU src/main/java/larq/larq.java
AU src/main/java/larq/larqbuilder.java
A src/main/java/larq/cmdline
AU src/main/java/larq/cmdline/CmdLARQ.java
AU src/main/java/larq/cmdline/ModLARQindex.java
A src/main/java/org
A src/main/java/org/apache
A src/main/java/org/apache/jena
A src/main/java/org/apache/jena/larq
AU src/main/java/org/apache/jena/larq/IndexBuilderModel.java
AU src/main/java/org/apache/jena/larq/LARQ.java
AU src/main/java/org/apache/jena/larq/LuceneSearch.java
AU src/main/java/org/apache/jena/larq/HitLARQ.java
AU src/main/java/org/apache/jena/larq/IndexBuilderString.java
AU src/main/java/org/apache/jena/larq/IndexBuilderBase.java
AU src/main/java/org/apache/jena/larq/ScoreTest.java
AU src/main/java/org/apache/jena/larq/HitConverter.java
AU src/main/java/org/apache/jena/larq/IndexBuilder.java
AU src/main/java/org/apache/jena/larq/IndexBuilderNode.java
A src/main/java/org/apache/jena/larq/pfunction
AU src/main/java/org/apache/jena/larq/pfunction/textMatch.java
AU src/main/java/org/apache/jena/larq/IndexLARQ.java
AU src/main/java/org/apache/jena/larq/IndexBuilderLiteral.java
AU src/main/java/org/apache/jena/larq/IndexWriterFactory.java
A src/main/java/org/apache/jena/larq/assembler
AU src/main/java/org/apache/jena/larq/assembler/LARQAssemblerVocab.java
AU src/main/java/org/apache/jena/larq/assembler/AssemblerLARQ.java
AU src/main/java/org/apache/jena/larq/IndexBuilderSubject.java
AU src/main/java/org/apache/jena/larq/ARQLuceneException.java
A src/main/resources
A src/main/resources/META-INF
A src/main/resources/META-INF/NOTICE
A src/main/resources/META-INF/LICENSE
A src/main/resources/META-INF/DEPENDENCIES
AU CHANGES
A log4j.properties
AU pom.xml
AU README.txt
A .settings
AU .settings/org.eclipse.jdt.core.prefs
U .
At revision 1400351
Parsing POMs
Failed to transfer Could not find artifact org.apache.jena:jena-parent:pom:4 in central (http://repo.maven.apache.org/maven2)
ERROR: Failed to parse POMs
hudson.util.IOException2: remote file operation failed: <https://builds.apache.org/job/Jena_LARQ_Snapshot/ws/jena-larq> at hudson.remoting.Channel@64ec198c:ubuntu4
at hudson.FilePath.act(FilePath.java:838)
at hudson.FilePath.act(FilePath.java:824)
at hudson.maven.MavenModuleSetBuild$MavenModuleSetBuildExecution.parsePoms(MavenModuleSetBuild.java:910)
at hudson.maven.MavenModuleSetBuild$MavenModuleSetBuildExecution.doRun(MavenModuleSetBuild.java:654)
at hudson.model.AbstractBuild$AbstractBuildExecution.run(AbstractBuild.java:499)
at hudson.model.Run.execute(Run.java:1502)
at hudson.maven.MavenModuleSetBuild.run(MavenModuleSetBuild.java:477)
at hudson.model.ResourceController.execute(ResourceController.java:88)
at hudson.model.Executor.run(Executor.java:236)
Caused by: hudson.remoting.ProxyException: hudson.maven.MavenModuleSetBuild$MavenExecutionException: org.apache.maven.project.ProjectBuildingException: Some problems were encountered while processing the POMs:
[FATAL] Non-resolvable parent POM: Could not find artifact org.apache.jena:jena-parent:pom:4 in central (http://repo.maven.apache.org/maven2) and 'parent.relativePath' points at wrong local POM @ line 22, column 11
at hudson.maven.MavenModuleSetBuild$PomParser.invoke(MavenModuleSetBuild.java:1277)
at hudson.maven.MavenModuleSetBuild$PomParser.invoke(MavenModuleSetBuild.java:1045)
at hudson.FilePath$FileCallableWrapper.call(FilePath.java:2200)
at hudson.remoting.UserRequest.perform(UserRequest.java:118)
at hudson.remoting.UserRequest.perform(UserRequest.java:48)
at hudson.remoting.Request$2.run(Request.java:326)
at hudson.remoting.InterceptingExecutorService$1.call(InterceptingExecutorService.java:72)
at java.util.concurrent.FutureTask$Sync.innerRun(FutureTask.java:334)
at java.util.concurrent.FutureTask.run(FutureTask.java:166)
at java.util.concurrent.ThreadPoolExecutor.runWorker(ThreadPoolExecutor.java:1110)
at java.util.concurrent.ThreadPoolExecutor$Worker.run(ThreadPoolExecutor.java:603)
at java.lang.Thread.run(Thread.java:679)
Caused by: hudson.remoting.ProxyException: org.apache.maven.project.ProjectBuildingException: Some problems were encountered while processing the POMs:
[FATAL] Non-resolvable parent POM: Could not find artifact org.apache.jena:jena-parent:pom:4 in central (http://repo.maven.apache.org/maven2) and 'parent.relativePath' points at wrong local POM @ line 22, column 11
at org.apache.maven.project.DefaultProjectBuilder.build(DefaultProjectBuilder.java:363)
at hudson.maven.MavenEmbedder.buildProjects(MavenEmbedder.java:361)
at hudson.maven.MavenEmbedder.readProjects(MavenEmbedder.java:331)
at hudson.maven.MavenModuleSetBuild$PomParser.invoke(MavenModuleSetBuild.java:1227)
... 11 more
Jenkins build is back to normal : Jena_LARQ_Snapshot #39
Posted by Apache Jenkins Server <je...@builds.apache.org>.
See <https://builds.apache.org/job/Jena_LARQ_Snapshot/39/changes>
Build failed in Jenkins: Jena_LARQ_Snapshot #38
Posted by Apache Jenkins Server <je...@builds.apache.org>.
See <https://builds.apache.org/job/Jena_LARQ_Snapshot/38/changes>
Changes:
[andy] Reset; clean up version properties
------------------------------------------
Started by an SCM change
Building remotely on ubuntu4 in workspace <https://builds.apache.org/job/Jena_LARQ_Snapshot/ws/>
Cleaning local Directory jena-larq
Checking out http://svn.apache.org/repos/asf/jena/trunk/jena-larq
A BUILD
AU .classpath
AU NOTICE
AU LICENSE
AU .project
A DEPENDENCIES
A src
A src/test
A src/test/java
A src/test/java/org
A src/test/java/org/apache
A src/test/java/org/apache/jena
A src/test/java/org/apache/jena/larq
AU src/test/java/org/apache/jena/larq/TestLuceneNRT.java
AU src/test/java/org/apache/jena/larq/TestLARQUtils.java
AU src/test/java/org/apache/jena/larq/TestLARQ_Script.java
AU src/test/java/org/apache/jena/larq/TS_LARQ.java
AU src/test/java/org/apache/jena/larq/TestLARQ_Code.java
AU src/test/java/org/apache/jena/larq/TestAssemblerLARQ.java
AU src/test/java/org/apache/jena/larq/TestLARQ_Examples.java
A src/test/java/org/apache/jena/larq/examples
AU src/test/java/org/apache/jena/larq/examples/ExLucene1.java
AU src/test/java/org/apache/jena/larq/examples/ExLucene2.java
AU src/test/java/org/apache/jena/larq/examples/ExLucene3.java
AU src/test/java/org/apache/jena/larq/examples/ExLucene4.java
AU src/test/java/org/apache/jena/larq/examples/ExLucene5.java
A src/test/java/dev
AU src/test/java/dev/Report_LARQ_Dataset.java
AU src/test/java/dev/Run_Assembler.java
AU src/test/java/dev/Report_LARQ_TDB.java
AU src/test/java/dev/Run.java
AU src/test/java/dev/Report_LARQ_Concurrent.java
A src/test/resources
A src/test/resources/LARQ
A src/test/resources/LARQ/larq-q-4.rq
A src/test/resources/LARQ/larq-q-5.rq
A src/test/resources/LARQ/larq-q-6.rq
A src/test/resources/LARQ/larq-q-7.rq
A src/test/resources/LARQ/larq-q-8.rq
A src/test/resources/LARQ/larq-q-9.rq
A src/test/resources/LARQ/results-1.srj
A src/test/resources/LARQ/results-2.srj
A src/test/resources/LARQ/results-3.srj
A src/test/resources/LARQ/results-4.srj
A src/test/resources/LARQ/results-5.srj
A src/test/resources/LARQ/results-6.srj
A src/test/resources/LARQ/results-7.srj
A src/test/resources/LARQ/results-8.srj
A src/test/resources/LARQ/results-9.srj
A src/test/resources/LARQ/data-1.ttl
A src/test/resources/LARQ/data-2.ttl
A src/test/resources/LARQ/data.ttl
A src/test/resources/LARQ/data-3.ttl
A src/test/resources/LARQ/larq-q-1.rq
A src/test/resources/LARQ/larq-q-2.rq
A src/test/resources/LARQ/larq-q-3.rq
A src/test/resources/tdb.ttl
A src/main
A src/main/java
A src/main/java/larq
AU src/main/java/larq/larq.java
AU src/main/java/larq/larqbuilder.java
A src/main/java/larq/cmdline
AU src/main/java/larq/cmdline/CmdLARQ.java
AU src/main/java/larq/cmdline/ModLARQindex.java
A src/main/java/org
A src/main/java/org/apache
A src/main/java/org/apache/jena
A src/main/java/org/apache/jena/larq
AU src/main/java/org/apache/jena/larq/IndexBuilderModel.java
AU src/main/java/org/apache/jena/larq/LARQ.java
AU src/main/java/org/apache/jena/larq/LuceneSearch.java
AU src/main/java/org/apache/jena/larq/HitLARQ.java
AU src/main/java/org/apache/jena/larq/IndexBuilderString.java
AU src/main/java/org/apache/jena/larq/IndexBuilderBase.java
AU src/main/java/org/apache/jena/larq/ScoreTest.java
AU src/main/java/org/apache/jena/larq/HitConverter.java
AU src/main/java/org/apache/jena/larq/IndexBuilder.java
AU src/main/java/org/apache/jena/larq/IndexBuilderNode.java
A src/main/java/org/apache/jena/larq/pfunction
AU src/main/java/org/apache/jena/larq/pfunction/textMatch.java
AU src/main/java/org/apache/jena/larq/IndexLARQ.java
AU src/main/java/org/apache/jena/larq/IndexBuilderLiteral.java
AU src/main/java/org/apache/jena/larq/IndexWriterFactory.java
A src/main/java/org/apache/jena/larq/assembler
AU src/main/java/org/apache/jena/larq/assembler/LARQAssemblerVocab.java
AU src/main/java/org/apache/jena/larq/assembler/AssemblerLARQ.java
AU src/main/java/org/apache/jena/larq/IndexBuilderSubject.java
AU src/main/java/org/apache/jena/larq/ARQLuceneException.java
A src/main/resources
A src/main/resources/META-INF
A src/main/resources/META-INF/NOTICE
A src/main/resources/META-INF/LICENSE
A src/main/resources/META-INF/DEPENDENCIES
AU CHANGES
A log4j.properties
AU pom.xml
AU README.txt
A .settings
AU .settings/org.eclipse.jdt.core.prefs
U .
At revision 1400543
Parsing POMs
Failed to transfer Could not find artifact org.apache.jena:jena-parent:pom:4 in central (http://repo.maven.apache.org/maven2)
ERROR: Failed to parse POMs
hudson.util.IOException2: remote file operation failed: <https://builds.apache.org/job/Jena_LARQ_Snapshot/ws/jena-larq> at hudson.remoting.Channel@3bf067e4:ubuntu4
at hudson.FilePath.act(FilePath.java:838)
at hudson.FilePath.act(FilePath.java:824)
at hudson.maven.MavenModuleSetBuild$MavenModuleSetBuildExecution.parsePoms(MavenModuleSetBuild.java:910)
at hudson.maven.MavenModuleSetBuild$MavenModuleSetBuildExecution.doRun(MavenModuleSetBuild.java:654)
at hudson.model.AbstractBuild$AbstractBuildExecution.run(AbstractBuild.java:499)
at hudson.model.Run.execute(Run.java:1502)
at hudson.maven.MavenModuleSetBuild.run(MavenModuleSetBuild.java:477)
at hudson.model.ResourceController.execute(ResourceController.java:88)
at hudson.model.Executor.run(Executor.java:236)
Caused by: hudson.remoting.ProxyException: hudson.maven.MavenModuleSetBuild$MavenExecutionException: org.apache.maven.project.ProjectBuildingException: Some problems were encountered while processing the POMs:
[FATAL] Non-resolvable parent POM: Could not find artifact org.apache.jena:jena-parent:pom:4 in central (http://repo.maven.apache.org/maven2) and 'parent.relativePath' points at wrong local POM @ line 22, column 11
at hudson.maven.MavenModuleSetBuild$PomParser.invoke(MavenModuleSetBuild.java:1277)
at hudson.maven.MavenModuleSetBuild$PomParser.invoke(MavenModuleSetBuild.java:1045)
at hudson.FilePath$FileCallableWrapper.call(FilePath.java:2200)
at hudson.remoting.UserRequest.perform(UserRequest.java:118)
at hudson.remoting.UserRequest.perform(UserRequest.java:48)
at hudson.remoting.Request$2.run(Request.java:326)
at hudson.remoting.InterceptingExecutorService$1.call(InterceptingExecutorService.java:72)
at java.util.concurrent.FutureTask$Sync.innerRun(FutureTask.java:334)
at java.util.concurrent.FutureTask.run(FutureTask.java:166)
at java.util.concurrent.ThreadPoolExecutor.runWorker(ThreadPoolExecutor.java:1110)
at java.util.concurrent.ThreadPoolExecutor$Worker.run(ThreadPoolExecutor.java:603)
at java.lang.Thread.run(Thread.java:679)
Caused by: hudson.remoting.ProxyException: org.apache.maven.project.ProjectBuildingException: Some problems were encountered while processing the POMs:
[FATAL] Non-resolvable parent POM: Could not find artifact org.apache.jena:jena-parent:pom:4 in central (http://repo.maven.apache.org/maven2) and 'parent.relativePath' points at wrong local POM @ line 22, column 11
at org.apache.maven.project.DefaultProjectBuilder.build(DefaultProjectBuilder.java:363)
at hudson.maven.MavenEmbedder.buildProjects(MavenEmbedder.java:361)
at hudson.maven.MavenEmbedder.readProjects(MavenEmbedder.java:331)
at hudson.maven.MavenModuleSetBuild$PomParser.invoke(MavenModuleSetBuild.java:1227)
... 11 more