You are viewing a plain text version of this content. The canonical link for it is here.
Posted to dev@aries.apache.org by Jean-Baptiste Onofre <jb...@nanthrax.net> on 2022/01/02 07:01:09 UTC
[VOTE] Apache Aries Proxy Impl 1.1.12 release
Hi all,
I submit Aries Proxy Impl 1.1.12 release to your vote.
This release supports JDK18+ by upgrading to ASM 9.2.
Please, take a look on Release Notes for details.
Release Notes:
https://issues.apache.org/jira/secure/ReleaseNote.jspa?projectId=12310981&version=12351182
Staging Maven Repository:
https://repository.apache.org/content/repositories/orgapachearies-1205/
Staging Dist Repository:
https://dist.apache.org/repos/dist/dev/aries/proxy-impl/1.1.12/
Git tag:
org.apache.aries.proxy-1.1.12
Please vote to approve this release:
[ ] +1 Approve the release
[ ] -1 Don't approve the release (please provide specific comments)
This vote will be open for at least 72 hours.
Regards
JB
Re: [VOTE] Apache Aries Proxy Impl 1.1.12 release
Posted by da...@apache.org.
+1
David
On Tue, 4 Jan 2022 at 13:34, Raymond Augé <ra...@liferay.com.invalid>
wrote:
> +1
>
> Ray
>
> On Tue., Jan. 4, 2022, 4:55 a.m. Romain Manni-Bucau, <
> rmannibucau@gmail.com>
> wrote:
>
> > +1
> >
> > Romain Manni-Bucau
> > @rmannibucau <https://twitter.com/rmannibucau> | Blog
> > <https://rmannibucau.metawerx.net/> | Old Blog
> > <http://rmannibucau.wordpress.com> | Github <
> > https://github.com/rmannibucau> |
> > LinkedIn <https://www.linkedin.com/in/rmannibucau> | Book
> > <
> >
> https://www.packtpub.com/application-development/java-ee-8-high-performance
> > >
> >
> >
> > Le mar. 4 janv. 2022 à 10:46, Jean-Baptiste Onofré <jb...@nanthrax.net> a
> > écrit :
> >
> > > +1 (binding)
> > >
> > > Regards
> > > JB
> > >
> > > On 02/01/2022 08:01, Jean-Baptiste Onofre wrote:
> > > > Hi all,
> > > >
> > > > I submit Aries Proxy Impl 1.1.12 release to your vote.
> > > > This release supports JDK18+ by upgrading to ASM 9.2.
> > > >
> > > > Please, take a look on Release Notes for details.
> > > >
> > > > Release Notes:
> > > >
> > >
> >
> https://issues.apache.org/jira/secure/ReleaseNote.jspa?projectId=12310981&version=12351182
> > > >
> > > > Staging Maven Repository:
> > > >
> > https://repository.apache.org/content/repositories/orgapachearies-1205/
> > > >
> > > > Staging Dist Repository:
> > > > https://dist.apache.org/repos/dist/dev/aries/proxy-impl/1.1.12/
> > > >
> > > > Git tag:
> > > > org.apache.aries.proxy-1.1.12
> > > >
> > > > Please vote to approve this release:
> > > >
> > > > [ ] +1 Approve the release
> > > > [ ] -1 Don't approve the release (please provide specific comments)
> > > >
> > > > This vote will be open for at least 72 hours.
> > > >
> > > > Regards
> > > > JB
> > > >
> > >
> >
>
Re: [VOTE] Apache Aries Proxy Impl 1.1.12 release
Posted by Raymond Augé <ra...@liferay.com.INVALID>.
+1
Ray
On Tue., Jan. 4, 2022, 4:55 a.m. Romain Manni-Bucau, <rm...@gmail.com>
wrote:
> +1
>
> Romain Manni-Bucau
> @rmannibucau <https://twitter.com/rmannibucau> | Blog
> <https://rmannibucau.metawerx.net/> | Old Blog
> <http://rmannibucau.wordpress.com> | Github <
> https://github.com/rmannibucau> |
> LinkedIn <https://www.linkedin.com/in/rmannibucau> | Book
> <
> https://www.packtpub.com/application-development/java-ee-8-high-performance
> >
>
>
> Le mar. 4 janv. 2022 à 10:46, Jean-Baptiste Onofré <jb...@nanthrax.net> a
> écrit :
>
> > +1 (binding)
> >
> > Regards
> > JB
> >
> > On 02/01/2022 08:01, Jean-Baptiste Onofre wrote:
> > > Hi all,
> > >
> > > I submit Aries Proxy Impl 1.1.12 release to your vote.
> > > This release supports JDK18+ by upgrading to ASM 9.2.
> > >
> > > Please, take a look on Release Notes for details.
> > >
> > > Release Notes:
> > >
> >
> https://issues.apache.org/jira/secure/ReleaseNote.jspa?projectId=12310981&version=12351182
> > >
> > > Staging Maven Repository:
> > >
> https://repository.apache.org/content/repositories/orgapachearies-1205/
> > >
> > > Staging Dist Repository:
> > > https://dist.apache.org/repos/dist/dev/aries/proxy-impl/1.1.12/
> > >
> > > Git tag:
> > > org.apache.aries.proxy-1.1.12
> > >
> > > Please vote to approve this release:
> > >
> > > [ ] +1 Approve the release
> > > [ ] -1 Don't approve the release (please provide specific comments)
> > >
> > > This vote will be open for at least 72 hours.
> > >
> > > Regards
> > > JB
> > >
> >
>
Re: [VOTE] Apache Aries Proxy Impl 1.1.12 release
Posted by Romain Manni-Bucau <rm...@gmail.com>.
+1
Romain Manni-Bucau
@rmannibucau <https://twitter.com/rmannibucau> | Blog
<https://rmannibucau.metawerx.net/> | Old Blog
<http://rmannibucau.wordpress.com> | Github <https://github.com/rmannibucau> |
LinkedIn <https://www.linkedin.com/in/rmannibucau> | Book
<https://www.packtpub.com/application-development/java-ee-8-high-performance>
Le mar. 4 janv. 2022 à 10:46, Jean-Baptiste Onofré <jb...@nanthrax.net> a
écrit :
> +1 (binding)
>
> Regards
> JB
>
> On 02/01/2022 08:01, Jean-Baptiste Onofre wrote:
> > Hi all,
> >
> > I submit Aries Proxy Impl 1.1.12 release to your vote.
> > This release supports JDK18+ by upgrading to ASM 9.2.
> >
> > Please, take a look on Release Notes for details.
> >
> > Release Notes:
> >
> https://issues.apache.org/jira/secure/ReleaseNote.jspa?projectId=12310981&version=12351182
> >
> > Staging Maven Repository:
> > https://repository.apache.org/content/repositories/orgapachearies-1205/
> >
> > Staging Dist Repository:
> > https://dist.apache.org/repos/dist/dev/aries/proxy-impl/1.1.12/
> >
> > Git tag:
> > org.apache.aries.proxy-1.1.12
> >
> > Please vote to approve this release:
> >
> > [ ] +1 Approve the release
> > [ ] -1 Don't approve the release (please provide specific comments)
> >
> > This vote will be open for at least 72 hours.
> >
> > Regards
> > JB
> >
>
Re: [VOTE] Apache Aries Proxy Impl 1.1.12 release
Posted by Jean-Baptiste Onofré <jb...@nanthrax.net>.
+1 (binding)
Regards
JB
On 02/01/2022 08:01, Jean-Baptiste Onofre wrote:
> Hi all,
>
> I submit Aries Proxy Impl 1.1.12 release to your vote.
> This release supports JDK18+ by upgrading to ASM 9.2.
>
> Please, take a look on Release Notes for details.
>
> Release Notes:
> https://issues.apache.org/jira/secure/ReleaseNote.jspa?projectId=12310981&version=12351182
>
> Staging Maven Repository:
> https://repository.apache.org/content/repositories/orgapachearies-1205/
>
> Staging Dist Repository:
> https://dist.apache.org/repos/dist/dev/aries/proxy-impl/1.1.12/
>
> Git tag:
> org.apache.aries.proxy-1.1.12
>
> Please vote to approve this release:
>
> [ ] +1 Approve the release
> [ ] -1 Don't approve the release (please provide specific comments)
>
> This vote will be open for at least 72 hours.
>
> Regards
> JB
>
[RESULT][VOTE] Apache Aries Proxy Impl 1.1.12 release
Posted by Jean-Baptiste Onofre <jb...@nanthrax.net>.
Hi all,
This vote passed with the following result:
+1 (binding): Dominik Przybysz, JB Onofré, Ray Augé, David Bosschaert
+1 (non binding): Romain. Manni-Bucau
I’m promoting the artifacts on Maven Central and dist.apache.org. I will then upgrade Jira.
Thanks all for your vote!
Regards
JB
> Le 2 janv. 2022 à 08:01, Jean-Baptiste Onofre <jb...@nanthrax.net> a écrit :
>
> Hi all,
>
> I submit Aries Proxy Impl 1.1.12 release to your vote.
> This release supports JDK18+ by upgrading to ASM 9.2.
>
> Please, take a look on Release Notes for details.
>
> Release Notes:
> https://issues.apache.org/jira/secure/ReleaseNote.jspa?projectId=12310981&version=12351182
>
> Staging Maven Repository:
> https://repository.apache.org/content/repositories/orgapachearies-1205/
>
> Staging Dist Repository:
> https://dist.apache.org/repos/dist/dev/aries/proxy-impl/1.1.12/
>
> Git tag:
> org.apache.aries.proxy-1.1.12
>
> Please vote to approve this release:
>
> [ ] +1 Approve the release
> [ ] -1 Don't approve the release (please provide specific comments)
>
> This vote will be open for at least 72 hours.
>
> Regards
> JB
Re: [VOTE] Apache Aries Proxy Impl 1.1.12 release
Posted by JB Onofré <jb...@nanthrax.net>.
Yes agree. The purpose of this release is the first step. Then I will move forward for full lts support.
Regards
JB
> Le 3 janv. 2022 à 07:16, Dominik Przybysz <al...@gmail.com> a écrit :
>
> Hi,
> if it solves some import diamond issues then it is fine and you have my +1.
> In my opinion for future releases our bundles should be focused on
> supporting LTS and lower java versions support should be only nice to have,
> but not obligatory.
>
> niedz., 2 sty 2022 o 13:45 Jean-Baptiste Onofre <jb...@nanthrax.net>
> napisał(a):
>
>> Ah ok. Catcha.
>>
>> I propose to focus on Java 17/18 for new release (the tests probably needs
>> an update).
>> This release just upgrades to ASM 9.2 (opcode 18) for third party.
>> Thoughts ?
>>
>> Regards
>> JB
>>
>>> Le 2 janv. 2022 à 11:28, Dominik Przybysz <al...@gmail.com> a
>> écrit :
>>>
>>> Works fine with java 8 and 11, but not with 17 and 18ea
>>>
>>> I thought that it should work with modern Java, especially when I saw
>> that
>>> you have upgraded ASM to support JDK 18.
>>>
>>> niedz., 2 sty 2022 o 11:20 Jean-Baptiste Onofre <jb...@nanthrax.net>
>>> napisał(a):
>>>
>>>> Hi,
>>>>
>>>> I built with Java 8:
>>>>
>>>> java version "1.8.0_301"
>>>> Java(TM) SE Runtime Environment (build 1.8.0_301-b09)
>>>>
>>>> And it works for me.
>>>>
>>>> Do you also have the same issue on trunk ?
>>>>
>>>> Regards
>>>> JB
>>>>
>>>>> Le 2 janv. 2022 à 10:43, Dominik Przybysz <al...@gmail.com> a
>>>> écrit :
>>>>>
>>>>> Hi,
>>>>> I tried to run maven on this repository and tests fail on
>>>>> Java 18.ea.29-open with standard verify_staged_release script.
>>>>> Do I need to do sth or sth is missing?
>>>>>
>>>>> [INFO] Results:
>>>>> [INFO]
>>>>> [ERROR] Failures:
>>>>> [ERROR] WovenProxyGeneratorTest.testWovenProxyIsSynthetic:489
>>>>> [ERROR]
>>>>>
>>>>
>> WovenProxyPlusSubclassGeneratorTest>WovenProxyGeneratorTest.testWovenProxyIsSynthetic:489
>>>>> [ERROR] Errors:
>>>>> [ERROR]
>>>>>
>>>>
>> ProxySubclassGeneratorTest.setUp:78->getGeneratedSubclass:351->getProxyClass:403
>>>>> » InaccessibleObject
>>>>> [ERROR]
>>>>>
>>>>
>> ProxySubclassGeneratorTest.setUp:78->getGeneratedSubclass:351->getProxyClass:403
>>>>> » InaccessibleObject
>>>>> [ERROR]
>>>>>
>>>>
>> ProxySubclassGeneratorTest.setUp:78->getGeneratedSubclass:351->getProxyClass:403
>>>>> » InaccessibleObject
>>>>> [ERROR]
>>>>>
>>>>
>> ProxySubclassGeneratorTest.setUp:78->getGeneratedSubclass:351->getProxyClass:403
>>>>> » InaccessibleObject
>>>>> [ERROR]
>>>>>
>>>>
>> ProxySubclassGeneratorTest.setUp:78->getGeneratedSubclass:351->getProxyClass:403
>>>>> » InaccessibleObject
>>>>> [ERROR]
>>>>>
>>>>
>> ProxySubclassGeneratorTest.setUp:78->getGeneratedSubclass:351->getProxyClass:403
>>>>> » InaccessibleObject
>>>>> [ERROR]
>>>>>
>>>>
>> ProxySubclassGeneratorTest.setUp:78->getGeneratedSubclass:351->getProxyClass:403
>>>>> » InaccessibleObject
>>>>> [ERROR]
>>>>>
>>>>
>> ProxySubclassGeneratorTest.setUp:78->getGeneratedSubclass:351->getProxyClass:403
>>>>> » InaccessibleObject
>>>>> [ERROR]
>>>>>
>>>>
>> ProxySubclassGeneratorTest.setUp:78->getGeneratedSubclass:351->getProxyClass:403
>>>>> » InaccessibleObject
>>>>> [ERROR]
>>>>>
>>>>
>> ProxySubclassGeneratorTest.setUp:78->getGeneratedSubclass:351->getProxyClass:403
>>>>> » InaccessibleObject
>>>>> [ERROR]
>>>>>
>>>>
>> ProxySubclassGeneratorTest.setUp:78->getGeneratedSubclass:351->getProxyClass:403
>>>>> » InaccessibleObject
>>>>> [ERROR]
>>>>>
>>>>
>> ProxySubclassGeneratorTest.setUp:78->getGeneratedSubclass:351->getProxyClass:403
>>>>> » InaccessibleObject
>>>>> [ERROR]
>>>>>
>>>>
>> ProxySubclassGeneratorTest.setUp:78->getGeneratedSubclass:351->getProxyClass:403
>>>>> » InaccessibleObject
>>>>> [ERROR]
>>>>>
>>>>
>> ProxySubclassGeneratorTest.setUp:78->getGeneratedSubclass:351->getProxyClass:403
>>>>> » InaccessibleObject
>>>>> [ERROR]
>>>>>
>>>>
>> ProxySubclassGeneratorTest.setUp:78->getGeneratedSubclass:351->getProxyClass:403
>>>>> » InaccessibleObject
>>>>> [ERROR]
>>>>>
>>>>
>> ProxySubclassGeneratorTest.setUp:78->getGeneratedSubclass:351->getProxyClass:403
>>>>> » InaccessibleObject
>>>>> [ERROR]
>>>>>
>>>>
>> ProxySubclassGeneratorTest.setUp:78->getGeneratedSubclass:351->getProxyClass:403
>>>>> » InaccessibleObject
>>>>> [ERROR]
>>>>>
>>>>
>> ProxySubclassGeneratorTest.setUp:78->getGeneratedSubclass:351->getProxyClass:403
>>>>> » InaccessibleObject
>>>>> [ERROR]
>>>>>
>>>>
>> ProxySubclassGeneratorTest.setUp:78->getGeneratedSubclass:351->getProxyClass:403
>>>>> » InaccessibleObject
>>>>> [ERROR]
>>>>>
>>>>
>> ProxySubclassGeneratorTest.setUp:78->getGeneratedSubclass:351->getProxyClass:403
>>>>> » InaccessibleObject
>>>>> [ERROR]
>>>>>
>>>>
>> ProxySubclassGeneratorTest.setUp:78->getGeneratedSubclass:351->getProxyClass:403
>>>>> » InaccessibleObject
>>>>> [ERROR]
>>>>>
>>>>
>> ProxySubclassGeneratorTest.setUp:78->getGeneratedSubclass:351->getProxyClass:403
>>>>> » InaccessibleObject
>>>>> [ERROR]
>>>>>
>>>>
>> ProxySubclassGeneratorTest.setUp:78->getGeneratedSubclass:351->getProxyClass:403
>>>>> » InaccessibleObject
>>>>> [INFO]
>>>>> [ERROR] Tests run: 123, Failures: 2, Errors: 23, Skipped: 0
>>>>> [INFO]
>>>>>
>>>>> More detailed error example:
>>>>>
>>>>> [ERROR]
>>>>>
>> testGenerics(org.apache.aries.blueprint.proxy.ProxySubclassGeneratorTest)
>>>>> Time elapsed: 0.007 s <<< ERROR!
>>>>> java.lang.reflect.InaccessibleObjectException: Unable to make protected
>>>>> final java.lang.Class
>>>>>
>>>>
>> java.lang.ClassLoader.defineClass(java.lang.String,byte[],int,int,java.security.ProtectionDomain)
>>>>> throws java.lang.ClassFormatError accessible: module java.base does not
>>>>> "opens java.lang" to unnamed module @1f0eba3c
>>>>> at
>>>>>
>>>>
>> org.apache.aries.blueprint.proxy.ProxySubclassGeneratorTest.getProxyClass(ProxySubclassGeneratorTest.java:403)
>>>>> at
>>>>>
>>>>
>> org.apache.aries.blueprint.proxy.ProxySubclassGeneratorTest.getGeneratedSubclass(ProxySubclassGeneratorTest.java:351)
>>>>> at
>>>>>
>>>>
>> org.apache.aries.blueprint.proxy.ProxySubclassGeneratorTest.setUp(ProxySubclassGeneratorTest.java:78)
>>>>>
>>>>>
>>>>> niedz., 2 sty 2022 o 08:01 Jean-Baptiste Onofre <jb...@nanthrax.net>
>>>>> napisał(a):
>>>>>
>>>>>> Hi all,
>>>>>>
>>>>>> I submit Aries Proxy Impl 1.1.12 release to your vote.
>>>>>> This release supports JDK18+ by upgrading to ASM 9.2.
>>>>>>
>>>>>> Please, take a look on Release Notes for details.
>>>>>>
>>>>>> Release Notes:
>>>>>>
>>>>>>
>>>>
>> https://issues.apache.org/jira/secure/ReleaseNote.jspa?projectId=12310981&version=12351182
>>>>>>
>>>>>> Staging Maven Repository:
>>>>>>
>> https://repository.apache.org/content/repositories/orgapachearies-1205/
>>>>>>
>>>>>> Staging Dist Repository:
>>>>>> https://dist.apache.org/repos/dist/dev/aries/proxy-impl/1.1.12/
>>>>>>
>>>>>> Git tag:
>>>>>> org.apache.aries.proxy-1.1.12
>>>>>>
>>>>>> Please vote to approve this release:
>>>>>>
>>>>>> [ ] +1 Approve the release
>>>>>> [ ] -1 Don't approve the release (please provide specific comments)
>>>>>>
>>>>>> This vote will be open for at least 72 hours.
>>>>>>
>>>>>> Regards
>>>>>> JB
>>>>>
>>>>>
>>>>>
>>>>> --
>>>>> Pozdrawiam / Regards,
>>>>> Dominik Przybysz
>>>>
>>>>
>>>
>>> --
>>> Pozdrawiam / Regards,
>>> Dominik Przybysz
>>
>>
>
> --
> Pozdrawiam / Regards,
> Dominik Przybysz
Re: [VOTE] Apache Aries Proxy Impl 1.1.12 release
Posted by Dominik Przybysz <al...@gmail.com>.
Hi,
if it solves some import diamond issues then it is fine and you have my +1.
In my opinion for future releases our bundles should be focused on
supporting LTS and lower java versions support should be only nice to have,
but not obligatory.
niedz., 2 sty 2022 o 13:45 Jean-Baptiste Onofre <jb...@nanthrax.net>
napisał(a):
> Ah ok. Catcha.
>
> I propose to focus on Java 17/18 for new release (the tests probably needs
> an update).
> This release just upgrades to ASM 9.2 (opcode 18) for third party.
> Thoughts ?
>
> Regards
> JB
>
> > Le 2 janv. 2022 à 11:28, Dominik Przybysz <al...@gmail.com> a
> écrit :
> >
> > Works fine with java 8 and 11, but not with 17 and 18ea
> >
> > I thought that it should work with modern Java, especially when I saw
> that
> > you have upgraded ASM to support JDK 18.
> >
> > niedz., 2 sty 2022 o 11:20 Jean-Baptiste Onofre <jb...@nanthrax.net>
> > napisał(a):
> >
> >> Hi,
> >>
> >> I built with Java 8:
> >>
> >> java version "1.8.0_301"
> >> Java(TM) SE Runtime Environment (build 1.8.0_301-b09)
> >>
> >> And it works for me.
> >>
> >> Do you also have the same issue on trunk ?
> >>
> >> Regards
> >> JB
> >>
> >>> Le 2 janv. 2022 à 10:43, Dominik Przybysz <al...@gmail.com> a
> >> écrit :
> >>>
> >>> Hi,
> >>> I tried to run maven on this repository and tests fail on
> >>> Java 18.ea.29-open with standard verify_staged_release script.
> >>> Do I need to do sth or sth is missing?
> >>>
> >>> [INFO] Results:
> >>> [INFO]
> >>> [ERROR] Failures:
> >>> [ERROR] WovenProxyGeneratorTest.testWovenProxyIsSynthetic:489
> >>> [ERROR]
> >>>
> >>
> WovenProxyPlusSubclassGeneratorTest>WovenProxyGeneratorTest.testWovenProxyIsSynthetic:489
> >>> [ERROR] Errors:
> >>> [ERROR]
> >>>
> >>
> ProxySubclassGeneratorTest.setUp:78->getGeneratedSubclass:351->getProxyClass:403
> >>> » InaccessibleObject
> >>> [ERROR]
> >>>
> >>
> ProxySubclassGeneratorTest.setUp:78->getGeneratedSubclass:351->getProxyClass:403
> >>> » InaccessibleObject
> >>> [ERROR]
> >>>
> >>
> ProxySubclassGeneratorTest.setUp:78->getGeneratedSubclass:351->getProxyClass:403
> >>> » InaccessibleObject
> >>> [ERROR]
> >>>
> >>
> ProxySubclassGeneratorTest.setUp:78->getGeneratedSubclass:351->getProxyClass:403
> >>> » InaccessibleObject
> >>> [ERROR]
> >>>
> >>
> ProxySubclassGeneratorTest.setUp:78->getGeneratedSubclass:351->getProxyClass:403
> >>> » InaccessibleObject
> >>> [ERROR]
> >>>
> >>
> ProxySubclassGeneratorTest.setUp:78->getGeneratedSubclass:351->getProxyClass:403
> >>> » InaccessibleObject
> >>> [ERROR]
> >>>
> >>
> ProxySubclassGeneratorTest.setUp:78->getGeneratedSubclass:351->getProxyClass:403
> >>> » InaccessibleObject
> >>> [ERROR]
> >>>
> >>
> ProxySubclassGeneratorTest.setUp:78->getGeneratedSubclass:351->getProxyClass:403
> >>> » InaccessibleObject
> >>> [ERROR]
> >>>
> >>
> ProxySubclassGeneratorTest.setUp:78->getGeneratedSubclass:351->getProxyClass:403
> >>> » InaccessibleObject
> >>> [ERROR]
> >>>
> >>
> ProxySubclassGeneratorTest.setUp:78->getGeneratedSubclass:351->getProxyClass:403
> >>> » InaccessibleObject
> >>> [ERROR]
> >>>
> >>
> ProxySubclassGeneratorTest.setUp:78->getGeneratedSubclass:351->getProxyClass:403
> >>> » InaccessibleObject
> >>> [ERROR]
> >>>
> >>
> ProxySubclassGeneratorTest.setUp:78->getGeneratedSubclass:351->getProxyClass:403
> >>> » InaccessibleObject
> >>> [ERROR]
> >>>
> >>
> ProxySubclassGeneratorTest.setUp:78->getGeneratedSubclass:351->getProxyClass:403
> >>> » InaccessibleObject
> >>> [ERROR]
> >>>
> >>
> ProxySubclassGeneratorTest.setUp:78->getGeneratedSubclass:351->getProxyClass:403
> >>> » InaccessibleObject
> >>> [ERROR]
> >>>
> >>
> ProxySubclassGeneratorTest.setUp:78->getGeneratedSubclass:351->getProxyClass:403
> >>> » InaccessibleObject
> >>> [ERROR]
> >>>
> >>
> ProxySubclassGeneratorTest.setUp:78->getGeneratedSubclass:351->getProxyClass:403
> >>> » InaccessibleObject
> >>> [ERROR]
> >>>
> >>
> ProxySubclassGeneratorTest.setUp:78->getGeneratedSubclass:351->getProxyClass:403
> >>> » InaccessibleObject
> >>> [ERROR]
> >>>
> >>
> ProxySubclassGeneratorTest.setUp:78->getGeneratedSubclass:351->getProxyClass:403
> >>> » InaccessibleObject
> >>> [ERROR]
> >>>
> >>
> ProxySubclassGeneratorTest.setUp:78->getGeneratedSubclass:351->getProxyClass:403
> >>> » InaccessibleObject
> >>> [ERROR]
> >>>
> >>
> ProxySubclassGeneratorTest.setUp:78->getGeneratedSubclass:351->getProxyClass:403
> >>> » InaccessibleObject
> >>> [ERROR]
> >>>
> >>
> ProxySubclassGeneratorTest.setUp:78->getGeneratedSubclass:351->getProxyClass:403
> >>> » InaccessibleObject
> >>> [ERROR]
> >>>
> >>
> ProxySubclassGeneratorTest.setUp:78->getGeneratedSubclass:351->getProxyClass:403
> >>> » InaccessibleObject
> >>> [ERROR]
> >>>
> >>
> ProxySubclassGeneratorTest.setUp:78->getGeneratedSubclass:351->getProxyClass:403
> >>> » InaccessibleObject
> >>> [INFO]
> >>> [ERROR] Tests run: 123, Failures: 2, Errors: 23, Skipped: 0
> >>> [INFO]
> >>>
> >>> More detailed error example:
> >>>
> >>> [ERROR]
> >>>
> testGenerics(org.apache.aries.blueprint.proxy.ProxySubclassGeneratorTest)
> >>> Time elapsed: 0.007 s <<< ERROR!
> >>> java.lang.reflect.InaccessibleObjectException: Unable to make protected
> >>> final java.lang.Class
> >>>
> >>
> java.lang.ClassLoader.defineClass(java.lang.String,byte[],int,int,java.security.ProtectionDomain)
> >>> throws java.lang.ClassFormatError accessible: module java.base does not
> >>> "opens java.lang" to unnamed module @1f0eba3c
> >>> at
> >>>
> >>
> org.apache.aries.blueprint.proxy.ProxySubclassGeneratorTest.getProxyClass(ProxySubclassGeneratorTest.java:403)
> >>> at
> >>>
> >>
> org.apache.aries.blueprint.proxy.ProxySubclassGeneratorTest.getGeneratedSubclass(ProxySubclassGeneratorTest.java:351)
> >>> at
> >>>
> >>
> org.apache.aries.blueprint.proxy.ProxySubclassGeneratorTest.setUp(ProxySubclassGeneratorTest.java:78)
> >>>
> >>>
> >>> niedz., 2 sty 2022 o 08:01 Jean-Baptiste Onofre <jb...@nanthrax.net>
> >>> napisał(a):
> >>>
> >>>> Hi all,
> >>>>
> >>>> I submit Aries Proxy Impl 1.1.12 release to your vote.
> >>>> This release supports JDK18+ by upgrading to ASM 9.2.
> >>>>
> >>>> Please, take a look on Release Notes for details.
> >>>>
> >>>> Release Notes:
> >>>>
> >>>>
> >>
> https://issues.apache.org/jira/secure/ReleaseNote.jspa?projectId=12310981&version=12351182
> >>>>
> >>>> Staging Maven Repository:
> >>>>
> https://repository.apache.org/content/repositories/orgapachearies-1205/
> >>>>
> >>>> Staging Dist Repository:
> >>>> https://dist.apache.org/repos/dist/dev/aries/proxy-impl/1.1.12/
> >>>>
> >>>> Git tag:
> >>>> org.apache.aries.proxy-1.1.12
> >>>>
> >>>> Please vote to approve this release:
> >>>>
> >>>> [ ] +1 Approve the release
> >>>> [ ] -1 Don't approve the release (please provide specific comments)
> >>>>
> >>>> This vote will be open for at least 72 hours.
> >>>>
> >>>> Regards
> >>>> JB
> >>>
> >>>
> >>>
> >>> --
> >>> Pozdrawiam / Regards,
> >>> Dominik Przybysz
> >>
> >>
> >
> > --
> > Pozdrawiam / Regards,
> > Dominik Przybysz
>
>
--
Pozdrawiam / Regards,
Dominik Przybysz
Re: [VOTE] Apache Aries Proxy Impl 1.1.12 release
Posted by Jean-Baptiste Onofre <jb...@nanthrax.net>.
Ah ok. Catcha.
I propose to focus on Java 17/18 for new release (the tests probably needs an update).
This release just upgrades to ASM 9.2 (opcode 18) for third party.
Thoughts ?
Regards
JB
> Le 2 janv. 2022 à 11:28, Dominik Przybysz <al...@gmail.com> a écrit :
>
> Works fine with java 8 and 11, but not with 17 and 18ea
>
> I thought that it should work with modern Java, especially when I saw that
> you have upgraded ASM to support JDK 18.
>
> niedz., 2 sty 2022 o 11:20 Jean-Baptiste Onofre <jb...@nanthrax.net>
> napisał(a):
>
>> Hi,
>>
>> I built with Java 8:
>>
>> java version "1.8.0_301"
>> Java(TM) SE Runtime Environment (build 1.8.0_301-b09)
>>
>> And it works for me.
>>
>> Do you also have the same issue on trunk ?
>>
>> Regards
>> JB
>>
>>> Le 2 janv. 2022 à 10:43, Dominik Przybysz <al...@gmail.com> a
>> écrit :
>>>
>>> Hi,
>>> I tried to run maven on this repository and tests fail on
>>> Java 18.ea.29-open with standard verify_staged_release script.
>>> Do I need to do sth or sth is missing?
>>>
>>> [INFO] Results:
>>> [INFO]
>>> [ERROR] Failures:
>>> [ERROR] WovenProxyGeneratorTest.testWovenProxyIsSynthetic:489
>>> [ERROR]
>>>
>> WovenProxyPlusSubclassGeneratorTest>WovenProxyGeneratorTest.testWovenProxyIsSynthetic:489
>>> [ERROR] Errors:
>>> [ERROR]
>>>
>> ProxySubclassGeneratorTest.setUp:78->getGeneratedSubclass:351->getProxyClass:403
>>> » InaccessibleObject
>>> [ERROR]
>>>
>> ProxySubclassGeneratorTest.setUp:78->getGeneratedSubclass:351->getProxyClass:403
>>> » InaccessibleObject
>>> [ERROR]
>>>
>> ProxySubclassGeneratorTest.setUp:78->getGeneratedSubclass:351->getProxyClass:403
>>> » InaccessibleObject
>>> [ERROR]
>>>
>> ProxySubclassGeneratorTest.setUp:78->getGeneratedSubclass:351->getProxyClass:403
>>> » InaccessibleObject
>>> [ERROR]
>>>
>> ProxySubclassGeneratorTest.setUp:78->getGeneratedSubclass:351->getProxyClass:403
>>> » InaccessibleObject
>>> [ERROR]
>>>
>> ProxySubclassGeneratorTest.setUp:78->getGeneratedSubclass:351->getProxyClass:403
>>> » InaccessibleObject
>>> [ERROR]
>>>
>> ProxySubclassGeneratorTest.setUp:78->getGeneratedSubclass:351->getProxyClass:403
>>> » InaccessibleObject
>>> [ERROR]
>>>
>> ProxySubclassGeneratorTest.setUp:78->getGeneratedSubclass:351->getProxyClass:403
>>> » InaccessibleObject
>>> [ERROR]
>>>
>> ProxySubclassGeneratorTest.setUp:78->getGeneratedSubclass:351->getProxyClass:403
>>> » InaccessibleObject
>>> [ERROR]
>>>
>> ProxySubclassGeneratorTest.setUp:78->getGeneratedSubclass:351->getProxyClass:403
>>> » InaccessibleObject
>>> [ERROR]
>>>
>> ProxySubclassGeneratorTest.setUp:78->getGeneratedSubclass:351->getProxyClass:403
>>> » InaccessibleObject
>>> [ERROR]
>>>
>> ProxySubclassGeneratorTest.setUp:78->getGeneratedSubclass:351->getProxyClass:403
>>> » InaccessibleObject
>>> [ERROR]
>>>
>> ProxySubclassGeneratorTest.setUp:78->getGeneratedSubclass:351->getProxyClass:403
>>> » InaccessibleObject
>>> [ERROR]
>>>
>> ProxySubclassGeneratorTest.setUp:78->getGeneratedSubclass:351->getProxyClass:403
>>> » InaccessibleObject
>>> [ERROR]
>>>
>> ProxySubclassGeneratorTest.setUp:78->getGeneratedSubclass:351->getProxyClass:403
>>> » InaccessibleObject
>>> [ERROR]
>>>
>> ProxySubclassGeneratorTest.setUp:78->getGeneratedSubclass:351->getProxyClass:403
>>> » InaccessibleObject
>>> [ERROR]
>>>
>> ProxySubclassGeneratorTest.setUp:78->getGeneratedSubclass:351->getProxyClass:403
>>> » InaccessibleObject
>>> [ERROR]
>>>
>> ProxySubclassGeneratorTest.setUp:78->getGeneratedSubclass:351->getProxyClass:403
>>> » InaccessibleObject
>>> [ERROR]
>>>
>> ProxySubclassGeneratorTest.setUp:78->getGeneratedSubclass:351->getProxyClass:403
>>> » InaccessibleObject
>>> [ERROR]
>>>
>> ProxySubclassGeneratorTest.setUp:78->getGeneratedSubclass:351->getProxyClass:403
>>> » InaccessibleObject
>>> [ERROR]
>>>
>> ProxySubclassGeneratorTest.setUp:78->getGeneratedSubclass:351->getProxyClass:403
>>> » InaccessibleObject
>>> [ERROR]
>>>
>> ProxySubclassGeneratorTest.setUp:78->getGeneratedSubclass:351->getProxyClass:403
>>> » InaccessibleObject
>>> [ERROR]
>>>
>> ProxySubclassGeneratorTest.setUp:78->getGeneratedSubclass:351->getProxyClass:403
>>> » InaccessibleObject
>>> [INFO]
>>> [ERROR] Tests run: 123, Failures: 2, Errors: 23, Skipped: 0
>>> [INFO]
>>>
>>> More detailed error example:
>>>
>>> [ERROR]
>>> testGenerics(org.apache.aries.blueprint.proxy.ProxySubclassGeneratorTest)
>>> Time elapsed: 0.007 s <<< ERROR!
>>> java.lang.reflect.InaccessibleObjectException: Unable to make protected
>>> final java.lang.Class
>>>
>> java.lang.ClassLoader.defineClass(java.lang.String,byte[],int,int,java.security.ProtectionDomain)
>>> throws java.lang.ClassFormatError accessible: module java.base does not
>>> "opens java.lang" to unnamed module @1f0eba3c
>>> at
>>>
>> org.apache.aries.blueprint.proxy.ProxySubclassGeneratorTest.getProxyClass(ProxySubclassGeneratorTest.java:403)
>>> at
>>>
>> org.apache.aries.blueprint.proxy.ProxySubclassGeneratorTest.getGeneratedSubclass(ProxySubclassGeneratorTest.java:351)
>>> at
>>>
>> org.apache.aries.blueprint.proxy.ProxySubclassGeneratorTest.setUp(ProxySubclassGeneratorTest.java:78)
>>>
>>>
>>> niedz., 2 sty 2022 o 08:01 Jean-Baptiste Onofre <jb...@nanthrax.net>
>>> napisał(a):
>>>
>>>> Hi all,
>>>>
>>>> I submit Aries Proxy Impl 1.1.12 release to your vote.
>>>> This release supports JDK18+ by upgrading to ASM 9.2.
>>>>
>>>> Please, take a look on Release Notes for details.
>>>>
>>>> Release Notes:
>>>>
>>>>
>> https://issues.apache.org/jira/secure/ReleaseNote.jspa?projectId=12310981&version=12351182
>>>>
>>>> Staging Maven Repository:
>>>> https://repository.apache.org/content/repositories/orgapachearies-1205/
>>>>
>>>> Staging Dist Repository:
>>>> https://dist.apache.org/repos/dist/dev/aries/proxy-impl/1.1.12/
>>>>
>>>> Git tag:
>>>> org.apache.aries.proxy-1.1.12
>>>>
>>>> Please vote to approve this release:
>>>>
>>>> [ ] +1 Approve the release
>>>> [ ] -1 Don't approve the release (please provide specific comments)
>>>>
>>>> This vote will be open for at least 72 hours.
>>>>
>>>> Regards
>>>> JB
>>>
>>>
>>>
>>> --
>>> Pozdrawiam / Regards,
>>> Dominik Przybysz
>>
>>
>
> --
> Pozdrawiam / Regards,
> Dominik Przybysz
Re: [VOTE] Apache Aries Proxy Impl 1.1.12 release
Posted by Dominik Przybysz <al...@gmail.com>.
Works fine with java 8 and 11, but not with 17 and 18ea
I thought that it should work with modern Java, especially when I saw that
you have upgraded ASM to support JDK 18.
niedz., 2 sty 2022 o 11:20 Jean-Baptiste Onofre <jb...@nanthrax.net>
napisał(a):
> Hi,
>
> I built with Java 8:
>
> java version "1.8.0_301"
> Java(TM) SE Runtime Environment (build 1.8.0_301-b09)
>
> And it works for me.
>
> Do you also have the same issue on trunk ?
>
> Regards
> JB
>
> > Le 2 janv. 2022 à 10:43, Dominik Przybysz <al...@gmail.com> a
> écrit :
> >
> > Hi,
> > I tried to run maven on this repository and tests fail on
> > Java 18.ea.29-open with standard verify_staged_release script.
> > Do I need to do sth or sth is missing?
> >
> > [INFO] Results:
> > [INFO]
> > [ERROR] Failures:
> > [ERROR] WovenProxyGeneratorTest.testWovenProxyIsSynthetic:489
> > [ERROR]
> >
> WovenProxyPlusSubclassGeneratorTest>WovenProxyGeneratorTest.testWovenProxyIsSynthetic:489
> > [ERROR] Errors:
> > [ERROR]
> >
> ProxySubclassGeneratorTest.setUp:78->getGeneratedSubclass:351->getProxyClass:403
> > » InaccessibleObject
> > [ERROR]
> >
> ProxySubclassGeneratorTest.setUp:78->getGeneratedSubclass:351->getProxyClass:403
> > » InaccessibleObject
> > [ERROR]
> >
> ProxySubclassGeneratorTest.setUp:78->getGeneratedSubclass:351->getProxyClass:403
> > » InaccessibleObject
> > [ERROR]
> >
> ProxySubclassGeneratorTest.setUp:78->getGeneratedSubclass:351->getProxyClass:403
> > » InaccessibleObject
> > [ERROR]
> >
> ProxySubclassGeneratorTest.setUp:78->getGeneratedSubclass:351->getProxyClass:403
> > » InaccessibleObject
> > [ERROR]
> >
> ProxySubclassGeneratorTest.setUp:78->getGeneratedSubclass:351->getProxyClass:403
> > » InaccessibleObject
> > [ERROR]
> >
> ProxySubclassGeneratorTest.setUp:78->getGeneratedSubclass:351->getProxyClass:403
> > » InaccessibleObject
> > [ERROR]
> >
> ProxySubclassGeneratorTest.setUp:78->getGeneratedSubclass:351->getProxyClass:403
> > » InaccessibleObject
> > [ERROR]
> >
> ProxySubclassGeneratorTest.setUp:78->getGeneratedSubclass:351->getProxyClass:403
> > » InaccessibleObject
> > [ERROR]
> >
> ProxySubclassGeneratorTest.setUp:78->getGeneratedSubclass:351->getProxyClass:403
> > » InaccessibleObject
> > [ERROR]
> >
> ProxySubclassGeneratorTest.setUp:78->getGeneratedSubclass:351->getProxyClass:403
> > » InaccessibleObject
> > [ERROR]
> >
> ProxySubclassGeneratorTest.setUp:78->getGeneratedSubclass:351->getProxyClass:403
> > » InaccessibleObject
> > [ERROR]
> >
> ProxySubclassGeneratorTest.setUp:78->getGeneratedSubclass:351->getProxyClass:403
> > » InaccessibleObject
> > [ERROR]
> >
> ProxySubclassGeneratorTest.setUp:78->getGeneratedSubclass:351->getProxyClass:403
> > » InaccessibleObject
> > [ERROR]
> >
> ProxySubclassGeneratorTest.setUp:78->getGeneratedSubclass:351->getProxyClass:403
> > » InaccessibleObject
> > [ERROR]
> >
> ProxySubclassGeneratorTest.setUp:78->getGeneratedSubclass:351->getProxyClass:403
> > » InaccessibleObject
> > [ERROR]
> >
> ProxySubclassGeneratorTest.setUp:78->getGeneratedSubclass:351->getProxyClass:403
> > » InaccessibleObject
> > [ERROR]
> >
> ProxySubclassGeneratorTest.setUp:78->getGeneratedSubclass:351->getProxyClass:403
> > » InaccessibleObject
> > [ERROR]
> >
> ProxySubclassGeneratorTest.setUp:78->getGeneratedSubclass:351->getProxyClass:403
> > » InaccessibleObject
> > [ERROR]
> >
> ProxySubclassGeneratorTest.setUp:78->getGeneratedSubclass:351->getProxyClass:403
> > » InaccessibleObject
> > [ERROR]
> >
> ProxySubclassGeneratorTest.setUp:78->getGeneratedSubclass:351->getProxyClass:403
> > » InaccessibleObject
> > [ERROR]
> >
> ProxySubclassGeneratorTest.setUp:78->getGeneratedSubclass:351->getProxyClass:403
> > » InaccessibleObject
> > [ERROR]
> >
> ProxySubclassGeneratorTest.setUp:78->getGeneratedSubclass:351->getProxyClass:403
> > » InaccessibleObject
> > [INFO]
> > [ERROR] Tests run: 123, Failures: 2, Errors: 23, Skipped: 0
> > [INFO]
> >
> > More detailed error example:
> >
> > [ERROR]
> > testGenerics(org.apache.aries.blueprint.proxy.ProxySubclassGeneratorTest)
> > Time elapsed: 0.007 s <<< ERROR!
> > java.lang.reflect.InaccessibleObjectException: Unable to make protected
> > final java.lang.Class
> >
> java.lang.ClassLoader.defineClass(java.lang.String,byte[],int,int,java.security.ProtectionDomain)
> > throws java.lang.ClassFormatError accessible: module java.base does not
> > "opens java.lang" to unnamed module @1f0eba3c
> > at
> >
> org.apache.aries.blueprint.proxy.ProxySubclassGeneratorTest.getProxyClass(ProxySubclassGeneratorTest.java:403)
> > at
> >
> org.apache.aries.blueprint.proxy.ProxySubclassGeneratorTest.getGeneratedSubclass(ProxySubclassGeneratorTest.java:351)
> > at
> >
> org.apache.aries.blueprint.proxy.ProxySubclassGeneratorTest.setUp(ProxySubclassGeneratorTest.java:78)
> >
> >
> > niedz., 2 sty 2022 o 08:01 Jean-Baptiste Onofre <jb...@nanthrax.net>
> > napisał(a):
> >
> >> Hi all,
> >>
> >> I submit Aries Proxy Impl 1.1.12 release to your vote.
> >> This release supports JDK18+ by upgrading to ASM 9.2.
> >>
> >> Please, take a look on Release Notes for details.
> >>
> >> Release Notes:
> >>
> >>
> https://issues.apache.org/jira/secure/ReleaseNote.jspa?projectId=12310981&version=12351182
> >>
> >> Staging Maven Repository:
> >> https://repository.apache.org/content/repositories/orgapachearies-1205/
> >>
> >> Staging Dist Repository:
> >> https://dist.apache.org/repos/dist/dev/aries/proxy-impl/1.1.12/
> >>
> >> Git tag:
> >> org.apache.aries.proxy-1.1.12
> >>
> >> Please vote to approve this release:
> >>
> >> [ ] +1 Approve the release
> >> [ ] -1 Don't approve the release (please provide specific comments)
> >>
> >> This vote will be open for at least 72 hours.
> >>
> >> Regards
> >> JB
> >
> >
> >
> > --
> > Pozdrawiam / Regards,
> > Dominik Przybysz
>
>
--
Pozdrawiam / Regards,
Dominik Przybysz
Re: [VOTE] Apache Aries Proxy Impl 1.1.12 release
Posted by Jean-Baptiste Onofre <jb...@nanthrax.net>.
Hi,
I built with Java 8:
java version "1.8.0_301"
Java(TM) SE Runtime Environment (build 1.8.0_301-b09)
And it works for me.
Do you also have the same issue on trunk ?
Regards
JB
> Le 2 janv. 2022 à 10:43, Dominik Przybysz <al...@gmail.com> a écrit :
>
> Hi,
> I tried to run maven on this repository and tests fail on
> Java 18.ea.29-open with standard verify_staged_release script.
> Do I need to do sth or sth is missing?
>
> [INFO] Results:
> [INFO]
> [ERROR] Failures:
> [ERROR] WovenProxyGeneratorTest.testWovenProxyIsSynthetic:489
> [ERROR]
> WovenProxyPlusSubclassGeneratorTest>WovenProxyGeneratorTest.testWovenProxyIsSynthetic:489
> [ERROR] Errors:
> [ERROR]
> ProxySubclassGeneratorTest.setUp:78->getGeneratedSubclass:351->getProxyClass:403
> » InaccessibleObject
> [ERROR]
> ProxySubclassGeneratorTest.setUp:78->getGeneratedSubclass:351->getProxyClass:403
> » InaccessibleObject
> [ERROR]
> ProxySubclassGeneratorTest.setUp:78->getGeneratedSubclass:351->getProxyClass:403
> » InaccessibleObject
> [ERROR]
> ProxySubclassGeneratorTest.setUp:78->getGeneratedSubclass:351->getProxyClass:403
> » InaccessibleObject
> [ERROR]
> ProxySubclassGeneratorTest.setUp:78->getGeneratedSubclass:351->getProxyClass:403
> » InaccessibleObject
> [ERROR]
> ProxySubclassGeneratorTest.setUp:78->getGeneratedSubclass:351->getProxyClass:403
> » InaccessibleObject
> [ERROR]
> ProxySubclassGeneratorTest.setUp:78->getGeneratedSubclass:351->getProxyClass:403
> » InaccessibleObject
> [ERROR]
> ProxySubclassGeneratorTest.setUp:78->getGeneratedSubclass:351->getProxyClass:403
> » InaccessibleObject
> [ERROR]
> ProxySubclassGeneratorTest.setUp:78->getGeneratedSubclass:351->getProxyClass:403
> » InaccessibleObject
> [ERROR]
> ProxySubclassGeneratorTest.setUp:78->getGeneratedSubclass:351->getProxyClass:403
> » InaccessibleObject
> [ERROR]
> ProxySubclassGeneratorTest.setUp:78->getGeneratedSubclass:351->getProxyClass:403
> » InaccessibleObject
> [ERROR]
> ProxySubclassGeneratorTest.setUp:78->getGeneratedSubclass:351->getProxyClass:403
> » InaccessibleObject
> [ERROR]
> ProxySubclassGeneratorTest.setUp:78->getGeneratedSubclass:351->getProxyClass:403
> » InaccessibleObject
> [ERROR]
> ProxySubclassGeneratorTest.setUp:78->getGeneratedSubclass:351->getProxyClass:403
> » InaccessibleObject
> [ERROR]
> ProxySubclassGeneratorTest.setUp:78->getGeneratedSubclass:351->getProxyClass:403
> » InaccessibleObject
> [ERROR]
> ProxySubclassGeneratorTest.setUp:78->getGeneratedSubclass:351->getProxyClass:403
> » InaccessibleObject
> [ERROR]
> ProxySubclassGeneratorTest.setUp:78->getGeneratedSubclass:351->getProxyClass:403
> » InaccessibleObject
> [ERROR]
> ProxySubclassGeneratorTest.setUp:78->getGeneratedSubclass:351->getProxyClass:403
> » InaccessibleObject
> [ERROR]
> ProxySubclassGeneratorTest.setUp:78->getGeneratedSubclass:351->getProxyClass:403
> » InaccessibleObject
> [ERROR]
> ProxySubclassGeneratorTest.setUp:78->getGeneratedSubclass:351->getProxyClass:403
> » InaccessibleObject
> [ERROR]
> ProxySubclassGeneratorTest.setUp:78->getGeneratedSubclass:351->getProxyClass:403
> » InaccessibleObject
> [ERROR]
> ProxySubclassGeneratorTest.setUp:78->getGeneratedSubclass:351->getProxyClass:403
> » InaccessibleObject
> [ERROR]
> ProxySubclassGeneratorTest.setUp:78->getGeneratedSubclass:351->getProxyClass:403
> » InaccessibleObject
> [INFO]
> [ERROR] Tests run: 123, Failures: 2, Errors: 23, Skipped: 0
> [INFO]
>
> More detailed error example:
>
> [ERROR]
> testGenerics(org.apache.aries.blueprint.proxy.ProxySubclassGeneratorTest)
> Time elapsed: 0.007 s <<< ERROR!
> java.lang.reflect.InaccessibleObjectException: Unable to make protected
> final java.lang.Class
> java.lang.ClassLoader.defineClass(java.lang.String,byte[],int,int,java.security.ProtectionDomain)
> throws java.lang.ClassFormatError accessible: module java.base does not
> "opens java.lang" to unnamed module @1f0eba3c
> at
> org.apache.aries.blueprint.proxy.ProxySubclassGeneratorTest.getProxyClass(ProxySubclassGeneratorTest.java:403)
> at
> org.apache.aries.blueprint.proxy.ProxySubclassGeneratorTest.getGeneratedSubclass(ProxySubclassGeneratorTest.java:351)
> at
> org.apache.aries.blueprint.proxy.ProxySubclassGeneratorTest.setUp(ProxySubclassGeneratorTest.java:78)
>
>
> niedz., 2 sty 2022 o 08:01 Jean-Baptiste Onofre <jb...@nanthrax.net>
> napisał(a):
>
>> Hi all,
>>
>> I submit Aries Proxy Impl 1.1.12 release to your vote.
>> This release supports JDK18+ by upgrading to ASM 9.2.
>>
>> Please, take a look on Release Notes for details.
>>
>> Release Notes:
>>
>> https://issues.apache.org/jira/secure/ReleaseNote.jspa?projectId=12310981&version=12351182
>>
>> Staging Maven Repository:
>> https://repository.apache.org/content/repositories/orgapachearies-1205/
>>
>> Staging Dist Repository:
>> https://dist.apache.org/repos/dist/dev/aries/proxy-impl/1.1.12/
>>
>> Git tag:
>> org.apache.aries.proxy-1.1.12
>>
>> Please vote to approve this release:
>>
>> [ ] +1 Approve the release
>> [ ] -1 Don't approve the release (please provide specific comments)
>>
>> This vote will be open for at least 72 hours.
>>
>> Regards
>> JB
>
>
>
> --
> Pozdrawiam / Regards,
> Dominik Przybysz
Re: [VOTE] Apache Aries Proxy Impl 1.1.12 release
Posted by Dominik Przybysz <al...@gmail.com>.
Hi,
I tried to run maven on this repository and tests fail on
Java 18.ea.29-open with standard verify_staged_release script.
Do I need to do sth or sth is missing?
[INFO] Results:
[INFO]
[ERROR] Failures:
[ERROR] WovenProxyGeneratorTest.testWovenProxyIsSynthetic:489
[ERROR]
WovenProxyPlusSubclassGeneratorTest>WovenProxyGeneratorTest.testWovenProxyIsSynthetic:489
[ERROR] Errors:
[ERROR]
ProxySubclassGeneratorTest.setUp:78->getGeneratedSubclass:351->getProxyClass:403
» InaccessibleObject
[ERROR]
ProxySubclassGeneratorTest.setUp:78->getGeneratedSubclass:351->getProxyClass:403
» InaccessibleObject
[ERROR]
ProxySubclassGeneratorTest.setUp:78->getGeneratedSubclass:351->getProxyClass:403
» InaccessibleObject
[ERROR]
ProxySubclassGeneratorTest.setUp:78->getGeneratedSubclass:351->getProxyClass:403
» InaccessibleObject
[ERROR]
ProxySubclassGeneratorTest.setUp:78->getGeneratedSubclass:351->getProxyClass:403
» InaccessibleObject
[ERROR]
ProxySubclassGeneratorTest.setUp:78->getGeneratedSubclass:351->getProxyClass:403
» InaccessibleObject
[ERROR]
ProxySubclassGeneratorTest.setUp:78->getGeneratedSubclass:351->getProxyClass:403
» InaccessibleObject
[ERROR]
ProxySubclassGeneratorTest.setUp:78->getGeneratedSubclass:351->getProxyClass:403
» InaccessibleObject
[ERROR]
ProxySubclassGeneratorTest.setUp:78->getGeneratedSubclass:351->getProxyClass:403
» InaccessibleObject
[ERROR]
ProxySubclassGeneratorTest.setUp:78->getGeneratedSubclass:351->getProxyClass:403
» InaccessibleObject
[ERROR]
ProxySubclassGeneratorTest.setUp:78->getGeneratedSubclass:351->getProxyClass:403
» InaccessibleObject
[ERROR]
ProxySubclassGeneratorTest.setUp:78->getGeneratedSubclass:351->getProxyClass:403
» InaccessibleObject
[ERROR]
ProxySubclassGeneratorTest.setUp:78->getGeneratedSubclass:351->getProxyClass:403
» InaccessibleObject
[ERROR]
ProxySubclassGeneratorTest.setUp:78->getGeneratedSubclass:351->getProxyClass:403
» InaccessibleObject
[ERROR]
ProxySubclassGeneratorTest.setUp:78->getGeneratedSubclass:351->getProxyClass:403
» InaccessibleObject
[ERROR]
ProxySubclassGeneratorTest.setUp:78->getGeneratedSubclass:351->getProxyClass:403
» InaccessibleObject
[ERROR]
ProxySubclassGeneratorTest.setUp:78->getGeneratedSubclass:351->getProxyClass:403
» InaccessibleObject
[ERROR]
ProxySubclassGeneratorTest.setUp:78->getGeneratedSubclass:351->getProxyClass:403
» InaccessibleObject
[ERROR]
ProxySubclassGeneratorTest.setUp:78->getGeneratedSubclass:351->getProxyClass:403
» InaccessibleObject
[ERROR]
ProxySubclassGeneratorTest.setUp:78->getGeneratedSubclass:351->getProxyClass:403
» InaccessibleObject
[ERROR]
ProxySubclassGeneratorTest.setUp:78->getGeneratedSubclass:351->getProxyClass:403
» InaccessibleObject
[ERROR]
ProxySubclassGeneratorTest.setUp:78->getGeneratedSubclass:351->getProxyClass:403
» InaccessibleObject
[ERROR]
ProxySubclassGeneratorTest.setUp:78->getGeneratedSubclass:351->getProxyClass:403
» InaccessibleObject
[INFO]
[ERROR] Tests run: 123, Failures: 2, Errors: 23, Skipped: 0
[INFO]
More detailed error example:
[ERROR]
testGenerics(org.apache.aries.blueprint.proxy.ProxySubclassGeneratorTest)
Time elapsed: 0.007 s <<< ERROR!
java.lang.reflect.InaccessibleObjectException: Unable to make protected
final java.lang.Class
java.lang.ClassLoader.defineClass(java.lang.String,byte[],int,int,java.security.ProtectionDomain)
throws java.lang.ClassFormatError accessible: module java.base does not
"opens java.lang" to unnamed module @1f0eba3c
at
org.apache.aries.blueprint.proxy.ProxySubclassGeneratorTest.getProxyClass(ProxySubclassGeneratorTest.java:403)
at
org.apache.aries.blueprint.proxy.ProxySubclassGeneratorTest.getGeneratedSubclass(ProxySubclassGeneratorTest.java:351)
at
org.apache.aries.blueprint.proxy.ProxySubclassGeneratorTest.setUp(ProxySubclassGeneratorTest.java:78)
niedz., 2 sty 2022 o 08:01 Jean-Baptiste Onofre <jb...@nanthrax.net>
napisał(a):
> Hi all,
>
> I submit Aries Proxy Impl 1.1.12 release to your vote.
> This release supports JDK18+ by upgrading to ASM 9.2.
>
> Please, take a look on Release Notes for details.
>
> Release Notes:
>
> https://issues.apache.org/jira/secure/ReleaseNote.jspa?projectId=12310981&version=12351182
>
> Staging Maven Repository:
> https://repository.apache.org/content/repositories/orgapachearies-1205/
>
> Staging Dist Repository:
> https://dist.apache.org/repos/dist/dev/aries/proxy-impl/1.1.12/
>
> Git tag:
> org.apache.aries.proxy-1.1.12
>
> Please vote to approve this release:
>
> [ ] +1 Approve the release
> [ ] -1 Don't approve the release (please provide specific comments)
>
> This vote will be open for at least 72 hours.
>
> Regards
> JB
--
Pozdrawiam / Regards,
Dominik Przybysz