You are viewing a plain text version of this content. The canonical link for it is here.
Posted to builds@beam.apache.org by Apache Jenkins Server <je...@builds.apache.org> on 2023/09/26 00:33:20 UTC
Build failed in Jenkins: beam_PostCommit_Java_DataflowV2 #3577
See <https://ci-beam.apache.org/job/beam_PostCommit_Java_DataflowV2/3577/display/redirect>
Changes:
------------------------------------------
[...truncated 58.30 KB...]
go: downloading google.golang.org/grpc v1.57.0
go: downloading google.golang.org/protobuf v1.31.0
go: downloading golang.org/x/sys v0.11.0
go: downloading golang.org/x/net v0.14.0
go: downloading google.golang.org/genproto/googleapis/rpc v0.0.0-20230726155614-23370e0ffb3e
go: downloading google.golang.org/genproto v0.0.0-20230706204954-ccb25ca9f130
go: downloading golang.org/x/text v0.12.0
go: added github.com/apache/beam/sdks/v2 v2.50.0
go: added github.com/golang/protobuf v1.5.3
go: added golang.org/x/net v0.14.0
go: added golang.org/x/sys v0.11.0
go: added golang.org/x/text v0.12.0
go: added google.golang.org/genproto/googleapis/rpc v0.0.0-20230726155614-23370e0ffb3e
go: added google.golang.org/grpc v1.57.0
go: added google.golang.org/protobuf v1.31.0
+ go-licenses save github.com/apache/beam/sdks/v2/java/container --save_path=/output/licenses
W0925 21:58:17.212609 35 library.go:101] "golang.org/x/sys/unix" contains non-Go code that can't be inspected for further dependencies:
/go/pkg/mod/golang.org/x/sys@v0.11.0/unix/asm_linux_amd64.s
+ go-licenses csv github.com/apache/beam/sdks/v2/java/container
+ tee /output/licenses/list.csv
W0925 21:58:22.136539 79 library.go:101] "golang.org/x/sys/unix" contains non-Go code that can't be inspected for further dependencies:
/go/pkg/mod/golang.org/x/sys@v0.11.0/unix/asm_linux_amd64.s
> Task :sdks:java:container:java8:copyJavaThirdPartyLicenses
> Task :sdks:java:container:downloadCloudProfilerAgent
% Total % Received % Xferd Average Speed Time Time Time Current
Dload Upload Total Spent Left Speed
0 0 0 0 0 0 0 0 --:--:-- --:--:-- --:--:-- 0version.txt
NOTICES
profiler_java_agent.so
100 4183k 100 4183k 0 0 20.7M 0 --:--:-- --:--:-- --:--:-- 20.8M
> Task :sdks:java:container:goPrepare UP-TO-DATE
> Task :sdks:java:container:goBuild
/home/jenkins/go/bin/go1.21.1 build -o ./build/target/linux_amd64/boot boot.go boot_test.go pathingjar.go pathingjar_test.go
> Task :release:go-licenses:java:dockerRun
github.com/apache/beam/sdks/v2/go,https://github.com/apache/beam/blob/sdks/v2.50.0/sdks/go/README.md,Apache-2.0
github.com/apache/beam/sdks/v2/java/container,https://github.com/apache/beam/blob/sdks/v2.50.0/sdks/LICENSE,Apache-2.0
github.com/golang/protobuf,https://github.com/golang/protobuf/blob/v1.5.3/LICENSE,BSD-3-Clause
golang.org/x/net,https://cs.opensource.google/go/x/net/+/v0.14.0:LICENSE,BSD-3-Clause
golang.org/x/sys/unix,https://cs.opensource.google/go/x/sys/+/v0.11.0:LICENSE,BSD-3-Clause
golang.org/x/text,https://cs.opensource.google/go/x/text/+/v0.12.0:LICENSE,BSD-3-Clause
google.golang.org/genproto/googleapis/rpc/status,https://github.com/googleapis/go-genproto/blob/23370e0ffb3e/googleapis/rpc/LICENSE,Apache-2.0
google.golang.org/grpc,https://github.com/grpc/grpc-go/blob/v1.57.0/LICENSE,Apache-2.0
google.golang.org/protobuf,https://github.com/protocolbuffers/protobuf-go/blob/v1.31.0/LICENSE,BSD-3-Clause
+ chmod -R a+w /output/licenses
> Task :release:go-licenses:java:createLicenses
> Task :sdks:java:container:java8:copyGolangLicenses
> Task :sdks:java:container:java8:copySdkHarnessLauncher
Execution optimizations have been disabled for task ':sdks:java:container:java8:copySdkHarnessLauncher' to ensure correctness due to the following reasons:
- Gradle detected a problem with the following location: '<https://ci-beam.apache.org/job/beam_PostCommit_Java_DataflowV2/ws/src/sdks/java/container/build/target'.> Reason: Task ':sdks:java:container:java8:copySdkHarnessLauncher' uses this output of task ':sdks:java:container:pullLicenses' without declaring an explicit or implicit dependency. This can lead to incorrect results being produced, depending on what order the tasks are executed. Please refer to https://docs.gradle.org/7.6.2/userguide/validation_problems.html#implicit_dependency for more details about this problem.
> Task :sdks:java:container:java8:dockerPrepare
> Task :sdks:java:container:java8:docker
#1 [internal] load build definition from Dockerfile
#1 transferring dockerfile: 2.58kB done
#1 DONE 0.0s
#2 [internal] load .dockerignore
#2 transferring context: 2B done
#2 DONE 0.0s
#3 [internal] load metadata for docker.io/library/eclipse-temurin:8
#3 DONE 0.3s
#4 [ 1/16] FROM docker.io/library/eclipse-temurin:8@sha256:ae78c894d048567fe780b577194f3409ed56ee8cb951d82c8ce66c41de46a9e4
#4 CACHED
#5 [internal] load build context
#5 transferring context: 47.26MB 0.4s done
#5 DONE 0.4s
#6 [ 2/16] ADD target/slf4j-api.jar /opt/apache/beam/jars/
#6 DONE 1.5s
#7 [ 3/16] ADD target/slf4j-jdk14.jar /opt/apache/beam/jars/
#7 DONE 0.1s
#8 [ 4/16] ADD target/jcl-over-slf4j.jar /opt/apache/beam/jars/
#8 DONE 0.1s
#9 [ 5/16] ADD target/log4j-over-slf4j.jar /opt/apache/beam/jars/
#9 DONE 0.1s
#10 [ 6/16] ADD target/log4j-to-slf4j.jar /opt/apache/beam/jars/
#10 DONE 0.1s
#11 [ 7/16] ADD target/beam-sdks-java-harness.jar /opt/apache/beam/jars/
#11 DONE 0.1s
#12 [ 8/16] COPY target/jamm.jar target/open-module-agent*.jar /opt/apache/beam/jars/
#12 DONE 0.1s
#13 [ 9/16] COPY target/linux_amd64/boot /opt/apache/beam/
#13 DONE 0.2s
#14 [10/16] COPY target/LICENSE /opt/apache/beam/
#14 DONE 0.1s
#15 [11/16] COPY target/NOTICE /opt/apache/beam/
#15 DONE 0.1s
#16 [12/16] ADD target/third_party_licenses /opt/apache/beam/third_party_licenses/
#16 DONE 0.2s
#17 [13/16] COPY target/LICENSE target/options/* /opt/apache/beam/options/
#17 DONE 0.1s
#18 [14/16] COPY target/go-licenses/* /opt/apache/beam/third_party_licenses/golang/
#18 DONE 0.1s
#19 [15/16] RUN if [ "true" = "false" ] ; then rm -rf /opt/apache/beam/third_party_licenses ; fi
#19 DONE 0.6s
#20 [16/16] COPY target/profiler/* /opt/google_cloud_profiler/
#20 DONE 0.1s
#21 exporting to image
#21 exporting layers
#21 exporting layers 0.2s done
#21 writing image sha256:9695abbe9d49914a66d646cffd8c2395f5075496c359bd7e0d83ad5388696331 done
#21 naming to docker.io/apache/beam_java8_sdk:2.52.0.dev done
#21 DONE 0.3s
> Task :runners:google-cloud-dataflow-java:buildAndPushDockerJavaContainer
WARNING: `gcloud docker` will not be supported for Docker client versions above 18.03.
As an alternative, use `gcloud auth configure-docker` to configure `docker` to
use `gcloud` as a credential helper, then use `docker` as you would for non-GCR
registries, e.g. `docker pull gcr.io/project-id/my-image`. Add
`--verbosity=error` to silence this warning: `gcloud docker
--verbosity=error -- pull gcr.io/project-id/my-image`.
See: https://cloud.google.com/container-registry/docs/support/deprecation-notices#gcloud-docker
The push refers to repository [us.gcr.io/apache-beam-testing/java-postcommit-it/java]
7472131f622a: Preparing
5f70bf18a086: Preparing
ad896c7edb58: Preparing
fcccc0bbb800: Preparing
6a39efee3066: Preparing
164d9a4c8ba8: Preparing
534a0b118f1d: Preparing
0415e8ae9567: Preparing
f60815b18663: Preparing
f03c317fa790: Preparing
e4c1ad015351: Preparing
cfe6ed979b63: Preparing
8b371d13e13a: Preparing
f72a1d2c3bbd: Preparing
92737890974c: Preparing
cc64ed2782c8: Preparing
75d91765f4e2: Preparing
a31fc5e5e9a2: Preparing
2f3ff0b4cbda: Preparing
dc0585a4b8b7: Preparing
164d9a4c8ba8: Waiting
534a0b118f1d: Waiting
0415e8ae9567: Waiting
f60815b18663: Waiting
f03c317fa790: Waiting
e4c1ad015351: Waiting
cfe6ed979b63: Waiting
8b371d13e13a: Waiting
f72a1d2c3bbd: Waiting
92737890974c: Waiting
cc64ed2782c8: Waiting
75d91765f4e2: Waiting
a31fc5e5e9a2: Waiting
2f3ff0b4cbda: Waiting
dc0585a4b8b7: Waiting
5f70bf18a086: Layer already exists
ad896c7edb58: Pushed
fcccc0bbb800: Pushed
164d9a4c8ba8: Pushed
6a39efee3066: Pushed
7472131f622a: Pushed
534a0b118f1d: Pushed
f60815b18663: Pushed
0415e8ae9567: Pushed
e4c1ad015351: Pushed
f03c317fa790: Pushed
cc64ed2782c8: Layer already exists
75d91765f4e2: Layer already exists
a31fc5e5e9a2: Layer already exists
8b371d13e13a: Pushed
cfe6ed979b63: Pushed
2f3ff0b4cbda: Layer already exists
dc0585a4b8b7: Layer already exists
92737890974c: Pushed
f72a1d2c3bbd: Pushed
20230925215747: digest: sha256:c4348eb335276b21a456acab0a5d02ee05792ae4c263bfc3c85b49a69e8fe0eb size: 4504
> Task :runners:google-cloud-dataflow-java:coreSDKJavaRunnerV2IntegrationTest NO-SOURCE
> Task :runners:google-cloud-dataflow-java:googleCloudPlatformRunnerV2IntegrationTest
org.apache.beam.sdk.io.gcp.healthcare.HL7v2IOReadWriteIT > testHL7v2IOGetAllByReadParameterE2E FAILED
java.lang.RuntimeException at HL7v2IOReadWriteIT.java:180
137 tests completed, 1 failed, 25 skipped
> Task :runners:google-cloud-dataflow-java:googleCloudPlatformRunnerV2IntegrationTest FAILED
> Task :runners:google-cloud-dataflow-java:cleanUpDockerJavaImages
Untagged: us.gcr.io/apache-beam-testing/java-postcommit-it/java:20230925215747
Untagged: us.gcr.io/apache-beam-testing/java-postcommit-it/java@sha256:c4348eb335276b21a456acab0a5d02ee05792ae4c263bfc3c85b49a69e8fe0eb
Deleted: sha256:9695abbe9d49914a66d646cffd8c2395f5075496c359bd7e0d83ad5388696331
WARNING: Successfully resolved tag to sha256, but it is recommended to use sha256 directly.
Tag: [us.gcr.io/apache-beam-testing/java-postcommit-it/java:20230925215747]
- referencing digest: [us.gcr.io/apache-beam-testing/java-postcommit-it/java@sha256:c4348eb335276b21a456acab0a5d02ee05792ae4c263bfc3c85b49a69e8fe0eb]
Deleted [[us.gcr.io/apache-beam-testing/java-postcommit-it/java:20230925215747] (referencing [us.gcr.io/apache-beam-testing/java-postcommit-it/java@sha256:c4348eb335276b21a456acab0a5d02ee05792ae4c263bfc3c85b49a69e8fe0eb])].
Removing untagged image us.gcr.io/apache-beam-testing/java-postcommit-it/java@sha256:c4348eb335276b21a456acab0a5d02ee05792ae4c263bfc3c85b49a69e8fe0eb
FAILURE: Build failed with an exception.
* What went wrong:
Execution failed for task ':runners:google-cloud-dataflow-java:googleCloudPlatformRunnerV2IntegrationTest'.
> There were failing tests. See the report at: file://<https://ci-beam.apache.org/job/beam_PostCommit_Java_DataflowV2/ws/src/runners/google-cloud-dataflow-java/build/reports/tests/googleCloudPlatformRunnerV2IntegrationTest/index.html>
* Try:
> Run with --stacktrace option to get the stack trace.
> Run with --info or --debug option to get more log output.
* Get more help at https://help.gradle.org
Deprecated Gradle features were used in this build, making it incompatible with Gradle 8.0.
You can use '--warning-mode all' to show the individual deprecation warnings and determine if they come from your own scripts or plugins.
See https://docs.gradle.org/7.6.2/userguide/command_line_interface.html#sec:command_line_warnings
Execution optimizations have been disabled for 1 invalid unit(s) of work during this build to ensure correctness.
Please consult deprecation warnings for more details.
BUILD FAILED in 2h 35m 50s
138 actionable tasks: 86 executed, 48 from cache, 4 up-to-date
Publishing build scan...
https://ge.apache.org/s/7anqhqe6f3jtm
Build step 'Invoke Gradle script' changed build result to FAILURE
Build step 'Invoke Gradle script' marked build as failure
---------------------------------------------------------------------
To unsubscribe, e-mail: builds-unsubscribe@beam.apache.org
For additional commands, e-mail: builds-help@beam.apache.org
Jenkins build is back to normal : beam_PostCommit_Java_DataflowV2 #3578
Posted by Apache Jenkins Server <je...@builds.apache.org>.
See <https://ci-beam.apache.org/job/beam_PostCommit_Java_DataflowV2/3578/display/redirect>
---------------------------------------------------------------------
To unsubscribe, e-mail: builds-unsubscribe@beam.apache.org
For additional commands, e-mail: builds-help@beam.apache.org