You are viewing a plain text version of this content. The canonical link for it is here.
Posted to notifications@maven.apache.org by Apache Jenkins Server <je...@builds.apache.org> on 2019/07/21 23:12:22 UTC

Build failed in Jenkins: Maven TLP » maven-surefire » SUREFIRE-1675 #20

See https://builds.apache.org/job/maven-box/job/maven-surefire/job/SUREFIRE-1675/20/

No changes.

All tests passed

Build log:
[...truncated 48661 lines...]
[Pipeline] // ws
[Pipeline] }
[Pipeline] // timestamps
[Pipeline] }
[Pipeline] // node
[Pipeline] }
[Pipeline] cleanWs
[2019-07-21T23:11:41.776Z] [WS-CLEANUP] Deleting project workspace...
[2019-07-21T23:11:41.776Z] [WS-CLEANUP] Deferred wipeout is used...
[2019-07-21T23:11:41.837Z] [WS-CLEANUP] done
[Pipeline] }
[Pipeline] // ws
[Pipeline] }
[Pipeline] // timestamps
[Pipeline] }
[Pipeline] // node
[Pipeline] }
[2019-07-21T23:11:49.787Z] [ERROR] Tests run: 6, Failures: 1, Errors: 0, Skipped: 0, Time elapsed: 61.487 s <<< FAILURE! - in org.apache.maven.surefire.its.jiras.Surefire946KillMainProcessInReusableForkIT
[2019-07-21T23:11:49.787Z] [ERROR] test[halt-kill](org.apache.maven.surefire.its.jiras.Surefire946KillMainProcessInReusableForkIT)  Time elapsed: 3.386 s  <<< FAILURE!
[2019-07-21T23:11:49.787Z] org.junit.ComparisonFailure: expected:<[tru]e> but was:<[fals]e>
[2019-07-21T23:11:49.787Z] 	at org.apache.maven.surefire.its.jiras.Surefire946KillMainProcessInReusableForkIT.test(Surefire946KillMainProcessInReusableForkIT.java:134)
[2019-07-21T23:11:49.787Z] 
[2019-07-21T23:11:49.787Z] [INFO] 
[2019-07-21T23:11:49.787Z] [INFO] Results:
[2019-07-21T23:11:49.787Z] [INFO] 
[2019-07-21T23:11:49.787Z] [ERROR] Failures: 
[2019-07-21T23:11:49.787Z] [ERROR]   Surefire946KillMainProcessInReusableForkIT.test:134 expected:<[tru]e> but was:<[fals]e>
[2019-07-21T23:11:49.787Z] [INFO] 
[2019-07-21T23:11:49.787Z] [ERROR] Tests run: 6, Failures: 1, Errors: 0, Skipped: 0
[2019-07-21T23:11:49.787Z] [INFO] 
[2019-07-21T23:11:49.787Z] [INFO] 
[2019-07-21T23:11:49.787Z] [INFO] --- maven-checkstyle-plugin:3.0.0:check (checkstyle-check) @ surefire-its ---
[2019-07-21T23:11:49.787Z] [INFO] 
[2019-07-21T23:11:49.787Z] [INFO] --- maven-failsafe-plugin:3.0.0-M3:verify (default) @ surefire-its ---
[2019-07-21T23:11:49.787Z] [INFO] Failsafe report directory: C:\Users\jenkins\AppData\Local\Temp\2\jenkins-maven-box-maven-surefire-SUREFIRE-1675-20\surefire-its\target\failsafe-reports
[2019-07-21T23:11:49.787Z] [INFO] ------------------------------------------------------------------------
[2019-07-21T23:11:49.787Z] [INFO] Reactor Summary for Apache Maven Surefire 3.0.0-SNAPSHOT:
[2019-07-21T23:11:49.787Z] [INFO] 
[2019-07-21T23:11:49.787Z] [INFO] Apache Maven Surefire .............................. SUCCESS [01:01 min]
[2019-07-21T23:11:49.787Z] [INFO] SureFire Logger API ................................ SUCCESS [ 23.930 s]
[2019-07-21T23:11:49.787Z] [INFO] SureFire API ....................................... SUCCESS [ 18.586 s]
[2019-07-21T23:11:49.787Z] [INFO] Surefire Extensions API ............................ SUCCESS [  3.375 s]
[2019-07-21T23:11:49.787Z] [INFO] SureFire Booter .................................... SUCCESS [ 17.014 s]
[2019-07-21T23:11:49.788Z] [INFO] Maven Surefire Test-Grouping Support ............... SUCCESS [ 12.729 s]
[2019-07-21T23:11:49.788Z] [INFO] SureFire Providers ................................. SUCCESS [  1.159 s]
[2019-07-21T23:11:49.788Z] [INFO] Shared JUnit3 Provider Code ........................ SUCCESS [  5.155 s]
[2019-07-21T23:11:49.788Z] [INFO] Shared Java 5 Provider Base ........................ SUCCESS [  7.670 s]
[2019-07-21T23:11:49.788Z] [INFO] Shared JUnit4 Provider Code ........................ SUCCESS [  7.086 s]
[2019-07-21T23:11:49.788Z] [INFO] Shared JUnit48 Provider Code ....................... SUCCESS [  7.816 s]
[2019-07-21T23:11:49.788Z] [INFO] SureFire JUnit Runner .............................. SUCCESS [  5.685 s]
[2019-07-21T23:11:49.788Z] [INFO] SureFire JUnit4 Runner ............................. SUCCESS [  5.266 s]
[2019-07-21T23:11:49.788Z] [INFO] Maven Surefire Common .............................. SUCCESS [ 52.069 s]
[2019-07-21T23:11:49.788Z] [INFO] SureFire JUnitCore Runner .......................... SUCCESS [02:22 min]
[2019-07-21T23:11:49.788Z] [INFO] SureFire JUnit Platform Runner ..................... SUCCESS [ 12.650 s]
[2019-07-21T23:11:49.788Z] [INFO] SureFire TestNG Utils .............................. SUCCESS [  6.086 s]
[2019-07-21T23:11:49.788Z] [INFO] SureFire TestNG Runner ............................. SUCCESS [  7.305 s]
[2019-07-21T23:11:49.788Z] [INFO] ShadeFire JUnit3 Provider .......................... SUCCESS [  2.196 s]
[2019-07-21T23:11:49.788Z] [INFO] Surefire Report Parser ............................. SUCCESS [  8.844 s]
[2019-07-21T23:11:49.788Z] [INFO] Maven Surefire Plugin .............................. SUCCESS [ 17.206 s]
[2019-07-21T23:11:49.788Z] [INFO] Maven Failsafe Plugin .............................. SUCCESS [01:58 min]
[2019-07-21T23:11:49.788Z] [INFO] Maven Surefire Report Plugin ....................... SUCCESS [ 22.131 s]
[2019-07-21T23:11:49.788Z] [INFO] Maven Surefire Integration Tests ................... FAILURE [02:11 min]
[2019-07-21T23:11:49.788Z] [INFO] ------------------------------------------------------------------------
[2019-07-21T23:11:49.788Z] [INFO] BUILD FAILURE
[2019-07-21T23:11:49.788Z] [INFO] ------------------------------------------------------------------------
[2019-07-21T23:11:49.788Z] [INFO] Total time:  11:40 min
[2019-07-21T23:11:49.788Z] [INFO] Finished at: 2019-07-21T16:11:44-07:00
[2019-07-21T23:11:49.788Z] [INFO] ------------------------------------------------------------------------
[2019-07-21T23:11:49.788Z] [ERROR] Failed to execute goal org.apache.maven.plugins:maven-failsafe-plugin:3.0.0-M3:verify (default) on project surefire-its: There are test failures.
[2019-07-21T23:11:49.788Z] [ERROR] 
[2019-07-21T23:11:49.788Z] [ERROR] Please refer to C:\Users\jenkins\AppData\Local\Temp\2\jenkins-maven-box-maven-surefire-SUREFIRE-1675-20\surefire-its\target\failsafe-reports for the individual test results.
[2019-07-21T23:11:49.788Z] [ERROR] Please refer to dump files (if any exist) [date].dump, [date]-jvmRun[N].dump and [date].dumpstream.
[2019-07-21T23:11:49.788Z] [ERROR] -> [Help 1]
[2019-07-21T23:11:49.788Z] org.apache.maven.lifecycle.LifecycleExecutionException: Failed to execute goal org.apache.maven.plugins:maven-failsafe-plugin:3.0.0-M3:verify (default) on project surefire-its: There are test failures.
[2019-07-21T23:11:49.788Z] 
[2019-07-21T23:11:49.788Z] Please refer to C:\Users\jenkins\AppData\Local\Temp\2\jenkins-maven-box-maven-surefire-SUREFIRE-1675-20\surefire-its\target\failsafe-reports for the individual test results.
[2019-07-21T23:11:49.788Z] Please refer to dump files (if any exist) [date].dump, [date]-jvmRun[N].dump and [date].dumpstream.
[2019-07-21T23:11:49.788Z]     at org.apache.maven.lifecycle.internal.MojoExecutor.execute (MojoExecutor.java:215)
[2019-07-21T23:11:49.788Z]     at org.apache.maven.lifecycle.internal.MojoExecutor.execute (MojoExecutor.java:156)
[2019-07-21T23:11:49.788Z]     at org.apache.maven.lifecycle.internal.MojoExecutor.execute (MojoExecutor.java:148)
[2019-07-21T23:11:49.788Z]     at org.apache.maven.lifecycle.internal.LifecycleModuleBuilder.buildProject (LifecycleModuleBuilder.java:117)
[2019-07-21T23:11:49.788Z]     at org.apache.maven.lifecycle.internal.LifecycleModuleBuilder.buildProject (LifecycleModuleBuilder.java:81)
[2019-07-21T23:11:49.788Z]     at org.apache.maven.lifecycle.internal.builder.singlethreaded.SingleThreadedBuilder.build (SingleThreadedBuilder.java:56)
[2019-07-21T23:11:49.788Z]     at org.apache.maven.lifecycle.internal.LifecycleStarter.execute (LifecycleStarter.java:128)
[2019-07-21T23:11:49.788Z]     at org.apache.maven.DefaultMaven.doExecute (DefaultMaven.java:305)
[2019-07-21T23:11:49.788Z]     at org.apache.maven.DefaultMaven.doExecute (DefaultMaven.java:192)
[2019-07-21T23:11:49.788Z]     at org.apache.maven.DefaultMaven.execute (DefaultMaven.java:105)
[2019-07-21T23:11:49.788Z]     at org.apache.maven.cli.MavenCli.execute (MavenCli.java:956)
[2019-07-21T23:11:49.788Z]     at org.apache.maven.cli.MavenCli.doMain (MavenCli.java:288)
[2019-07-21T23:11:49.788Z]     at org.apache.maven.cli.MavenCli.main (MavenCli.java:192)
[2019-07-21T23:11:49.788Z]     at sun.reflect.NativeMethodAccessorImpl.invoke0 (Native Method)
[2019-07-21T23:11:49.788Z]     at sun.reflect.NativeMethodAccessorImpl.invoke (NativeMethodAccessorImpl.java:62)
[2019-07-21T23:11:49.788Z]     at sun.reflect.DelegatingMethodAccessorImpl.invoke (DelegatingMethodAccessorImpl.java:43)
[2019-07-21T23:11:49.788Z]     at java.lang.reflect.Method.invoke (Method.java:498)
[2019-07-21T23:11:49.788Z]     at org.codehaus.plexus.classworlds.launcher.Launcher.launchEnhanced (Launcher.java:289)
[2019-07-21T23:11:49.788Z]     at org.codehaus.plexus.classworlds.launcher.Launcher.launch (Launcher.java:229)
[2019-07-21T23:11:49.788Z]     at org.codehaus.plexus.classworlds.launcher.Launcher.mainWithExitCode (Launcher.java:415)
[2019-07-21T23:11:49.788Z]     at org.codehaus.plexus.classworlds.launcher.Launcher.main (Launcher.java:356)
[2019-07-21T23:11:49.788Z] Caused by: org.apache.maven.plugin.MojoFailureException: There are test failures.
[2019-07-21T23:11:49.788Z] 
[2019-07-21T23:11:49.788Z] Please refer to C:\Users\jenkins\AppData\Local\Temp\2\jenkins-maven-box-maven-surefire-SUREFIRE-1675-20\surefire-its\target\failsafe-reports for the individual test results.
[2019-07-21T23:11:49.788Z] Please refer to dump files (if any exist) [date].dump, [date]-jvmRun[N].dump and [date].dumpstream.
[2019-07-21T23:11:49.788Z]     at org.apache.maven.plugin.surefire.SurefireHelper.throwException (SurefireHelper.java:271)
[2019-07-21T23:11:49.788Z]     at org.apache.maven.plugin.surefire.SurefireHelper.reportExecution (SurefireHelper.java:159)
[2019-07-21T23:11:49.788Z]     at org.apache.maven.plugin.failsafe.VerifyMojo.execute (VerifyMojo.java:192)
[2019-07-21T23:11:49.788Z]     at org.apache.maven.plugin.DefaultBuildPluginManager.executeMojo (DefaultBuildPluginManager.java:137)
[2019-07-21T23:11:49.788Z]     at org.apache.maven.lifecycle.internal.MojoExecutor.execute (MojoExecutor.java:210)
[2019-07-21T23:11:49.788Z]     at org.apache.maven.lifecycle.internal.MojoExecutor.execute (MojoExecutor.java:156)
[2019-07-21T23:11:49.788Z]     at org.apache.maven.lifecycle.internal.MojoExecutor.execute (MojoExecutor.java:148)
[2019-07-21T23:11:49.788Z]     at org.apache.maven.lifecycle.internal.LifecycleModuleBuilder.buildProject (LifecycleModuleBuilder.java:117)
[2019-07-21T23:11:49.788Z]     at org.apache.maven.lifecycle.internal.LifecycleModuleBuilder.buildProject (LifecycleModuleBuilder.java:81)
[2019-07-21T23:11:49.788Z]     at org.apache.maven.lifecycle.internal.builder.singlethreaded.SingleThreadedBuilder.build (SingleThreadedBuilder.java:56)
[2019-07-21T23:11:49.788Z]     at org.apache.maven.lifecycle.internal.LifecycleStarter.execute (LifecycleStarter.java:128)
[2019-07-21T23:11:49.788Z]     at org.apache.maven.DefaultMaven.doExecute (DefaultMaven.java:305)
[2019-07-21T23:11:49.788Z]     at org.apache.maven.DefaultMaven.doExecute (DefaultMaven.java:192)
[2019-07-21T23:11:49.788Z]     at org.apache.maven.DefaultMaven.execute (DefaultMaven.java:105)
[2019-07-21T23:11:49.788Z]     at org.apache.maven.cli.MavenCli.execute (MavenCli.java:956)
[2019-07-21T23:11:49.788Z]     at org.apache.maven.cli.MavenCli.doMain (MavenCli.java:288)
[2019-07-21T23:11:49.788Z]     at org.apache.maven.cli.MavenCli.main (MavenCli.java:192)
[2019-07-21T23:11:49.789Z]     at sun.reflect.NativeMethodAccessorImpl.invoke0 (Native Method)
[2019-07-21T23:11:49.789Z]     at sun.reflect.NativeMethodAccessorImpl.invoke (NativeMethodAccessorImpl.java:62)
[2019-07-21T23:11:49.789Z]     at sun.reflect.DelegatingMethodAccessorImpl.invoke (DelegatingMethodAccessorImpl.java:43)
[2019-07-21T23:11:49.789Z]     at java.lang.reflect.Method.invoke (Method.java:498)
[2019-07-21T23:11:49.789Z]     at org.codehaus.plexus.classworlds.launcher.Launcher.launchEnhanced (Launcher.java:289)
[2019-07-21T23:11:49.789Z]     at org.codehaus.plexus.classworlds.launcher.Launcher.launch (Launcher.java:229)
[2019-07-21T23:11:49.789Z]     at org.codehaus.plexus.classworlds.launcher.Launcher.mainWithExitCode (Launcher.java:415)
[2019-07-21T23:11:49.789Z]     at org.codehaus.plexus.classworlds.launcher.Launcher.main (Launcher.java:356)
[2019-07-21T23:11:49.789Z] [ERROR] 
[2019-07-21T23:11:49.789Z] [ERROR] Re-run Maven using the -X switch to enable full debug logging.
[2019-07-21T23:11:49.789Z] [ERROR] 
[2019-07-21T23:11:49.789Z] [ERROR] For more information about the errors and possible solutions, please read the following articles:
[2019-07-21T23:11:49.789Z] [ERROR] [Help 1] http://cwiki.apache.org/confluence/display/MAVEN/MojoFailureException
[2019-07-21T23:11:49.789Z] [ERROR] 
[2019-07-21T23:11:49.789Z] [ERROR] After correcting the problems, you can resume the build with the command
[2019-07-21T23:11:49.789Z] [ERROR]   mvn <goals> -rf :surefire-its
[Pipeline] }
[Pipeline] // withEnv
[Pipeline] }
[Pipeline] // stage
[Pipeline] fileExists
[Pipeline] zip
[2019-07-21T23:11:49.968Z] Writing zip file of C:\Users\jenkins\AppData\Local\Temp\2\jenkins-maven-box-maven-surefire-SUREFIRE-1675-20\maven-failsafe-plugin\target\it to C:\Users\jenkins\AppData\Local\Temp\2\jenkins-maven-box-maven-surefire-SUREFIRE-1675-20\maven-failsafe-plugin--windows-jdk11-maven3.6.x.zip
[2019-07-21T23:11:50.134Z] Zipped 78 entries.
[2019-07-21T23:11:50.134Z] Archiving C:\Users\jenkins\AppData\Local\Temp\2\jenkins-maven-box-maven-surefire-SUREFIRE-1675-20\maven-failsafe-plugin--windows-jdk11-maven3.6.x.zip
[2019-07-21T23:11:50.135Z] [Fast Archiver] No artifacts from Maven TLP » maven-surefire » SUREFIRE-1675 #19 to compare, so performing full copy of artifacts
[Pipeline] fileExists
[Pipeline] zip
[2019-07-21T23:11:50.214Z] Writing zip file of C:\Users\jenkins\AppData\Local\Temp\2\jenkins-maven-box-maven-surefire-SUREFIRE-1675-20\surefire-its\target to C:\Users\jenkins\AppData\Local\Temp\2\jenkins-maven-box-maven-surefire-SUREFIRE-1675-20\surefire-its--windows-jdk11-maven3.6.x.zip
[2019-07-21T23:11:51.946Z] Zipped 2120 entries.
[2019-07-21T23:11:51.946Z] Archiving C:\Users\jenkins\AppData\Local\Temp\2\jenkins-maven-box-maven-surefire-SUREFIRE-1675-20\surefire-its--windows-jdk11-maven3.6.x.zip
[2019-07-21T23:11:51.947Z] [Fast Archiver] No artifacts from Maven TLP » maven-surefire » SUREFIRE-1675 #19 to compare, so performing full copy of artifacts
[Pipeline] archiveArtifacts
[2019-07-21T23:11:52.264Z] Archiving artifacts
[2019-07-21T23:11:52.292Z] [Fast Archiver] No artifacts from Maven TLP » maven-surefire » SUREFIRE-1675 #19 to compare, so performing full copy of artifacts
[Pipeline] cleanWs
[2019-07-21T23:11:52.630Z] [WS-CLEANUP] Deleting project workspace...
[2019-07-21T23:11:52.630Z] [WS-CLEANUP] Deferred wipeout is used...
[2019-07-21T23:11:52.690Z] [WS-CLEANUP] done
[Pipeline] }
[Pipeline] // ws
[Pipeline] }
[Pipeline] // timestamps
[Pipeline] }
[Pipeline] // node
[Pipeline] }
[2019-07-21T23:12:17.959Z] [INFO] Tests run: 6, Failures: 0, Errors: 0, Skipped: 0, Time elapsed: 51.092 s - in org.apache.maven.surefire.its.jiras.Surefire946KillMainProcessInReusableForkIT
[2019-07-21T23:12:18.237Z] [INFO] 
[2019-07-21T23:12:18.237Z] [INFO] Results:
[2019-07-21T23:12:18.237Z] [INFO] 
[2019-07-21T23:12:18.237Z] [INFO] Tests run: 6, Failures: 0, Errors: 0, Skipped: 0
[2019-07-21T23:12:18.237Z] [INFO] 
[2019-07-21T23:12:18.237Z] [INFO] 
[2019-07-21T23:12:18.237Z] [INFO] --- maven-checkstyle-plugin:3.0.0:check (checkstyle-check) @ surefire-its ---
[2019-07-21T23:12:19.646Z] [INFO] 
[2019-07-21T23:12:19.646Z] [INFO] --- maven-failsafe-plugin:3.0.0-M3:verify (default) @ surefire-its ---
[2019-07-21T23:12:19.646Z] [INFO] Failsafe report directory: C:\Users\jenkins\AppData\Local\Temp\2\jenkins-maven-box-maven-surefire-SUREFIRE-1675-20\surefire-its\target\failsafe-reports
[2019-07-21T23:12:19.646Z] [INFO] 
[2019-07-21T23:12:19.646Z] [INFO] --- maven-install-plugin:2.5.2:install (default-install) @ surefire-its ---
[2019-07-21T23:12:19.646Z] [INFO] Skipping artifact installation
[2019-07-21T23:12:19.646Z] [INFO] ------------------------------------------------------------------------
[2019-07-21T23:12:19.646Z] [INFO] Reactor Summary for Apache Maven Surefire 3.0.0-SNAPSHOT:
[2019-07-21T23:12:19.646Z] [INFO] 
[2019-07-21T23:12:19.646Z] [INFO] Apache Maven Surefire .............................. SUCCESS [01:06 min]
[2019-07-21T23:12:19.646Z] [INFO] SureFire Logger API ................................ SUCCESS [ 22.521 s]
[2019-07-21T23:12:19.646Z] [INFO] SureFire API ....................................... SUCCESS [ 19.479 s]
[2019-07-21T23:12:19.646Z] [INFO] Surefire Extensions API ............................ SUCCESS [  2.839 s]
[2019-07-21T23:12:19.646Z] [INFO] SureFire Booter .................................... SUCCESS [ 17.544 s]
[2019-07-21T23:12:19.646Z] [INFO] Maven Surefire Test-Grouping Support ............... SUCCESS [ 12.607 s]
[2019-07-21T23:12:19.646Z] [INFO] SureFire Providers ................................. SUCCESS [  1.400 s]
[2019-07-21T23:12:19.646Z] [INFO] Shared JUnit3 Provider Code ........................ SUCCESS [  5.227 s]
[2019-07-21T23:12:19.646Z] [INFO] Shared Java 5 Provider Base ........................ SUCCESS [  7.280 s]
[2019-07-21T23:12:19.646Z] [INFO] Shared JUnit4 Provider Code ........................ SUCCESS [  7.385 s]
[2019-07-21T23:12:19.646Z] [INFO] Shared JUnit48 Provider Code ....................... SUCCESS [  8.297 s]
[2019-07-21T23:12:19.646Z] [INFO] SureFire JUnit Runner .............................. SUCCESS [  6.328 s]
[2019-07-21T23:12:19.646Z] [INFO] SureFire JUnit4 Runner ............................. SUCCESS [ 37.114 s]
[2019-07-21T23:12:19.646Z] [INFO] Maven Surefire Common .............................. SUCCESS [ 44.761 s]
[2019-07-21T23:12:19.646Z] [INFO] SureFire JUnitCore Runner .......................... SUCCESS [02:24 min]
[2019-07-21T23:12:19.646Z] [INFO] SureFire JUnit Platform Runner ..................... SUCCESS [ 13.335 s]
[2019-07-21T23:12:19.646Z] [INFO] SureFire TestNG Utils .............................. SUCCESS [  6.087 s]
[2019-07-21T23:12:19.646Z] [INFO] SureFire TestNG Runner ............................. SUCCESS [  6.814 s]
[2019-07-21T23:12:19.646Z] [INFO] ShadeFire JUnit3 Provider .......................... SUCCESS [  2.342 s]
[2019-07-21T23:12:19.646Z] [INFO] Surefire Report Parser ............................. SUCCESS [  9.100 s]
[2019-07-21T23:12:19.646Z] [INFO] Maven Surefire Plugin .............................. SUCCESS [ 17.127 s]
[2019-07-21T23:12:19.646Z] [INFO] Maven Failsafe Plugin .............................. SUCCESS [02:03 min]
[2019-07-21T23:12:19.646Z] [INFO] Maven Surefire Report Plugin ....................... SUCCESS [ 21.773 s]
[2019-07-21T23:12:19.646Z] [INFO] Maven Surefire Integration Tests ................... SUCCESS [02:04 min]
[2019-07-21T23:12:19.646Z] [INFO] ------------------------------------------------------------------------
[2019-07-21T23:12:19.646Z] [INFO] BUILD SUCCESS
[2019-07-21T23:12:19.647Z] [INFO] ------------------------------------------------------------------------
[2019-07-21T23:12:19.647Z] [INFO] Total time:  12:09 min
[2019-07-21T23:12:19.647Z] [INFO] Finished at: 2019-07-21T16:12:19-07:00
[2019-07-21T23:12:19.647Z] [INFO] ------------------------------------------------------------------------
[Pipeline] }
[Pipeline] // withEnv
[Pipeline] }
[Pipeline] // stage
[Pipeline] fileExists
[Pipeline] zip
[2019-07-21T23:12:19.826Z] Writing zip file of C:\Users\jenkins\AppData\Local\Temp\2\jenkins-maven-box-maven-surefire-SUREFIRE-1675-20\maven-failsafe-plugin\target\it to C:\Users\jenkins\AppData\Local\Temp\2\jenkins-maven-box-maven-surefire-SUREFIRE-1675-20\maven-failsafe-plugin--windows-jdk13-maven3.6.x.zip
[2019-07-21T23:12:19.965Z] Zipped 79 entries.
[2019-07-21T23:12:19.965Z] Archiving C:\Users\jenkins\AppData\Local\Temp\2\jenkins-maven-box-maven-surefire-SUREFIRE-1675-20\maven-failsafe-plugin--windows-jdk13-maven3.6.x.zip
[2019-07-21T23:12:19.966Z] [Fast Archiver] No artifacts from Maven TLP » maven-surefire » SUREFIRE-1675 #19 to compare, so performing full copy of artifacts
[Pipeline] fileExists
[Pipeline] zip
[2019-07-21T23:12:20.042Z] Writing zip file of C:\Users\jenkins\AppData\Local\Temp\2\jenkins-maven-box-maven-surefire-SUREFIRE-1675-20\surefire-its\target to C:\Users\jenkins\AppData\Local\Temp\2\jenkins-maven-box-maven-surefire-SUREFIRE-1675-20\surefire-its--windows-jdk13-maven3.6.x.zip
[2019-07-21T23:12:21.800Z] Zipped 2121 entries.
[2019-07-21T23:12:21.800Z] Archiving C:\Users\jenkins\AppData\Local\Temp\2\jenkins-maven-box-maven-surefire-SUREFIRE-1675-20\surefire-its--windows-jdk13-maven3.6.x.zip
[2019-07-21T23:12:21.801Z] [Fast Archiver] No artifacts from Maven TLP » maven-surefire » SUREFIRE-1675 #19 to compare, so performing full copy of artifacts
[Pipeline] archiveArtifacts
[2019-07-21T23:12:22.128Z] Archiving artifacts
[2019-07-21T23:12:22.147Z] [Fast Archiver] No artifacts from Maven TLP » maven-surefire » SUREFIRE-1675 #19 to compare, so performing full copy of artifacts
[Pipeline] cleanWs
[2019-07-21T23:12:22.461Z] [WS-CLEANUP] Deleting project workspace...
[2019-07-21T23:12:22.461Z] [WS-CLEANUP] Deferred wipeout is used...
[2019-07-21T23:12:22.517Z] [WS-CLEANUP] done
[Pipeline] }
[Pipeline] // ws
[Pipeline] }
[Pipeline] // timestamps
[Pipeline] }
[Pipeline] // node
[Pipeline] }
[Pipeline] // parallel
[Pipeline] echo
hudson.AbortException: hudson.AbortException: No tool named OpenJDK 7 (on Ubuntu only) found
[Pipeline] echo
Build result: FAILURE
[Pipeline] jiraIssueSelector
[Pipeline] emailext

Build succeeded in Jenkins: Maven TLP » maven-surefire » SUREFIRE-1675 #24

Posted by Apache Jenkins Server <je...@builds.apache.org>.
See https://builds.apache.org/job/maven-box/job/maven-surefire/job/SUREFIRE-1675/24/

No changes.

All tests passed

Build failed in Jenkins: Maven TLP » maven-surefire » SUREFIRE-1675 #23

Posted by Apache Jenkins Server <je...@builds.apache.org>.
See https://builds.apache.org/job/maven-box/job/maven-surefire/job/SUREFIRE-1675/23/

No changes.

No tests ran.

Build log:
[...truncated 5489 lines...]
[2019-07-22T00:01:17.625Z] [INFO] 
[2019-07-22T00:01:17.625Z] [INFO] --- maven-clean-plugin:3.1.0:clean (default-clean) @ surefire-its ---
[2019-07-22T00:01:17.625Z] [INFO] 
[2019-07-22T00:01:17.625Z] [INFO] --- maven-enforcer-plugin:3.0.0-M2:enforce (enforce-maven-version) @ surefire-its ---
[2019-07-22T00:01:17.625Z] [INFO] 
[2019-07-22T00:01:17.625Z] [INFO] --- maven-enforcer-plugin:3.0.0-M2:enforce (enforce-bytecode-version) @ surefire-its ---
[2019-07-22T00:01:18.623Z] [INFO] 
[2019-07-22T00:01:18.623Z] [INFO] --- maven-enforcer-plugin:3.0.0-M2:enforce (ban-known-bad-maven-versions) @ surefire-its ---
[2019-07-22T00:01:18.623Z] [INFO] 
[2019-07-22T00:01:18.623Z] [INFO] --- maven-enforcer-plugin:3.0.0-M2:enforce (enforce-java) @ surefire-its ---
[2019-07-22T00:01:18.623Z] [INFO] 
[2019-07-22T00:01:18.623Z] [INFO] --- maven-enforcer-plugin:3.0.0-M2:enforce (enforce-maven) @ surefire-its ---
[2019-07-22T00:01:18.623Z] [INFO] 
[2019-07-22T00:01:18.623Z] [INFO] --- apache-rat-plugin:0.12:check (rat-check) @ surefire-its ---
[2019-07-22T00:01:18.623Z] [INFO] Enabled default license matchers.
[2019-07-22T00:01:18.623Z] [INFO] Will parse SCM ignores for exclusions...
[2019-07-22T00:01:18.623Z] [INFO] Finished adding exclusions from SCM ignore files.
[2019-07-22T00:01:18.623Z] [INFO] 61 implicit excludes (use -debug for more details).
[2019-07-22T00:01:18.623Z] [INFO] Exclude: .repository/**
[2019-07-22T00:01:18.623Z] [INFO] Exclude: .maven/spy.log
[2019-07-22T00:01:18.623Z] [INFO] Exclude: dependency-reduced-pom.xml
[2019-07-22T00:01:18.623Z] [INFO] Exclude: .java-version
[2019-07-22T00:01:18.623Z] [INFO] Exclude: Jenkinsfile
[2019-07-22T00:01:18.623Z] [INFO] Exclude: README.md
[2019-07-22T00:01:18.623Z] [INFO] Exclude: .gitignore
[2019-07-22T00:01:18.623Z] [INFO] Exclude: .git/**/*
[2019-07-22T00:01:18.623Z] [INFO] Exclude: **/.idea
[2019-07-22T00:01:18.623Z] [INFO] Exclude: **/.svn/**/*
[2019-07-22T00:01:18.623Z] [INFO] Exclude: **/*.iml
[2019-07-22T00:01:18.623Z] [INFO] Exclude: **/*.ipr
[2019-07-22T00:01:18.623Z] [INFO] Exclude: **/*.iws
[2019-07-22T00:01:18.623Z] [INFO] Exclude: **/*.versionsBackup
[2019-07-22T00:01:18.624Z] [INFO] Exclude: **/dependency-reduced-pom.xml
[2019-07-22T00:01:18.624Z] [INFO] Exclude: .repository/**
[2019-07-22T00:01:18.624Z] [INFO] Exclude: src/test/resources/**/*
[2019-07-22T00:01:18.624Z] [INFO] Exclude: src/test/resources/**/*.css
[2019-07-22T00:01:18.624Z] [INFO] Exclude: **/*.jj
[2019-07-22T00:01:18.624Z] [INFO] Exclude: src/main/resources/META-INF/services/org.apache.maven.surefire.providerapi.SurefireProvider
[2019-07-22T00:01:18.624Z] [INFO] Exclude: DEPENDENCIES
[2019-07-22T00:01:18.624Z] [INFO] Exclude: .m2/**
[2019-07-22T00:01:18.624Z] [INFO] Exclude: .m2
[2019-07-22T00:01:18.624Z] [INFO] Exclude: .travis.yml
[2019-07-22T00:01:18.624Z] [INFO] 209 resources included (use -debug for more details)
[2019-07-22T00:01:20.072Z] [INFO] Rat check: Summary over all files. Unapproved: 0, unknown: 0, generated: 0, approved: 209 licenses.
[2019-07-22T00:01:20.072Z] [INFO] 
[2019-07-22T00:01:20.072Z] [INFO] --- jacoco-maven-plugin:0.8.4:prepare-agent (jacoco-agent) @ surefire-its ---
[2019-07-22T00:01:20.072Z] [INFO] Skipping JaCoCo execution because property jacoco.skip is set.
[2019-07-22T00:01:20.072Z] [INFO] argLine set to empty
[2019-07-22T00:01:20.072Z] [INFO] 
[2019-07-22T00:01:20.072Z] [INFO] --- maven-compiler-plugin:3.7.0:compile (compile-generated) @ surefire-its ---
[2019-07-22T00:01:20.072Z] [INFO] No sources to compile
[2019-07-22T00:01:20.072Z] [INFO] 
[2019-07-22T00:01:20.072Z] [INFO] --- maven-remote-resources-plugin:1.5:process (process-resource-bundles) @ surefire-its ---
[2019-07-22T00:01:20.072Z] [INFO] 
[2019-07-22T00:01:20.072Z] [INFO] --- maven-resources-plugin:3.1.0:resources (default-resources) @ surefire-its ---
[2019-07-22T00:01:20.072Z] [INFO] Using 'UTF-8' encoding to copy filtered resources.
[2019-07-22T00:01:20.382Z] [INFO] Copying 830 resources to C:\Users\jenkins\AppData\Local\Temp\2\jenkins-maven-box-maven-surefire-SUREFIRE-1675-23\surefire-its\target\classes
[2019-07-22T00:01:35.390Z] [INFO] Copying 1 resource to C:\Users\jenkins\AppData\Local\Temp\2\jenkins-maven-box-maven-surefire-SUREFIRE-1675-23\surefire-its\target/private
[2019-07-22T00:01:35.390Z] [INFO] Copying 3 resources
[2019-07-22T00:01:35.390Z] [INFO] 
[2019-07-22T00:01:35.390Z] [INFO] --- maven-compiler-plugin:3.7.0:compile (default-compile) @ surefire-its ---
[2019-07-22T00:01:35.390Z] [INFO] No sources to compile
[2019-07-22T00:01:35.390Z] [INFO] 
[2019-07-22T00:01:35.390Z] [INFO] --- animal-sniffer-maven-plugin:1.17:check (signature-check) @ surefire-its ---
[2019-07-22T00:01:35.390Z] [INFO] Checking unresolved references to org.codehaus.mojo.signature:java17:1.0
[2019-07-22T00:01:35.390Z] [INFO] 
[2019-07-22T00:01:35.390Z] [INFO] --- maven-help-plugin:3.1.0:effective-settings (settings.xml) @ surefire-its ---
[2019-07-22T00:01:35.390Z] [INFO] Downloading from central: https://repo.maven.apache.org/maven2/org/apache/maven/plugin-tools/maven-plugin-tools-generators/3.5.1/maven-plugin-tools-generators-3.5.1.pom
[2019-07-22T00:01:35.390Z] [INFO] Downloaded from central: https://repo.maven.apache.org/maven2/org/apache/maven/plugin-tools/maven-plugin-tools-generators/3.5.1/maven-plugin-tools-generators-3.5.1.pom (4.2 kB at 144 kB/s)
[2019-07-22T00:01:35.390Z] [INFO] Downloading from central: https://repo.maven.apache.org/maven2/org/apache/maven/plugin-tools/maven-plugin-tools/3.5.1/maven-plugin-tools-3.5.1.pom
[2019-07-22T00:01:35.390Z] [INFO] Downloaded from central: https://repo.maven.apache.org/maven2/org/apache/maven/plugin-tools/maven-plugin-tools/3.5.1/maven-plugin-tools-3.5.1.pom (16 kB at 390 kB/s)
[2019-07-22T00:01:35.391Z] [INFO] Downloading from central: https://repo.maven.apache.org/maven2/org/apache/maven/plugin-tools/maven-plugin-tools-api/3.5.1/maven-plugin-tools-api-3.5.1.pom
[2019-07-22T00:01:35.391Z] [INFO] Downloaded from central: https://repo.maven.apache.org/maven2/org/apache/maven/plugin-tools/maven-plugin-tools-api/3.5.1/maven-plugin-tools-api-3.5.1.pom (2.9 kB at 75 kB/s)
[2019-07-22T00:01:35.391Z] [INFO] Downloading from central: https://repo.maven.apache.org/maven2/org/codehaus/plexus/plexus-interactivity-api/1.0-alpha-6/plexus-interactivity-api-1.0-alpha-6.pom
[2019-07-22T00:01:35.391Z] [INFO] Downloaded from central: https://repo.maven.apache.org/maven2/org/codehaus/plexus/plexus-interactivity-api/1.0-alpha-6/plexus-interactivity-api-1.0-alpha-6.pom (726 B at 19 kB/s)
[2019-07-22T00:01:35.391Z] [INFO] Downloading from central: https://repo.maven.apache.org/maven2/org/codehaus/plexus/plexus-interactivity/1.0-alpha-6/plexus-interactivity-1.0-alpha-6.pom
[2019-07-22T00:01:35.391Z] [INFO] Downloaded from central: https://repo.maven.apache.org/maven2/org/codehaus/plexus/plexus-interactivity/1.0-alpha-6/plexus-interactivity-1.0-alpha-6.pom (1.1 kB at 29 kB/s)
[2019-07-22T00:01:35.391Z] [INFO] Downloading from central: https://repo.maven.apache.org/maven2/org/codehaus/plexus/plexus-components/1.1.9/plexus-components-1.1.9.pom
[2019-07-22T00:01:35.391Z] [INFO] Downloaded from central: https://repo.maven.apache.org/maven2/org/codehaus/plexus/plexus-components/1.1.9/plexus-components-1.1.9.pom (2.4 kB at 66 kB/s)
[2019-07-22T00:01:35.391Z] [INFO] Downloading from central: https://repo.maven.apache.org/maven2/org/codehaus/plexus/plexus-utils/1.4/plexus-utils-1.4.pom
[2019-07-22T00:01:35.391Z] [INFO] Downloaded from central: https://repo.maven.apache.org/maven2/org/codehaus/plexus/plexus-utils/1.4/plexus-utils-1.4.pom (1.2 kB at 32 kB/s)
[2019-07-22T00:01:35.391Z] [INFO] Downloading from central: https://repo.maven.apache.org/maven2/com/thoughtworks/xstream/xstream/1.4.10/xstream-1.4.10.pom
[2019-07-22T00:01:35.391Z] [INFO] Downloaded from central: https://repo.maven.apache.org/maven2/com/thoughtworks/xstream/xstream/1.4.10/xstream-1.4.10.pom (15 kB at 369 kB/s)
[2019-07-22T00:01:35.391Z] [INFO] Downloading from central: https://repo.maven.apache.org/maven2/com/thoughtworks/xstream/xstream-parent/1.4.10/xstream-parent-1.4.10.pom
[2019-07-22T00:01:35.391Z] [INFO] Downloaded from central: https://repo.maven.apache.org/maven2/com/thoughtworks/xstream/xstream-parent/1.4.10/xstream-parent-1.4.10.pom (35 kB at 772 kB/s)
[2019-07-22T00:01:35.391Z] [INFO] Downloading from central: https://repo.maven.apache.org/maven2/xmlpull/xmlpull/1.1.3.1/xmlpull-1.1.3.1.pom
[2019-07-22T00:01:35.391Z] [INFO] Downloaded from central: https://repo.maven.apache.org/maven2/xmlpull/xmlpull/1.1.3.1/xmlpull-1.1.3.1.pom (386 B at 10 kB/s)
[2019-07-22T00:01:35.391Z] [INFO] Downloading from central: https://repo.maven.apache.org/maven2/xpp3/xpp3_min/1.1.4c/xpp3_min-1.1.4c.pom
[2019-07-22T00:01:35.391Z] [INFO] Downloaded from central: https://repo.maven.apache.org/maven2/xpp3/xpp3_min/1.1.4c/xpp3_min-1.1.4c.pom (1.6 kB at 44 kB/s)
[2019-07-22T00:01:35.391Z] [INFO] Downloading from central: https://repo.maven.apache.org/maven2/org/apache/maven/plugin-tools/maven-plugin-tools-generators/3.5.1/maven-plugin-tools-generators-3.5.1.jar
[2019-07-22T00:01:35.391Z] [INFO] Downloading from central: https://repo.maven.apache.org/maven2/org/codehaus/plexus/plexus-interactivity-api/1.0-alpha-6/plexus-interactivity-api-1.0-alpha-6.jar
[2019-07-22T00:01:35.391Z] [INFO] Downloading from central: https://repo.maven.apache.org/maven2/org/apache/maven/shared/maven-shared-utils/0.3/maven-shared-utils-0.3.jar
[2019-07-22T00:01:35.391Z] [INFO] Downloading from central: https://repo.maven.apache.org/maven2/commons-collections/commons-collections/3.1/commons-collections-3.1.jar
[2019-07-22T00:01:35.391Z] [INFO] Downloading from central: https://repo.maven.apache.org/maven2/org/apache/maven/plugin-tools/maven-plugin-tools-api/3.5.1/maven-plugin-tools-api-3.5.1.jar
[2019-07-22T00:01:35.391Z] [INFO] Downloaded from central: https://repo.maven.apache.org/maven2/org/apache/maven/plugin-tools/maven-plugin-tools-generators/3.5.1/maven-plugin-tools-generators-3.5.1.jar (48 kB at 1.3 MB/s)
[2019-07-22T00:01:35.391Z] [INFO] Downloading from central: https://repo.maven.apache.org/maven2/com/thoughtworks/xstream/xstream/1.4.10/xstream-1.4.10.jar
[2019-07-22T00:01:35.391Z] [INFO] Downloaded from central: https://repo.maven.apache.org/maven2/commons-collections/commons-collections/3.1/commons-collections-3.1.jar (559 kB at 3.0 MB/s)
[2019-07-22T00:01:35.391Z] [INFO] Downloading from central: https://repo.maven.apache.org/maven2/xmlpull/xmlpull/1.1.3.1/xmlpull-1.1.3.1.jar
[2019-07-22T00:01:35.391Z] [INFO] Downloaded from central: https://repo.maven.apache.org/maven2/org/codehaus/plexus/plexus-interactivity-api/1.0-alpha-6/plexus-interactivity-api-1.0-alpha-6.jar (12 kB at 61 kB/s)
[2019-07-22T00:01:35.391Z] [INFO] Downloading from central: https://repo.maven.apache.org/maven2/xpp3/xpp3_min/1.1.4c/xpp3_min-1.1.4c.jar
[2019-07-22T00:01:35.391Z] [INFO] Downloaded from central: https://repo.maven.apache.org/maven2/com/thoughtworks/xstream/xstream/1.4.10/xstream-1.4.10.jar (590 kB at 2.9 MB/s)
[2019-07-22T00:01:35.391Z] [INFO] Downloaded from central: https://repo.maven.apache.org/maven2/xpp3/xpp3_min/1.1.4c/xpp3_min-1.1.4c.jar (25 kB at 111 kB/s)
[2019-07-22T00:01:35.391Z] [INFO] Downloaded from central: https://repo.maven.apache.org/maven2/org/apache/maven/plugin-tools/maven-plugin-tools-api/3.5.1/maven-plugin-tools-api-3.5.1.jar (24 kB at 101 kB/s)
[2019-07-22T00:01:35.391Z] [INFO] Downloaded from central: https://repo.maven.apache.org/maven2/xmlpull/xmlpull/1.1.3.1/xmlpull-1.1.3.1.jar (7.2 kB at 25 kB/s)
[2019-07-22T00:01:35.391Z] [INFO] Downloaded from central: https://repo.maven.apache.org/maven2/org/apache/maven/shared/maven-shared-utils/0.3/maven-shared-utils-0.3.jar (155 kB at 375 kB/s)
[2019-07-22T00:01:35.670Z] [INFO] Effective-settings written to: C:\Users\jenkins\AppData\Local\Temp\2\jenkins-maven-box-maven-surefire-SUREFIRE-1675-23\surefire-its\target\private\settings.xml
[2019-07-22T00:01:35.670Z] [INFO] 
[2019-07-22T00:01:35.670Z] [INFO] --- maven-resources-plugin:3.1.0:testResources (default-testResources) @ surefire-its ---
[2019-07-22T00:01:35.670Z] [INFO] Using 'UTF-8' encoding to copy filtered resources.
[2019-07-22T00:01:35.948Z] [INFO] Copying 831 resources
[2019-07-22T00:01:46.042Z] [INFO] Copying 3 resources
[2019-07-22T00:01:46.042Z] [INFO] 
[2019-07-22T00:01:46.042Z] [INFO] --- maven-compiler-plugin:3.7.0:testCompile (default-testCompile) @ surefire-its ---
[2019-07-22T00:01:46.042Z] [INFO] Changes detected - recompiling the module!
[2019-07-22T00:01:46.042Z] [INFO] Compiling 208 source files to C:\Users\jenkins\AppData\Local\Temp\2\jenkins-maven-box-maven-surefire-SUREFIRE-1675-23\surefire-its\target\test-classes
[2019-07-22T00:01:51.397Z] [INFO] 
[2019-07-22T00:01:51.397Z] [INFO] --- maven-surefire-plugin:3.0.0-M3:test (default-test) @ surefire-its ---
[2019-07-22T00:01:51.676Z] [INFO] Surefire report directory: C:\Users\jenkins\AppData\Local\Temp\2\jenkins-maven-box-maven-surefire-SUREFIRE-1675-23\surefire-its\target\surefire-reports
[2019-07-22T00:01:51.676Z] [INFO] Using configured provider org.apache.maven.shadefire.surefire.junit.JUnit3Provider
[2019-07-22T00:01:51.676Z] [INFO] parallel='none', perCoreThreadCount=true, threadCount=0, useUnlimitedThreads=false, threadCountSuites=0, threadCountClasses=0, threadCountMethods=0, parallelOptimized=true
[2019-07-22T00:01:51.676Z] [INFO] 
[2019-07-22T00:01:51.676Z] [INFO] -------------------------------------------------------
[2019-07-22T00:01:51.676Z] [INFO]  T E S T S
[2019-07-22T00:01:51.676Z] [INFO] -------------------------------------------------------
[2019-07-22T00:01:52.271Z] [INFO] Running org.apache.maven.surefire.its.fixture.JUnit4SuiteTest
[2019-07-22T00:01:52.271Z] [WARNING] System property already exists '-DskipTests'. Overriding to '-DskipTests'.
[2019-07-22T00:01:52.271Z] [WARNING] System property already exists '-Dx=a'. Overriding to '-Dx=b'.
[2019-07-22T00:01:52.271Z] Using JAVA_HOME=F:\jenkins\tools\java\latest1.7 in forked launcher.
[2019-07-22T00:01:52.271Z] [INFO] Tests run: 2, Failures: 0, Errors: 0, Skipped: 0, Time elapsed: 0.089 s - in org.apache.maven.surefire.its.fixture.JUnit4SuiteTest
[2019-07-22T00:01:52.548Z] [INFO] 
[2019-07-22T00:01:52.548Z] [INFO] Results:
[2019-07-22T00:01:52.548Z] [INFO] 
[2019-07-22T00:01:52.548Z] [INFO] Tests run: 2, Failures: 0, Errors: 0, Skipped: 0
[2019-07-22T00:01:52.548Z] [INFO] 
[2019-07-22T00:01:52.548Z] [INFO] 
[2019-07-22T00:01:52.548Z] [INFO] --- maven-jar-plugin:3.1.0:jar (default-jar) @ surefire-its ---
[2019-07-22T00:01:53.514Z] [INFO] Building jar: C:\Users\jenkins\AppData\Local\Temp\2\jenkins-maven-box-maven-surefire-SUREFIRE-1675-23\surefire-its\target\surefire-its-3.0.0-SNAPSHOT.jar
[2019-07-22T00:01:54.937Z] [INFO] 
[2019-07-22T00:01:54.938Z] [INFO] --- maven-site-plugin:3.7.1:attach-descriptor (attach-descriptor) @ surefire-its ---
[2019-07-22T00:01:54.938Z] [INFO] Skipping because packaging 'jar' is not pom.
[2019-07-22T00:01:54.938Z] [INFO] 
[2019-07-22T00:01:54.938Z] [INFO] --- jacoco-maven-plugin:0.8.4:prepare-agent-integration (jacoco-agent-it) @ surefire-its ---
[2019-07-22T00:01:54.938Z] [INFO] Skipping JaCoCo execution because property jacoco.skip is set.
[2019-07-22T00:01:54.938Z] [INFO] jacoco-it.agent set to empty
[2019-07-22T00:01:54.938Z] [INFO] 
[2019-07-22T00:01:54.938Z] [INFO] --- maven-failsafe-plugin:3.0.0-M3:integration-test (default) @ surefire-its ---
[2019-07-22T00:01:54.938Z] [INFO] Downloading from central: https://repo.maven.apache.org/maven2/org/apache/maven/surefire/surefire-junit47/3.0.0-M3/surefire-junit47-3.0.0-M3.pom
[2019-07-22T00:01:54.938Z] [INFO] Downloaded from central: https://repo.maven.apache.org/maven2/org/apache/maven/surefire/surefire-junit47/3.0.0-M3/surefire-junit47-3.0.0-M3.pom (7.3 kB at 178 kB/s)
[2019-07-22T00:01:54.938Z] [INFO] Downloading from central: https://repo.maven.apache.org/maven2/org/apache/maven/surefire/surefire-providers/3.0.0-M3/surefire-providers-3.0.0-M3.pom
[2019-07-22T00:01:54.938Z] [INFO] Downloaded from central: https://repo.maven.apache.org/maven2/org/apache/maven/surefire/surefire-providers/3.0.0-M3/surefire-providers-3.0.0-M3.pom (2.5 kB at 69 kB/s)
[2019-07-22T00:01:54.938Z] [INFO] Downloading from central: https://repo.maven.apache.org/maven2/org/apache/maven/surefire/common-junit48/3.0.0-M3/common-junit48-3.0.0-M3.pom
[2019-07-22T00:01:54.938Z] [INFO] Downloaded from central: https://repo.maven.apache.org/maven2/org/apache/maven/surefire/common-junit48/3.0.0-M3/common-junit48-3.0.0-M3.pom (2.4 kB at 61 kB/s)
[2019-07-22T00:01:54.938Z] [INFO] Downloading from central: https://repo.maven.apache.org/maven2/org/apache/maven/surefire/common-junit4/3.0.0-M3/common-junit4-3.0.0-M3.pom
[2019-07-22T00:01:54.938Z] [INFO] Downloaded from central: https://repo.maven.apache.org/maven2/org/apache/maven/surefire/common-junit4/3.0.0-M3/common-junit4-3.0.0-M3.pom (1.9 kB at 49 kB/s)
[2019-07-22T00:01:54.938Z] [INFO] Downloading from central: https://repo.maven.apache.org/maven2/org/apache/maven/surefire/common-junit3/3.0.0-M3/common-junit3-3.0.0-M3.pom
[2019-07-22T00:01:54.938Z] [INFO] Downloaded from central: https://repo.maven.apache.org/maven2/org/apache/maven/surefire/common-junit3/3.0.0-M3/common-junit3-3.0.0-M3.pom (1.6 kB at 40 kB/s)
[2019-07-22T00:01:55.216Z] [INFO] Downloading from central: https://repo.maven.apache.org/maven2/org/apache/maven/surefire/common-java5/3.0.0-M3/common-java5-3.0.0-M3.pom
[2019-07-22T00:01:55.216Z] [INFO] Downloaded from central: https://repo.maven.apache.org/maven2/org/apache/maven/surefire/common-java5/3.0.0-M3/common-java5-3.0.0-M3.pom (3.1 kB at 81 kB/s)
[2019-07-22T00:01:55.216Z] [INFO] Downloading from central: https://repo.maven.apache.org/maven2/org/apache/maven/surefire/surefire-grouper/3.0.0-M3/surefire-grouper-3.0.0-M3.pom
[2019-07-22T00:01:55.216Z] [INFO] Downloaded from central: https://repo.maven.apache.org/maven2/org/apache/maven/surefire/surefire-grouper/3.0.0-M3/surefire-grouper-3.0.0-M3.pom (2.6 kB at 68 kB/s)
[2019-07-22T00:01:55.216Z] [INFO] Downloading from central: https://repo.maven.apache.org/maven2/org/apache/maven/surefire/surefire-junit47/3.0.0-M3/surefire-junit47-3.0.0-M3.jar
[2019-07-22T00:01:55.216Z] [INFO] Downloading from central: https://repo.maven.apache.org/maven2/org/apache/maven/surefire/common-java5/3.0.0-M3/common-java5-3.0.0-M3.jar
[2019-07-22T00:01:55.216Z] [INFO] Downloading from central: https://repo.maven.apache.org/maven2/org/apache/maven/surefire/common-junit3/3.0.0-M3/common-junit3-3.0.0-M3.jar
[2019-07-22T00:01:55.216Z] [INFO] Downloading from central: https://repo.maven.apache.org/maven2/org/apache/maven/surefire/common-junit4/3.0.0-M3/common-junit4-3.0.0-M3.jar
[2019-07-22T00:01:55.216Z] [INFO] Downloading from central: https://repo.maven.apache.org/maven2/org/apache/maven/surefire/common-junit48/3.0.0-M3/common-junit48-3.0.0-M3.jar
[2019-07-22T00:01:55.216Z] [INFO] Downloaded from central: https://repo.maven.apache.org/maven2/org/apache/maven/surefire/common-junit4/3.0.0-M3/common-junit4-3.0.0-M3.jar (28 kB at 744 kB/s)
[2019-07-22T00:01:55.216Z] [INFO] Downloading from central: https://repo.maven.apache.org/maven2/org/apache/maven/surefire/surefire-grouper/3.0.0-M3/surefire-grouper-3.0.0-M3.jar
[2019-07-22T00:01:55.216Z] [INFO] Downloaded from central: https://repo.maven.apache.org/maven2/org/apache/maven/surefire/common-junit3/3.0.0-M3/common-junit3-3.0.0-M3.jar (12 kB at 306 kB/s)
[2019-07-22T00:01:55.216Z] [INFO] Downloaded from central: https://repo.maven.apache.org/maven2/org/apache/maven/surefire/common-java5/3.0.0-M3/common-java5-3.0.0-M3.jar (32 kB at 847 kB/s)
[2019-07-22T00:01:55.495Z] [INFO] Downloaded from central: https://repo.maven.apache.org/maven2/org/apache/maven/surefire/common-junit48/3.0.0-M3/common-junit48-3.0.0-M3.jar (22 kB at 104 kB/s)
[2019-07-22T00:01:55.495Z] [INFO] Downloaded from central: https://repo.maven.apache.org/maven2/org/apache/maven/surefire/surefire-junit47/3.0.0-M3/surefire-junit47-3.0.0-M3.jar (93 kB at 393 kB/s)
[2019-07-22T00:01:55.495Z] [INFO] Downloaded from central: https://repo.maven.apache.org/maven2/org/apache/maven/surefire/surefire-grouper/3.0.0-M3/surefire-grouper-3.0.0-M3.jar (40 kB at 122 kB/s)
[2019-07-22T00:01:56.085Z] [INFO] Failsafe report directory: C:\Users\jenkins\AppData\Local\Temp\2\jenkins-maven-box-maven-surefire-SUREFIRE-1675-23\surefire-its\target\failsafe-reports
[2019-07-22T00:01:56.085Z] [INFO] Using configured provider org.apache.maven.surefire.junitcore.JUnitCoreProvider
[2019-07-22T00:01:56.085Z] [INFO] parallel='none', perCoreThreadCount=false, threadCount=1, useUnlimitedThreads=false, threadCountSuites=0, threadCountClasses=0, threadCountMethods=0, parallelOptimized=true
[2019-07-22T00:01:56.361Z] [INFO] 
[2019-07-22T00:01:56.361Z] [INFO] -------------------------------------------------------
[2019-07-22T00:01:56.361Z] [INFO]  T E S T S
[2019-07-22T00:01:56.361Z] [INFO] -------------------------------------------------------
[2019-07-22T00:02:18.439Z] [INFO] Running org.apache.maven.surefire.its.jiras.Surefire946KillMainProcessInReusableForkIT
[2019-07-22T00:03:05.285Z] [INFO] Tests run: 6, Failures: 0, Errors: 0, Skipped: 0, Time elapsed: 44.074 s - in org.apache.maven.surefire.its.jiras.Surefire946KillMainProcessInReusableForkIT
[2019-07-22T00:03:05.285Z] [INFO] 
[2019-07-22T00:03:05.285Z] [INFO] Results:
[2019-07-22T00:03:05.285Z] [INFO] 
[2019-07-22T00:03:05.285Z] [INFO] Tests run: 6, Failures: 0, Errors: 0, Skipped: 0
[2019-07-22T00:03:05.285Z] [INFO] 
[2019-07-22T00:03:05.285Z] [INFO] 
[2019-07-22T00:03:05.285Z] [INFO] --- maven-checkstyle-plugin:3.0.0:check (checkstyle-check) @ surefire-its ---
[2019-07-22T00:03:05.285Z] [INFO] 
[2019-07-22T00:03:05.285Z] [INFO] --- maven-failsafe-plugin:3.0.0-M3:verify (default) @ surefire-its ---
[2019-07-22T00:03:05.285Z] [INFO] Failsafe report directory: C:\Users\jenkins\AppData\Local\Temp\2\jenkins-maven-box-maven-surefire-SUREFIRE-1675-23\surefire-its\target\failsafe-reports
[2019-07-22T00:03:05.285Z] [INFO] 
[2019-07-22T00:03:05.285Z] [INFO] --- maven-install-plugin:2.5.2:install (default-install) @ surefire-its ---
[2019-07-22T00:03:05.285Z] [INFO] Skipping artifact installation
[2019-07-22T00:03:05.285Z] [INFO] ------------------------------------------------------------------------
[2019-07-22T00:03:05.285Z] [INFO] Reactor Summary for Apache Maven Surefire 3.0.0-SNAPSHOT:
[2019-07-22T00:03:05.285Z] [INFO] 
[2019-07-22T00:03:05.285Z] [INFO] Apache Maven Surefire .............................. SUCCESS [ 58.657 s]
[2019-07-22T00:03:05.285Z] [INFO] SureFire Logger API ................................ SUCCESS [ 22.709 s]
[2019-07-22T00:03:05.285Z] [INFO] SureFire API ....................................... SUCCESS [ 15.247 s]
[2019-07-22T00:03:05.285Z] [INFO] Surefire Extensions API ............................ SUCCESS [  3.254 s]
[2019-07-22T00:03:05.285Z] [INFO] SureFire Booter .................................... SUCCESS [ 15.687 s]
[2019-07-22T00:03:05.285Z] [INFO] Maven Surefire Test-Grouping Support ............... SUCCESS [ 10.586 s]
[2019-07-22T00:03:05.285Z] [INFO] SureFire Providers ................................. SUCCESS [  0.605 s]
[2019-07-22T00:03:05.285Z] [INFO] Shared JUnit3 Provider Code ........................ SUCCESS [  4.384 s]
[2019-07-22T00:03:05.285Z] [INFO] Shared Java 5 Provider Base ........................ SUCCESS [  6.324 s]
[2019-07-22T00:03:05.285Z] [INFO] Shared JUnit4 Provider Code ........................ SUCCESS [  6.497 s]
[2019-07-22T00:03:05.285Z] [INFO] Shared JUnit48 Provider Code ....................... SUCCESS [  7.174 s]
[2019-07-22T00:03:05.285Z] [INFO] SureFire JUnit Runner .............................. SUCCESS [  5.610 s]
[2019-07-22T00:03:05.285Z] [INFO] SureFire JUnit4 Runner ............................. SUCCESS [ 35.814 s]
[2019-07-22T00:03:05.285Z] [INFO] Maven Surefire Common .............................. SUCCESS [ 37.985 s]
[2019-07-22T00:03:05.285Z] [INFO] SureFire JUnitCore Runner .......................... SUCCESS [02:24 min]
[2019-07-22T00:03:05.285Z] [INFO] SureFire JUnit Platform Runner ..................... SUCCESS [ 11.124 s]
[2019-07-22T00:03:05.285Z] [INFO] SureFire TestNG Utils .............................. SUCCESS [  5.577 s]
[2019-07-22T00:03:05.285Z] [INFO] SureFire TestNG Runner ............................. SUCCESS [  6.579 s]
[2019-07-22T00:03:05.285Z] [INFO] ShadeFire JUnit3 Provider .......................... SUCCESS [  2.506 s]
[2019-07-22T00:03:05.285Z] [INFO] Surefire Report Parser ............................. SUCCESS [  8.673 s]
[2019-07-22T00:03:05.285Z] [INFO] Maven Surefire Plugin .............................. SUCCESS [ 15.870 s]
[2019-07-22T00:03:05.285Z] [INFO] Maven Failsafe Plugin .............................. SUCCESS [01:47 min]
[2019-07-22T00:03:05.285Z] [INFO] Maven Surefire Report Plugin ....................... SUCCESS [ 20.299 s]
[2019-07-22T00:03:05.285Z] [INFO] Maven Surefire Integration Tests ................... SUCCESS [01:48 min]
[2019-07-22T00:03:05.285Z] [INFO] ------------------------------------------------------------------------
[2019-07-22T00:03:05.285Z] [INFO] BUILD SUCCESS
[2019-07-22T00:03:05.285Z] [INFO] ------------------------------------------------------------------------
[2019-07-22T00:03:05.285Z] [INFO] Total time:  11:02 min
[2019-07-22T00:03:05.285Z] [INFO] Finished at: 2019-07-21T17:03:00-07:00
[2019-07-22T00:03:05.285Z] [INFO] ------------------------------------------------------------------------
[Pipeline] }
[Pipeline] // withEnv
[Pipeline] }
[Pipeline] // stage
[Pipeline] cleanWs
[2019-07-22T00:03:05.397Z] [WS-CLEANUP] Deleting project workspace...
[2019-07-22T00:03:05.397Z] [WS-CLEANUP] Deferred wipeout is used...
[2019-07-22T00:03:05.452Z] [WS-CLEANUP] done
[Pipeline] }
[Pipeline] // ws
[Pipeline] }
[Pipeline] // timestamps
[Pipeline] }
[Pipeline] // node
[Pipeline] }
[Pipeline] // parallel
[Pipeline] echo
hudson.AbortException: hudson.AbortException: script returned exit code 1
[Pipeline] echo
Build result: FAILURE
[Pipeline] jiraIssueSelector
[Pipeline] emailext

Build failed in Jenkins: Maven TLP » maven-surefire » SUREFIRE-1675 #22

Posted by Apache Jenkins Server <je...@builds.apache.org>.
See https://builds.apache.org/job/maven-box/job/maven-surefire/job/SUREFIRE-1675/22/

No changes.

No tests ran.

Build log:
[...truncated 5488 lines...]
[2019-07-21T23:45:48.334Z] [INFO] 
[2019-07-21T23:45:48.334Z] [INFO] --- maven-clean-plugin:3.1.0:clean (default-clean) @ surefire-its ---
[2019-07-21T23:45:48.334Z] [INFO] 
[2019-07-21T23:45:48.334Z] [INFO] --- maven-enforcer-plugin:3.0.0-M2:enforce (enforce-maven-version) @ surefire-its ---
[2019-07-21T23:45:48.334Z] [INFO] 
[2019-07-21T23:45:48.334Z] [INFO] --- maven-enforcer-plugin:3.0.0-M2:enforce (enforce-bytecode-version) @ surefire-its ---
[2019-07-21T23:45:49.320Z] [INFO] 
[2019-07-21T23:45:49.320Z] [INFO] --- maven-enforcer-plugin:3.0.0-M2:enforce (ban-known-bad-maven-versions) @ surefire-its ---
[2019-07-21T23:45:49.320Z] [INFO] 
[2019-07-21T23:45:49.320Z] [INFO] --- maven-enforcer-plugin:3.0.0-M2:enforce (enforce-java) @ surefire-its ---
[2019-07-21T23:45:49.320Z] [INFO] 
[2019-07-21T23:45:49.320Z] [INFO] --- maven-enforcer-plugin:3.0.0-M2:enforce (enforce-maven) @ surefire-its ---
[2019-07-21T23:45:49.320Z] [INFO] 
[2019-07-21T23:45:49.320Z] [INFO] --- apache-rat-plugin:0.12:check (rat-check) @ surefire-its ---
[2019-07-21T23:45:49.320Z] [INFO] Enabled default license matchers.
[2019-07-21T23:45:49.320Z] [INFO] Will parse SCM ignores for exclusions...
[2019-07-21T23:45:49.320Z] [INFO] Finished adding exclusions from SCM ignore files.
[2019-07-21T23:45:49.320Z] [INFO] 61 implicit excludes (use -debug for more details).
[2019-07-21T23:45:49.320Z] [INFO] Exclude: .repository/**
[2019-07-21T23:45:49.320Z] [INFO] Exclude: .maven/spy.log
[2019-07-21T23:45:49.320Z] [INFO] Exclude: dependency-reduced-pom.xml
[2019-07-21T23:45:49.320Z] [INFO] Exclude: .java-version
[2019-07-21T23:45:49.320Z] [INFO] Exclude: Jenkinsfile
[2019-07-21T23:45:49.320Z] [INFO] Exclude: README.md
[2019-07-21T23:45:49.320Z] [INFO] Exclude: .gitignore
[2019-07-21T23:45:49.320Z] [INFO] Exclude: .git/**/*
[2019-07-21T23:45:49.320Z] [INFO] Exclude: **/.idea
[2019-07-21T23:45:49.320Z] [INFO] Exclude: **/.svn/**/*
[2019-07-21T23:45:49.320Z] [INFO] Exclude: **/*.iml
[2019-07-21T23:45:49.320Z] [INFO] Exclude: **/*.ipr
[2019-07-21T23:45:49.320Z] [INFO] Exclude: **/*.iws
[2019-07-21T23:45:49.320Z] [INFO] Exclude: **/*.versionsBackup
[2019-07-21T23:45:49.320Z] [INFO] Exclude: **/dependency-reduced-pom.xml
[2019-07-21T23:45:49.320Z] [INFO] Exclude: .repository/**
[2019-07-21T23:45:49.320Z] [INFO] Exclude: src/test/resources/**/*
[2019-07-21T23:45:49.320Z] [INFO] Exclude: src/test/resources/**/*.css
[2019-07-21T23:45:49.320Z] [INFO] Exclude: **/*.jj
[2019-07-21T23:45:49.320Z] [INFO] Exclude: src/main/resources/META-INF/services/org.apache.maven.surefire.providerapi.SurefireProvider
[2019-07-21T23:45:49.320Z] [INFO] Exclude: DEPENDENCIES
[2019-07-21T23:45:49.320Z] [INFO] Exclude: .m2/**
[2019-07-21T23:45:49.320Z] [INFO] Exclude: .m2
[2019-07-21T23:45:49.320Z] [INFO] Exclude: .travis.yml
[2019-07-21T23:45:49.622Z] [INFO] 209 resources included (use -debug for more details)
[2019-07-21T23:45:51.674Z] [INFO] Rat check: Summary over all files. Unapproved: 0, unknown: 0, generated: 0, approved: 209 licenses.
[2019-07-21T23:45:51.674Z] [INFO] 
[2019-07-21T23:45:51.674Z] [INFO] --- jacoco-maven-plugin:0.8.4:prepare-agent (jacoco-agent) @ surefire-its ---
[2019-07-21T23:45:51.674Z] [INFO] Skipping JaCoCo execution because property jacoco.skip is set.
[2019-07-21T23:45:51.674Z] [INFO] argLine set to empty
[2019-07-21T23:45:51.674Z] [INFO] 
[2019-07-21T23:45:51.674Z] [INFO] --- maven-compiler-plugin:3.7.0:compile (compile-generated) @ surefire-its ---
[2019-07-21T23:45:51.674Z] [INFO] No sources to compile
[2019-07-21T23:45:51.674Z] [INFO] 
[2019-07-21T23:45:51.674Z] [INFO] --- maven-remote-resources-plugin:1.5:process (process-resource-bundles) @ surefire-its ---
[2019-07-21T23:45:51.674Z] [INFO] 
[2019-07-21T23:45:51.674Z] [INFO] --- maven-resources-plugin:3.1.0:resources (default-resources) @ surefire-its ---
[2019-07-21T23:45:51.674Z] [INFO] Using 'UTF-8' encoding to copy filtered resources.
[2019-07-21T23:45:51.993Z] [INFO] Copying 830 resources to C:\Users\jenkins\AppData\Local\Temp\2\jenkins-maven-box-maven-surefire-SUREFIRE-1675-22\surefire-its\target\classes
[2019-07-21T23:46:07.193Z] [INFO] Copying 1 resource to C:\Users\jenkins\AppData\Local\Temp\2\jenkins-maven-box-maven-surefire-SUREFIRE-1675-22\surefire-its\target/private
[2019-07-21T23:46:07.193Z] [INFO] Copying 3 resources
[2019-07-21T23:46:07.193Z] [INFO] 
[2019-07-21T23:46:07.193Z] [INFO] --- maven-compiler-plugin:3.7.0:compile (default-compile) @ surefire-its ---
[2019-07-21T23:46:07.193Z] [INFO] No sources to compile
[2019-07-21T23:46:07.193Z] [INFO] 
[2019-07-21T23:46:07.193Z] [INFO] --- animal-sniffer-maven-plugin:1.17:check (signature-check) @ surefire-its ---
[2019-07-21T23:46:07.193Z] [INFO] Checking unresolved references to org.codehaus.mojo.signature:java17:1.0
[2019-07-21T23:46:07.193Z] [INFO] 
[2019-07-21T23:46:07.193Z] [INFO] --- maven-help-plugin:3.1.0:effective-settings (settings.xml) @ surefire-its ---
[2019-07-21T23:46:07.193Z] [INFO] Downloading from central: https://repo.maven.apache.org/maven2/org/apache/maven/plugin-tools/maven-plugin-tools-generators/3.5.1/maven-plugin-tools-generators-3.5.1.pom
[2019-07-21T23:46:07.193Z] [INFO] Downloaded from central: https://repo.maven.apache.org/maven2/org/apache/maven/plugin-tools/maven-plugin-tools-generators/3.5.1/maven-plugin-tools-generators-3.5.1.pom (4.2 kB at 155 kB/s)
[2019-07-21T23:46:07.193Z] [INFO] Downloading from central: https://repo.maven.apache.org/maven2/org/apache/maven/plugin-tools/maven-plugin-tools/3.5.1/maven-plugin-tools-3.5.1.pom
[2019-07-21T23:46:07.193Z] [INFO] Downloaded from central: https://repo.maven.apache.org/maven2/org/apache/maven/plugin-tools/maven-plugin-tools/3.5.1/maven-plugin-tools-3.5.1.pom (16 kB at 473 kB/s)
[2019-07-21T23:46:07.193Z] [INFO] Downloading from central: https://repo.maven.apache.org/maven2/org/apache/maven/plugin-tools/maven-plugin-tools-api/3.5.1/maven-plugin-tools-api-3.5.1.pom
[2019-07-21T23:46:07.193Z] [INFO] Downloaded from central: https://repo.maven.apache.org/maven2/org/apache/maven/plugin-tools/maven-plugin-tools-api/3.5.1/maven-plugin-tools-api-3.5.1.pom (2.9 kB at 77 kB/s)
[2019-07-21T23:46:07.193Z] [INFO] Downloading from central: https://repo.maven.apache.org/maven2/org/codehaus/plexus/plexus-interactivity-api/1.0-alpha-6/plexus-interactivity-api-1.0-alpha-6.pom
[2019-07-21T23:46:07.193Z] [INFO] Downloaded from central: https://repo.maven.apache.org/maven2/org/codehaus/plexus/plexus-interactivity-api/1.0-alpha-6/plexus-interactivity-api-1.0-alpha-6.pom (726 B at 19 kB/s)
[2019-07-21T23:46:07.193Z] [INFO] Downloading from central: https://repo.maven.apache.org/maven2/org/codehaus/plexus/plexus-interactivity/1.0-alpha-6/plexus-interactivity-1.0-alpha-6.pom
[2019-07-21T23:46:07.193Z] [INFO] Downloaded from central: https://repo.maven.apache.org/maven2/org/codehaus/plexus/plexus-interactivity/1.0-alpha-6/plexus-interactivity-1.0-alpha-6.pom (1.1 kB at 29 kB/s)
[2019-07-21T23:46:07.193Z] [INFO] Downloading from central: https://repo.maven.apache.org/maven2/org/codehaus/plexus/plexus-components/1.1.9/plexus-components-1.1.9.pom
[2019-07-21T23:46:07.193Z] [INFO] Downloaded from central: https://repo.maven.apache.org/maven2/org/codehaus/plexus/plexus-components/1.1.9/plexus-components-1.1.9.pom (2.4 kB at 67 kB/s)
[2019-07-21T23:46:07.193Z] [INFO] Downloading from central: https://repo.maven.apache.org/maven2/org/codehaus/plexus/plexus-utils/1.4/plexus-utils-1.4.pom
[2019-07-21T23:46:07.193Z] [INFO] Downloaded from central: https://repo.maven.apache.org/maven2/org/codehaus/plexus/plexus-utils/1.4/plexus-utils-1.4.pom (1.2 kB at 32 kB/s)
[2019-07-21T23:46:07.193Z] [INFO] Downloading from central: https://repo.maven.apache.org/maven2/com/thoughtworks/xstream/xstream/1.4.10/xstream-1.4.10.pom
[2019-07-21T23:46:07.193Z] [INFO] Downloaded from central: https://repo.maven.apache.org/maven2/com/thoughtworks/xstream/xstream/1.4.10/xstream-1.4.10.pom (15 kB at 369 kB/s)
[2019-07-21T23:46:07.193Z] [INFO] Downloading from central: https://repo.maven.apache.org/maven2/com/thoughtworks/xstream/xstream-parent/1.4.10/xstream-parent-1.4.10.pom
[2019-07-21T23:46:07.193Z] [INFO] Downloaded from central: https://repo.maven.apache.org/maven2/com/thoughtworks/xstream/xstream-parent/1.4.10/xstream-parent-1.4.10.pom (35 kB at 825 kB/s)
[2019-07-21T23:46:07.193Z] [INFO] Downloading from central: https://repo.maven.apache.org/maven2/xmlpull/xmlpull/1.1.3.1/xmlpull-1.1.3.1.pom
[2019-07-21T23:46:07.193Z] [INFO] Downloaded from central: https://repo.maven.apache.org/maven2/xmlpull/xmlpull/1.1.3.1/xmlpull-1.1.3.1.pom (386 B at 10 kB/s)
[2019-07-21T23:46:07.193Z] [INFO] Downloading from central: https://repo.maven.apache.org/maven2/xpp3/xpp3_min/1.1.4c/xpp3_min-1.1.4c.pom
[2019-07-21T23:46:07.193Z] [INFO] Downloaded from central: https://repo.maven.apache.org/maven2/xpp3/xpp3_min/1.1.4c/xpp3_min-1.1.4c.pom (1.6 kB at 44 kB/s)
[2019-07-21T23:46:07.193Z] [INFO] Downloading from central: https://repo.maven.apache.org/maven2/org/apache/maven/plugin-tools/maven-plugin-tools-generators/3.5.1/maven-plugin-tools-generators-3.5.1.jar
[2019-07-21T23:46:07.193Z] [INFO] Downloading from central: https://repo.maven.apache.org/maven2/org/codehaus/plexus/plexus-interactivity-api/1.0-alpha-6/plexus-interactivity-api-1.0-alpha-6.jar
[2019-07-21T23:46:07.193Z] [INFO] Downloading from central: https://repo.maven.apache.org/maven2/org/apache/maven/shared/maven-shared-utils/0.3/maven-shared-utils-0.3.jar
[2019-07-21T23:46:07.193Z] [INFO] Downloading from central: https://repo.maven.apache.org/maven2/commons-collections/commons-collections/3.1/commons-collections-3.1.jar
[2019-07-21T23:46:07.193Z] [INFO] Downloading from central: https://repo.maven.apache.org/maven2/org/apache/maven/plugin-tools/maven-plugin-tools-api/3.5.1/maven-plugin-tools-api-3.5.1.jar
[2019-07-21T23:46:07.193Z] [INFO] Downloaded from central: https://repo.maven.apache.org/maven2/org/apache/maven/plugin-tools/maven-plugin-tools-generators/3.5.1/maven-plugin-tools-generators-3.5.1.jar (48 kB at 569 kB/s)
[2019-07-21T23:46:07.193Z] [INFO] Downloading from central: https://repo.maven.apache.org/maven2/com/thoughtworks/xstream/xstream/1.4.10/xstream-1.4.10.jar
[2019-07-21T23:46:07.193Z] [INFO] Downloaded from central: https://repo.maven.apache.org/maven2/org/codehaus/plexus/plexus-interactivity-api/1.0-alpha-6/plexus-interactivity-api-1.0-alpha-6.jar (12 kB at 64 kB/s)
[2019-07-21T23:46:07.193Z] [INFO] Downloading from central: https://repo.maven.apache.org/maven2/xmlpull/xmlpull/1.1.3.1/xmlpull-1.1.3.1.jar
[2019-07-21T23:46:07.193Z] [INFO] Downloaded from central: https://repo.maven.apache.org/maven2/commons-collections/commons-collections/3.1/commons-collections-3.1.jar (559 kB at 2.9 MB/s)
[2019-07-21T23:46:07.193Z] [INFO] Downloading from central: https://repo.maven.apache.org/maven2/xpp3/xpp3_min/1.1.4c/xpp3_min-1.1.4c.jar
[2019-07-21T23:46:07.193Z] [INFO] Downloaded from central: https://repo.maven.apache.org/maven2/xpp3/xpp3_min/1.1.4c/xpp3_min-1.1.4c.jar (25 kB at 112 kB/s)
[2019-07-21T23:46:07.193Z] [INFO] Downloaded from central: https://repo.maven.apache.org/maven2/com/thoughtworks/xstream/xstream/1.4.10/xstream-1.4.10.jar (590 kB at 2.5 MB/s)
[2019-07-21T23:46:07.193Z] [INFO] Downloaded from central: https://repo.maven.apache.org/maven2/org/apache/maven/plugin-tools/maven-plugin-tools-api/3.5.1/maven-plugin-tools-api-3.5.1.jar (24 kB at 97 kB/s)
[2019-07-21T23:46:07.193Z] [INFO] Downloaded from central: https://repo.maven.apache.org/maven2/xmlpull/xmlpull/1.1.3.1/xmlpull-1.1.3.1.jar (7.2 kB at 25 kB/s)
[2019-07-21T23:46:07.193Z] [INFO] Downloaded from central: https://repo.maven.apache.org/maven2/org/apache/maven/shared/maven-shared-utils/0.3/maven-shared-utils-0.3.jar (155 kB at 348 kB/s)
[2019-07-21T23:46:07.475Z] [INFO] Effective-settings written to: C:\Users\jenkins\AppData\Local\Temp\2\jenkins-maven-box-maven-surefire-SUREFIRE-1675-22\surefire-its\target\private\settings.xml
[2019-07-21T23:46:07.475Z] [INFO] 
[2019-07-21T23:46:07.475Z] [INFO] --- maven-resources-plugin:3.1.0:testResources (default-testResources) @ surefire-its ---
[2019-07-21T23:46:07.475Z] [INFO] Using 'UTF-8' encoding to copy filtered resources.
[2019-07-21T23:46:07.755Z] [INFO] Copying 831 resources
[2019-07-21T23:46:17.848Z] [INFO] Copying 3 resources
[2019-07-21T23:46:17.848Z] [INFO] 
[2019-07-21T23:46:17.848Z] [INFO] --- maven-compiler-plugin:3.7.0:testCompile (default-testCompile) @ surefire-its ---
[2019-07-21T23:46:17.848Z] [INFO] Changes detected - recompiling the module!
[2019-07-21T23:46:17.848Z] [INFO] Compiling 208 source files to C:\Users\jenkins\AppData\Local\Temp\2\jenkins-maven-box-maven-surefire-SUREFIRE-1675-22\surefire-its\target\test-classes
[2019-07-21T23:46:23.208Z] [INFO] 
[2019-07-21T23:46:23.208Z] [INFO] --- maven-surefire-plugin:3.0.0-M3:test (default-test) @ surefire-its ---
[2019-07-21T23:46:23.485Z] [INFO] Surefire report directory: C:\Users\jenkins\AppData\Local\Temp\2\jenkins-maven-box-maven-surefire-SUREFIRE-1675-22\surefire-its\target\surefire-reports
[2019-07-21T23:46:23.485Z] [INFO] Using configured provider org.apache.maven.shadefire.surefire.junit.JUnit3Provider
[2019-07-21T23:46:23.485Z] [INFO] parallel='none', perCoreThreadCount=true, threadCount=0, useUnlimitedThreads=false, threadCountSuites=0, threadCountClasses=0, threadCountMethods=0, parallelOptimized=true
[2019-07-21T23:46:23.485Z] [INFO] 
[2019-07-21T23:46:23.485Z] [INFO] -------------------------------------------------------
[2019-07-21T23:46:23.485Z] [INFO]  T E S T S
[2019-07-21T23:46:23.485Z] [INFO] -------------------------------------------------------
[2019-07-21T23:46:23.761Z] [INFO] Running org.apache.maven.surefire.its.fixture.JUnit4SuiteTest
[2019-07-21T23:46:24.040Z] [WARNING] System property already exists '-DskipTests'. Overriding to '-DskipTests'.
[2019-07-21T23:46:24.040Z] [WARNING] System property already exists '-Dx=a'. Overriding to '-Dx=b'.
[2019-07-21T23:46:24.040Z] Using JAVA_HOME=F:\jenkins\tools\java\latest1.7 in forked launcher.
[2019-07-21T23:46:24.040Z] [INFO] Tests run: 2, Failures: 0, Errors: 0, Skipped: 0, Time elapsed: 0.101 s - in org.apache.maven.surefire.its.fixture.JUnit4SuiteTest
[2019-07-21T23:46:24.316Z] [INFO] 
[2019-07-21T23:46:24.316Z] [INFO] Results:
[2019-07-21T23:46:24.316Z] [INFO] 
[2019-07-21T23:46:24.316Z] [INFO] Tests run: 2, Failures: 0, Errors: 0, Skipped: 0
[2019-07-21T23:46:24.316Z] [INFO] 
[2019-07-21T23:46:24.316Z] [INFO] 
[2019-07-21T23:46:24.316Z] [INFO] --- maven-jar-plugin:3.1.0:jar (default-jar) @ surefire-its ---
[2019-07-21T23:46:25.735Z] [INFO] Building jar: C:\Users\jenkins\AppData\Local\Temp\2\jenkins-maven-box-maven-surefire-SUREFIRE-1675-22\surefire-its\target\surefire-its-3.0.0-SNAPSHOT.jar
[2019-07-21T23:46:26.708Z] [INFO] 
[2019-07-21T23:46:26.708Z] [INFO] --- maven-site-plugin:3.7.1:attach-descriptor (attach-descriptor) @ surefire-its ---
[2019-07-21T23:46:26.708Z] [INFO] Skipping because packaging 'jar' is not pom.
[2019-07-21T23:46:26.708Z] [INFO] 
[2019-07-21T23:46:26.708Z] [INFO] --- jacoco-maven-plugin:0.8.4:prepare-agent-integration (jacoco-agent-it) @ surefire-its ---
[2019-07-21T23:46:26.708Z] [INFO] Skipping JaCoCo execution because property jacoco.skip is set.
[2019-07-21T23:46:26.708Z] [INFO] jacoco-it.agent set to empty
[2019-07-21T23:46:26.708Z] [INFO] 
[2019-07-21T23:46:26.708Z] [INFO] --- maven-failsafe-plugin:3.0.0-M3:integration-test (default) @ surefire-its ---
[2019-07-21T23:46:26.708Z] [INFO] Downloading from central: https://repo.maven.apache.org/maven2/org/apache/maven/surefire/surefire-junit47/3.0.0-M3/surefire-junit47-3.0.0-M3.pom
[2019-07-21T23:46:26.708Z] [INFO] Downloaded from central: https://repo.maven.apache.org/maven2/org/apache/maven/surefire/surefire-junit47/3.0.0-M3/surefire-junit47-3.0.0-M3.pom (7.3 kB at 174 kB/s)
[2019-07-21T23:46:26.708Z] [INFO] Downloading from central: https://repo.maven.apache.org/maven2/org/apache/maven/surefire/surefire-providers/3.0.0-M3/surefire-providers-3.0.0-M3.pom
[2019-07-21T23:46:26.708Z] [INFO] Downloaded from central: https://repo.maven.apache.org/maven2/org/apache/maven/surefire/surefire-providers/3.0.0-M3/surefire-providers-3.0.0-M3.pom (2.5 kB at 67 kB/s)
[2019-07-21T23:46:26.986Z] [INFO] Downloading from central: https://repo.maven.apache.org/maven2/org/apache/maven/surefire/common-junit48/3.0.0-M3/common-junit48-3.0.0-M3.pom
[2019-07-21T23:46:26.986Z] [INFO] Downloaded from central: https://repo.maven.apache.org/maven2/org/apache/maven/surefire/common-junit48/3.0.0-M3/common-junit48-3.0.0-M3.pom (2.4 kB at 61 kB/s)
[2019-07-21T23:46:26.986Z] [INFO] Downloading from central: https://repo.maven.apache.org/maven2/org/apache/maven/surefire/common-junit4/3.0.0-M3/common-junit4-3.0.0-M3.pom
[2019-07-21T23:46:26.986Z] [INFO] Downloaded from central: https://repo.maven.apache.org/maven2/org/apache/maven/surefire/common-junit4/3.0.0-M3/common-junit4-3.0.0-M3.pom (1.9 kB at 51 kB/s)
[2019-07-21T23:46:26.986Z] [INFO] Downloading from central: https://repo.maven.apache.org/maven2/org/apache/maven/surefire/common-junit3/3.0.0-M3/common-junit3-3.0.0-M3.pom
[2019-07-21T23:46:26.986Z] [INFO] Downloaded from central: https://repo.maven.apache.org/maven2/org/apache/maven/surefire/common-junit3/3.0.0-M3/common-junit3-3.0.0-M3.pom (1.6 kB at 42 kB/s)
[2019-07-21T23:46:26.986Z] [INFO] Downloading from central: https://repo.maven.apache.org/maven2/org/apache/maven/surefire/common-java5/3.0.0-M3/common-java5-3.0.0-M3.pom
[2019-07-21T23:46:26.986Z] [INFO] Downloaded from central: https://repo.maven.apache.org/maven2/org/apache/maven/surefire/common-java5/3.0.0-M3/common-java5-3.0.0-M3.pom (3.1 kB at 83 kB/s)
[2019-07-21T23:46:27.260Z] [INFO] Downloading from central: https://repo.maven.apache.org/maven2/org/apache/maven/surefire/surefire-grouper/3.0.0-M3/surefire-grouper-3.0.0-M3.pom
[2019-07-21T23:46:27.260Z] [INFO] Downloaded from central: https://repo.maven.apache.org/maven2/org/apache/maven/surefire/surefire-grouper/3.0.0-M3/surefire-grouper-3.0.0-M3.pom (2.6 kB at 68 kB/s)
[2019-07-21T23:46:27.260Z] [INFO] Downloading from central: https://repo.maven.apache.org/maven2/org/apache/maven/surefire/surefire-junit47/3.0.0-M3/surefire-junit47-3.0.0-M3.jar
[2019-07-21T23:46:27.260Z] [INFO] Downloading from central: https://repo.maven.apache.org/maven2/org/apache/maven/surefire/common-java5/3.0.0-M3/common-java5-3.0.0-M3.jar
[2019-07-21T23:46:27.260Z] [INFO] Downloading from central: https://repo.maven.apache.org/maven2/org/apache/maven/surefire/common-junit3/3.0.0-M3/common-junit3-3.0.0-M3.jar
[2019-07-21T23:46:27.260Z] [INFO] Downloading from central: https://repo.maven.apache.org/maven2/org/apache/maven/surefire/common-junit4/3.0.0-M3/common-junit4-3.0.0-M3.jar
[2019-07-21T23:46:27.260Z] [INFO] Downloading from central: https://repo.maven.apache.org/maven2/org/apache/maven/surefire/common-junit48/3.0.0-M3/common-junit48-3.0.0-M3.jar
[2019-07-21T23:46:27.260Z] [INFO] Downloaded from central: https://repo.maven.apache.org/maven2/org/apache/maven/surefire/common-java5/3.0.0-M3/common-java5-3.0.0-M3.jar (32 kB at 919 kB/s)
[2019-07-21T23:46:27.260Z] [INFO] Downloaded from central: https://repo.maven.apache.org/maven2/org/apache/maven/surefire/common-junit3/3.0.0-M3/common-junit3-3.0.0-M3.jar (12 kB at 314 kB/s)
[2019-07-21T23:46:27.260Z] [INFO] Downloaded from central: https://repo.maven.apache.org/maven2/org/apache/maven/surefire/common-junit4/3.0.0-M3/common-junit4-3.0.0-M3.jar (28 kB at 724 kB/s)
[2019-07-21T23:46:27.260Z] [INFO] Downloading from central: https://repo.maven.apache.org/maven2/org/apache/maven/surefire/surefire-grouper/3.0.0-M3/surefire-grouper-3.0.0-M3.jar
[2019-07-21T23:46:27.535Z] [INFO] Downloaded from central: https://repo.maven.apache.org/maven2/org/apache/maven/surefire/common-junit48/3.0.0-M3/common-junit48-3.0.0-M3.jar (22 kB at 106 kB/s)
[2019-07-21T23:46:27.535Z] [INFO] Downloaded from central: https://repo.maven.apache.org/maven2/org/apache/maven/surefire/surefire-junit47/3.0.0-M3/surefire-junit47-3.0.0-M3.jar (93 kB at 382 kB/s)
[2019-07-21T23:46:27.535Z] [INFO] Downloaded from central: https://repo.maven.apache.org/maven2/org/apache/maven/surefire/surefire-grouper/3.0.0-M3/surefire-grouper-3.0.0-M3.jar (40 kB at 120 kB/s)
[2019-07-21T23:46:28.123Z] [INFO] Failsafe report directory: C:\Users\jenkins\AppData\Local\Temp\2\jenkins-maven-box-maven-surefire-SUREFIRE-1675-22\surefire-its\target\failsafe-reports
[2019-07-21T23:46:28.123Z] [INFO] Using configured provider org.apache.maven.surefire.junitcore.JUnitCoreProvider
[2019-07-21T23:46:28.123Z] [INFO] parallel='none', perCoreThreadCount=false, threadCount=1, useUnlimitedThreads=false, threadCountSuites=0, threadCountClasses=0, threadCountMethods=0, parallelOptimized=true
[2019-07-21T23:46:28.401Z] [INFO] 
[2019-07-21T23:46:28.401Z] [INFO] -------------------------------------------------------
[2019-07-21T23:46:28.401Z] [INFO]  T E S T S
[2019-07-21T23:46:28.401Z] [INFO] -------------------------------------------------------
[2019-07-21T23:46:50.474Z] [INFO] Running org.apache.maven.surefire.its.jiras.Surefire946KillMainProcessInReusableForkIT
[2019-07-21T23:47:37.314Z] [INFO] Tests run: 6, Failures: 0, Errors: 0, Skipped: 0, Time elapsed: 44.09 s - in org.apache.maven.surefire.its.jiras.Surefire946KillMainProcessInReusableForkIT
[2019-07-21T23:47:37.314Z] [INFO] 
[2019-07-21T23:47:37.314Z] [INFO] Results:
[2019-07-21T23:47:37.314Z] [INFO] 
[2019-07-21T23:47:37.314Z] [INFO] Tests run: 6, Failures: 0, Errors: 0, Skipped: 0
[2019-07-21T23:47:37.314Z] [INFO] 
[2019-07-21T23:47:37.314Z] [INFO] 
[2019-07-21T23:47:37.314Z] [INFO] --- maven-checkstyle-plugin:3.0.0:check (checkstyle-check) @ surefire-its ---
[2019-07-21T23:47:37.314Z] [INFO] 
[2019-07-21T23:47:37.315Z] [INFO] --- maven-failsafe-plugin:3.0.0-M3:verify (default) @ surefire-its ---
[2019-07-21T23:47:37.315Z] [INFO] Failsafe report directory: C:\Users\jenkins\AppData\Local\Temp\2\jenkins-maven-box-maven-surefire-SUREFIRE-1675-22\surefire-its\target\failsafe-reports
[2019-07-21T23:47:37.315Z] [INFO] 
[2019-07-21T23:47:37.315Z] [INFO] --- maven-install-plugin:2.5.2:install (default-install) @ surefire-its ---
[2019-07-21T23:47:37.315Z] [INFO] Skipping artifact installation
[2019-07-21T23:47:37.315Z] [INFO] ------------------------------------------------------------------------
[2019-07-21T23:47:37.315Z] [INFO] Reactor Summary for Apache Maven Surefire 3.0.0-SNAPSHOT:
[2019-07-21T23:47:37.315Z] [INFO] 
[2019-07-21T23:47:37.315Z] [INFO] Apache Maven Surefire .............................. SUCCESS [ 58.713 s]
[2019-07-21T23:47:37.315Z] [INFO] SureFire Logger API ................................ SUCCESS [ 21.820 s]
[2019-07-21T23:47:37.315Z] [INFO] SureFire API ....................................... SUCCESS [ 17.067 s]
[2019-07-21T23:47:37.315Z] [INFO] Surefire Extensions API ............................ SUCCESS [  3.158 s]
[2019-07-21T23:47:37.315Z] [INFO] SureFire Booter .................................... SUCCESS [ 15.948 s]
[2019-07-21T23:47:37.315Z] [INFO] Maven Surefire Test-Grouping Support ............... SUCCESS [ 11.250 s]
[2019-07-21T23:47:37.315Z] [INFO] SureFire Providers ................................. SUCCESS [  1.095 s]
[2019-07-21T23:47:37.315Z] [INFO] Shared JUnit3 Provider Code ........................ SUCCESS [  4.737 s]
[2019-07-21T23:47:37.315Z] [INFO] Shared Java 5 Provider Base ........................ SUCCESS [  6.803 s]
[2019-07-21T23:47:37.315Z] [INFO] Shared JUnit4 Provider Code ........................ SUCCESS [  6.704 s]
[2019-07-21T23:47:37.315Z] [INFO] Shared JUnit48 Provider Code ....................... SUCCESS [  6.964 s]
[2019-07-21T23:47:37.315Z] [INFO] SureFire JUnit Runner .............................. SUCCESS [  5.223 s]
[2019-07-21T23:47:37.315Z] [INFO] SureFire JUnit4 Runner ............................. SUCCESS [ 35.350 s]
[2019-07-21T23:47:37.315Z] [INFO] Maven Surefire Common .............................. SUCCESS [ 38.871 s]
[2019-07-21T23:47:37.315Z] [INFO] SureFire JUnitCore Runner .......................... SUCCESS [02:24 min]
[2019-07-21T23:47:37.315Z] [INFO] SureFire JUnit Platform Runner ..................... SUCCESS [ 10.834 s]
[2019-07-21T23:47:37.315Z] [INFO] SureFire TestNG Utils .............................. SUCCESS [  5.427 s]
[2019-07-21T23:47:37.315Z] [INFO] SureFire TestNG Runner ............................. SUCCESS [  6.953 s]
[2019-07-21T23:47:37.315Z] [INFO] ShadeFire JUnit3 Provider .......................... SUCCESS [  2.650 s]
[2019-07-21T23:47:37.315Z] [INFO] Surefire Report Parser ............................. SUCCESS [  8.215 s]
[2019-07-21T23:47:37.315Z] [INFO] Maven Surefire Plugin .............................. SUCCESS [ 15.525 s]
[2019-07-21T23:47:37.315Z] [INFO] Maven Failsafe Plugin .............................. SUCCESS [01:47 min]
[2019-07-21T23:47:37.315Z] [INFO] Maven Surefire Report Plugin ....................... SUCCESS [ 19.289 s]
[2019-07-21T23:47:37.315Z] [INFO] Maven Surefire Integration Tests ................... SUCCESS [01:49 min]
[2019-07-21T23:47:37.315Z] [INFO] ------------------------------------------------------------------------
[2019-07-21T23:47:37.315Z] [INFO] BUILD SUCCESS
[2019-07-21T23:47:37.315Z] [INFO] ------------------------------------------------------------------------
[2019-07-21T23:47:37.315Z] [INFO] Total time:  11:05 min
[2019-07-21T23:47:37.315Z] [INFO] Finished at: 2019-07-21T16:47:32-07:00
[2019-07-21T23:47:37.315Z] [INFO] ------------------------------------------------------------------------
[Pipeline] }
[Pipeline] // withEnv
[Pipeline] }
[Pipeline] // stage
[Pipeline] cleanWs
[2019-07-21T23:47:37.426Z] [WS-CLEANUP] Deleting project workspace...
[2019-07-21T23:47:37.426Z] [WS-CLEANUP] Deferred wipeout is used...
[2019-07-21T23:47:37.481Z] [WS-CLEANUP] done
[Pipeline] }
[Pipeline] // ws
[Pipeline] }
[Pipeline] // timestamps
[Pipeline] }
[Pipeline] // node
[Pipeline] }
[Pipeline] // parallel
[Pipeline] echo
hudson.AbortException: hudson.AbortException: No tool named IBM 1.7 64-bit (on Ubuntu only) found
[Pipeline] echo
Build result: FAILURE
[Pipeline] jiraIssueSelector
[Pipeline] emailext

Build failed in Jenkins: Maven TLP » maven-surefire » SUREFIRE-1675 #21

Posted by Apache Jenkins Server <je...@builds.apache.org>.
See https://builds.apache.org/job/maven-box/job/maven-surefire/job/SUREFIRE-1675/21/

No changes.

No tests ran.

Build log:
[...truncated 5488 lines...]
[2019-07-21T23:33:10.514Z] [INFO] 
[2019-07-21T23:33:10.514Z] [INFO] --- maven-clean-plugin:3.1.0:clean (default-clean) @ surefire-its ---
[2019-07-21T23:33:10.514Z] [INFO] 
[2019-07-21T23:33:10.514Z] [INFO] --- maven-enforcer-plugin:3.0.0-M2:enforce (enforce-maven-version) @ surefire-its ---
[2019-07-21T23:33:10.514Z] [INFO] 
[2019-07-21T23:33:10.514Z] [INFO] --- maven-enforcer-plugin:3.0.0-M2:enforce (enforce-bytecode-version) @ surefire-its ---
[2019-07-21T23:33:11.117Z] [INFO] 
[2019-07-21T23:33:11.117Z] [INFO] --- maven-enforcer-plugin:3.0.0-M2:enforce (ban-known-bad-maven-versions) @ surefire-its ---
[2019-07-21T23:33:11.117Z] [INFO] 
[2019-07-21T23:33:11.117Z] [INFO] --- maven-enforcer-plugin:3.0.0-M2:enforce (enforce-java) @ surefire-its ---
[2019-07-21T23:33:11.117Z] [INFO] 
[2019-07-21T23:33:11.117Z] [INFO] --- maven-enforcer-plugin:3.0.0-M2:enforce (enforce-maven) @ surefire-its ---
[2019-07-21T23:33:11.117Z] [INFO] 
[2019-07-21T23:33:11.117Z] [INFO] --- apache-rat-plugin:0.12:check (rat-check) @ surefire-its ---
[2019-07-21T23:33:11.117Z] [INFO] Enabled default license matchers.
[2019-07-21T23:33:11.117Z] [INFO] Will parse SCM ignores for exclusions...
[2019-07-21T23:33:11.117Z] [INFO] Finished adding exclusions from SCM ignore files.
[2019-07-21T23:33:11.117Z] [INFO] 61 implicit excludes (use -debug for more details).
[2019-07-21T23:33:11.117Z] [INFO] Exclude: .repository/**
[2019-07-21T23:33:11.117Z] [INFO] Exclude: .maven/spy.log
[2019-07-21T23:33:11.117Z] [INFO] Exclude: dependency-reduced-pom.xml
[2019-07-21T23:33:11.117Z] [INFO] Exclude: .java-version
[2019-07-21T23:33:11.117Z] [INFO] Exclude: Jenkinsfile
[2019-07-21T23:33:11.117Z] [INFO] Exclude: README.md
[2019-07-21T23:33:11.117Z] [INFO] Exclude: .gitignore
[2019-07-21T23:33:11.117Z] [INFO] Exclude: .git/**/*
[2019-07-21T23:33:11.117Z] [INFO] Exclude: **/.idea
[2019-07-21T23:33:11.117Z] [INFO] Exclude: **/.svn/**/*
[2019-07-21T23:33:11.117Z] [INFO] Exclude: **/*.iml
[2019-07-21T23:33:11.117Z] [INFO] Exclude: **/*.ipr
[2019-07-21T23:33:11.117Z] [INFO] Exclude: **/*.iws
[2019-07-21T23:33:11.117Z] [INFO] Exclude: **/*.versionsBackup
[2019-07-21T23:33:11.117Z] [INFO] Exclude: **/dependency-reduced-pom.xml
[2019-07-21T23:33:11.117Z] [INFO] Exclude: .repository/**
[2019-07-21T23:33:11.117Z] [INFO] Exclude: src/test/resources/**/*
[2019-07-21T23:33:11.117Z] [INFO] Exclude: src/test/resources/**/*.css
[2019-07-21T23:33:11.117Z] [INFO] Exclude: **/*.jj
[2019-07-21T23:33:11.117Z] [INFO] Exclude: src/main/resources/META-INF/services/org.apache.maven.surefire.providerapi.SurefireProvider
[2019-07-21T23:33:11.117Z] [INFO] Exclude: DEPENDENCIES
[2019-07-21T23:33:11.117Z] [INFO] Exclude: .m2/**
[2019-07-21T23:33:11.117Z] [INFO] Exclude: .m2
[2019-07-21T23:33:11.117Z] [INFO] Exclude: .travis.yml
[2019-07-21T23:33:11.410Z] [INFO] 209 resources included (use -debug for more details)
[2019-07-21T23:33:12.863Z] [INFO] Rat check: Summary over all files. Unapproved: 0, unknown: 0, generated: 0, approved: 209 licenses.
[2019-07-21T23:33:12.863Z] [INFO] 
[2019-07-21T23:33:12.863Z] [INFO] --- jacoco-maven-plugin:0.8.4:prepare-agent (jacoco-agent) @ surefire-its ---
[2019-07-21T23:33:12.863Z] [INFO] Skipping JaCoCo execution because property jacoco.skip is set.
[2019-07-21T23:33:12.863Z] [INFO] argLine set to empty
[2019-07-21T23:33:12.863Z] [INFO] 
[2019-07-21T23:33:12.863Z] [INFO] --- maven-compiler-plugin:3.7.0:compile (compile-generated) @ surefire-its ---
[2019-07-21T23:33:12.863Z] [INFO] No sources to compile
[2019-07-21T23:33:12.863Z] [INFO] 
[2019-07-21T23:33:12.863Z] [INFO] --- maven-remote-resources-plugin:1.5:process (process-resource-bundles) @ surefire-its ---
[2019-07-21T23:33:12.863Z] [INFO] 
[2019-07-21T23:33:12.863Z] [INFO] --- maven-resources-plugin:3.1.0:resources (default-resources) @ surefire-its ---
[2019-07-21T23:33:12.863Z] [INFO] Using 'UTF-8' encoding to copy filtered resources.
[2019-07-21T23:33:12.863Z] [INFO] Copying 830 resources to C:\Users\jenkins\AppData\Local\Temp\2\jenkins-maven-box-maven-surefire-SUREFIRE-1675-21\surefire-its\target\classes
[2019-07-21T23:33:27.877Z] [INFO] Copying 1 resource to C:\Users\jenkins\AppData\Local\Temp\2\jenkins-maven-box-maven-surefire-SUREFIRE-1675-21\surefire-its\target/private
[2019-07-21T23:33:27.877Z] [INFO] Copying 3 resources
[2019-07-21T23:33:27.877Z] [INFO] 
[2019-07-21T23:33:27.877Z] [INFO] --- maven-compiler-plugin:3.7.0:compile (default-compile) @ surefire-its ---
[2019-07-21T23:33:27.877Z] [INFO] No sources to compile
[2019-07-21T23:33:27.877Z] [INFO] 
[2019-07-21T23:33:27.877Z] [INFO] --- animal-sniffer-maven-plugin:1.17:check (signature-check) @ surefire-its ---
[2019-07-21T23:33:27.877Z] [INFO] Checking unresolved references to org.codehaus.mojo.signature:java17:1.0
[2019-07-21T23:33:27.877Z] [INFO] 
[2019-07-21T23:33:27.877Z] [INFO] --- maven-help-plugin:3.1.0:effective-settings (settings.xml) @ surefire-its ---
[2019-07-21T23:33:27.877Z] [INFO] Downloading from central: https://repo.maven.apache.org/maven2/org/apache/maven/plugin-tools/maven-plugin-tools-generators/3.5.1/maven-plugin-tools-generators-3.5.1.pom
[2019-07-21T23:33:27.877Z] [INFO] Downloaded from central: https://repo.maven.apache.org/maven2/org/apache/maven/plugin-tools/maven-plugin-tools-generators/3.5.1/maven-plugin-tools-generators-3.5.1.pom (4.2 kB at 131 kB/s)
[2019-07-21T23:33:27.877Z] [INFO] Downloading from central: https://repo.maven.apache.org/maven2/org/apache/maven/plugin-tools/maven-plugin-tools/3.5.1/maven-plugin-tools-3.5.1.pom
[2019-07-21T23:33:27.877Z] [INFO] Downloaded from central: https://repo.maven.apache.org/maven2/org/apache/maven/plugin-tools/maven-plugin-tools/3.5.1/maven-plugin-tools-3.5.1.pom (16 kB at 390 kB/s)
[2019-07-21T23:33:27.877Z] [INFO] Downloading from central: https://repo.maven.apache.org/maven2/org/apache/maven/plugin-tools/maven-plugin-tools-api/3.5.1/maven-plugin-tools-api-3.5.1.pom
[2019-07-21T23:33:27.877Z] [INFO] Downloaded from central: https://repo.maven.apache.org/maven2/org/apache/maven/plugin-tools/maven-plugin-tools-api/3.5.1/maven-plugin-tools-api-3.5.1.pom (2.9 kB at 79 kB/s)
[2019-07-21T23:33:27.877Z] [INFO] Downloading from central: https://repo.maven.apache.org/maven2/org/codehaus/plexus/plexus-interactivity-api/1.0-alpha-6/plexus-interactivity-api-1.0-alpha-6.pom
[2019-07-21T23:33:27.877Z] [INFO] Downloaded from central: https://repo.maven.apache.org/maven2/org/codehaus/plexus/plexus-interactivity-api/1.0-alpha-6/plexus-interactivity-api-1.0-alpha-6.pom (726 B at 20 kB/s)
[2019-07-21T23:33:27.877Z] [INFO] Downloading from central: https://repo.maven.apache.org/maven2/org/codehaus/plexus/plexus-interactivity/1.0-alpha-6/plexus-interactivity-1.0-alpha-6.pom
[2019-07-21T23:33:27.877Z] [INFO] Downloaded from central: https://repo.maven.apache.org/maven2/org/codehaus/plexus/plexus-interactivity/1.0-alpha-6/plexus-interactivity-1.0-alpha-6.pom (1.1 kB at 30 kB/s)
[2019-07-21T23:33:27.877Z] [INFO] Downloading from central: https://repo.maven.apache.org/maven2/org/codehaus/plexus/plexus-components/1.1.9/plexus-components-1.1.9.pom
[2019-07-21T23:33:27.877Z] [INFO] Downloaded from central: https://repo.maven.apache.org/maven2/org/codehaus/plexus/plexus-components/1.1.9/plexus-components-1.1.9.pom (2.4 kB at 64 kB/s)
[2019-07-21T23:33:27.877Z] [INFO] Downloading from central: https://repo.maven.apache.org/maven2/org/codehaus/plexus/plexus-utils/1.4/plexus-utils-1.4.pom
[2019-07-21T23:33:27.877Z] [INFO] Downloaded from central: https://repo.maven.apache.org/maven2/org/codehaus/plexus/plexus-utils/1.4/plexus-utils-1.4.pom (1.2 kB at 32 kB/s)
[2019-07-21T23:33:27.877Z] [INFO] Downloading from central: https://repo.maven.apache.org/maven2/com/thoughtworks/xstream/xstream/1.4.10/xstream-1.4.10.pom
[2019-07-21T23:33:27.877Z] [INFO] Downloaded from central: https://repo.maven.apache.org/maven2/com/thoughtworks/xstream/xstream/1.4.10/xstream-1.4.10.pom (15 kB at 369 kB/s)
[2019-07-21T23:33:27.877Z] [INFO] Downloading from central: https://repo.maven.apache.org/maven2/com/thoughtworks/xstream/xstream-parent/1.4.10/xstream-parent-1.4.10.pom
[2019-07-21T23:33:27.877Z] [INFO] Downloaded from central: https://repo.maven.apache.org/maven2/com/thoughtworks/xstream/xstream-parent/1.4.10/xstream-parent-1.4.10.pom (35 kB at 772 kB/s)
[2019-07-21T23:33:27.877Z] [INFO] Downloading from central: https://repo.maven.apache.org/maven2/xmlpull/xmlpull/1.1.3.1/xmlpull-1.1.3.1.pom
[2019-07-21T23:33:27.877Z] [INFO] Downloaded from central: https://repo.maven.apache.org/maven2/xmlpull/xmlpull/1.1.3.1/xmlpull-1.1.3.1.pom (386 B at 11 kB/s)
[2019-07-21T23:33:27.877Z] [INFO] Downloading from central: https://repo.maven.apache.org/maven2/xpp3/xpp3_min/1.1.4c/xpp3_min-1.1.4c.pom
[2019-07-21T23:33:27.877Z] [INFO] Downloaded from central: https://repo.maven.apache.org/maven2/xpp3/xpp3_min/1.1.4c/xpp3_min-1.1.4c.pom (1.6 kB at 42 kB/s)
[2019-07-21T23:33:27.877Z] [INFO] Downloading from central: https://repo.maven.apache.org/maven2/org/apache/maven/plugin-tools/maven-plugin-tools-generators/3.5.1/maven-plugin-tools-generators-3.5.1.jar
[2019-07-21T23:33:27.877Z] [INFO] Downloading from central: https://repo.maven.apache.org/maven2/org/apache/maven/shared/maven-shared-utils/0.3/maven-shared-utils-0.3.jar
[2019-07-21T23:33:27.877Z] [INFO] Downloading from central: https://repo.maven.apache.org/maven2/org/codehaus/plexus/plexus-interactivity-api/1.0-alpha-6/plexus-interactivity-api-1.0-alpha-6.jar
[2019-07-21T23:33:27.877Z] [INFO] Downloading from central: https://repo.maven.apache.org/maven2/commons-collections/commons-collections/3.1/commons-collections-3.1.jar
[2019-07-21T23:33:27.877Z] [INFO] Downloading from central: https://repo.maven.apache.org/maven2/org/apache/maven/plugin-tools/maven-plugin-tools-api/3.5.1/maven-plugin-tools-api-3.5.1.jar
[2019-07-21T23:33:27.877Z] [INFO] Downloaded from central: https://repo.maven.apache.org/maven2/org/apache/maven/plugin-tools/maven-plugin-tools-generators/3.5.1/maven-plugin-tools-generators-3.5.1.jar (48 kB at 1.2 MB/s)
[2019-07-21T23:33:27.877Z] [INFO] Downloading from central: https://repo.maven.apache.org/maven2/com/thoughtworks/xstream/xstream/1.4.10/xstream-1.4.10.jar
[2019-07-21T23:33:27.877Z] [INFO] Downloaded from central: https://repo.maven.apache.org/maven2/commons-collections/commons-collections/3.1/commons-collections-3.1.jar (559 kB at 4.7 MB/s)
[2019-07-21T23:33:27.877Z] [INFO] Downloading from central: https://repo.maven.apache.org/maven2/xmlpull/xmlpull/1.1.3.1/xmlpull-1.1.3.1.jar
[2019-07-21T23:33:27.877Z] [INFO] Downloaded from central: https://repo.maven.apache.org/maven2/com/thoughtworks/xstream/xstream/1.4.10/xstream-1.4.10.jar (590 kB at 3.1 MB/s)
[2019-07-21T23:33:27.877Z] [INFO] Downloading from central: https://repo.maven.apache.org/maven2/xpp3/xpp3_min/1.1.4c/xpp3_min-1.1.4c.jar
[2019-07-21T23:33:27.877Z] [INFO] Downloaded from central: https://repo.maven.apache.org/maven2/org/codehaus/plexus/plexus-interactivity-api/1.0-alpha-6/plexus-interactivity-api-1.0-alpha-6.jar (12 kB at 59 kB/s)
[2019-07-21T23:33:27.877Z] [INFO] Downloaded from central: https://repo.maven.apache.org/maven2/xpp3/xpp3_min/1.1.4c/xpp3_min-1.1.4c.jar (25 kB at 113 kB/s)
[2019-07-21T23:33:27.877Z] [INFO] Downloaded from central: https://repo.maven.apache.org/maven2/xmlpull/xmlpull/1.1.3.1/xmlpull-1.1.3.1.jar (7.2 kB at 32 kB/s)
[2019-07-21T23:33:27.877Z] [INFO] Downloaded from central: https://repo.maven.apache.org/maven2/org/apache/maven/plugin-tools/maven-plugin-tools-api/3.5.1/maven-plugin-tools-api-3.5.1.jar (24 kB at 92 kB/s)
[2019-07-21T23:33:27.877Z] [INFO] Downloaded from central: https://repo.maven.apache.org/maven2/org/apache/maven/shared/maven-shared-utils/0.3/maven-shared-utils-0.3.jar (155 kB at 408 kB/s)
[2019-07-21T23:33:28.473Z] [INFO] Effective-settings written to: C:\Users\jenkins\AppData\Local\Temp\2\jenkins-maven-box-maven-surefire-SUREFIRE-1675-21\surefire-its\target\private\settings.xml
[2019-07-21T23:33:28.473Z] [INFO] 
[2019-07-21T23:33:28.473Z] [INFO] --- maven-resources-plugin:3.1.0:testResources (default-testResources) @ surefire-its ---
[2019-07-21T23:33:28.473Z] [INFO] Using 'UTF-8' encoding to copy filtered resources.
[2019-07-21T23:33:28.751Z] [INFO] Copying 831 resources
[2019-07-21T23:33:38.850Z] [INFO] Copying 3 resources
[2019-07-21T23:33:38.850Z] [INFO] 
[2019-07-21T23:33:38.850Z] [INFO] --- maven-compiler-plugin:3.7.0:testCompile (default-testCompile) @ surefire-its ---
[2019-07-21T23:33:38.850Z] [INFO] Changes detected - recompiling the module!
[2019-07-21T23:33:38.850Z] [INFO] Compiling 208 source files to C:\Users\jenkins\AppData\Local\Temp\2\jenkins-maven-box-maven-surefire-SUREFIRE-1675-21\surefire-its\target\test-classes
[2019-07-21T23:33:44.226Z] [INFO] 
[2019-07-21T23:33:44.226Z] [INFO] --- maven-surefire-plugin:3.0.0-M3:test (default-test) @ surefire-its ---
[2019-07-21T23:33:44.226Z] [INFO] Surefire report directory: C:\Users\jenkins\AppData\Local\Temp\2\jenkins-maven-box-maven-surefire-SUREFIRE-1675-21\surefire-its\target\surefire-reports
[2019-07-21T23:33:44.226Z] [INFO] Using configured provider org.apache.maven.shadefire.surefire.junit.JUnit3Provider
[2019-07-21T23:33:44.226Z] [INFO] parallel='none', perCoreThreadCount=true, threadCount=0, useUnlimitedThreads=false, threadCountSuites=0, threadCountClasses=0, threadCountMethods=0, parallelOptimized=true
[2019-07-21T23:33:44.226Z] [INFO] 
[2019-07-21T23:33:44.226Z] [INFO] -------------------------------------------------------
[2019-07-21T23:33:44.226Z] [INFO]  T E S T S
[2019-07-21T23:33:44.226Z] [INFO] -------------------------------------------------------
[2019-07-21T23:33:44.226Z] [INFO] Running org.apache.maven.surefire.its.fixture.JUnit4SuiteTest
[2019-07-21T23:33:44.226Z] [WARNING] System property already exists '-DskipTests'. Overriding to '-DskipTests'.
[2019-07-21T23:33:44.227Z] [WARNING] System property already exists '-Dx=a'. Overriding to '-Dx=b'.
[2019-07-21T23:33:44.227Z] Using JAVA_HOME=F:\jenkins\tools\java\latest1.7 in forked launcher.
[2019-07-21T23:33:44.505Z] [INFO] Tests run: 2, Failures: 0, Errors: 0, Skipped: 0, Time elapsed: 0.105 s - in org.apache.maven.surefire.its.fixture.JUnit4SuiteTest
[2019-07-21T23:33:44.781Z] [INFO] 
[2019-07-21T23:33:44.781Z] [INFO] Results:
[2019-07-21T23:33:44.781Z] [INFO] 
[2019-07-21T23:33:44.781Z] [INFO] Tests run: 2, Failures: 0, Errors: 0, Skipped: 0
[2019-07-21T23:33:44.781Z] [INFO] 
[2019-07-21T23:33:44.781Z] [INFO] 
[2019-07-21T23:33:44.781Z] [INFO] --- maven-jar-plugin:3.1.0:jar (default-jar) @ surefire-its ---
[2019-07-21T23:33:45.746Z] [INFO] Building jar: C:\Users\jenkins\AppData\Local\Temp\2\jenkins-maven-box-maven-surefire-SUREFIRE-1675-21\surefire-its\target\surefire-its-3.0.0-SNAPSHOT.jar
[2019-07-21T23:33:50.354Z] [INFO] 
[2019-07-21T23:33:50.354Z] [INFO] --- maven-site-plugin:3.7.1:attach-descriptor (attach-descriptor) @ surefire-its ---
[2019-07-21T23:33:50.354Z] [INFO] Skipping because packaging 'jar' is not pom.
[2019-07-21T23:33:50.354Z] [INFO] 
[2019-07-21T23:33:50.354Z] [INFO] --- jacoco-maven-plugin:0.8.4:prepare-agent-integration (jacoco-agent-it) @ surefire-its ---
[2019-07-21T23:33:50.354Z] [INFO] Skipping JaCoCo execution because property jacoco.skip is set.
[2019-07-21T23:33:50.354Z] [INFO] jacoco-it.agent set to empty
[2019-07-21T23:33:50.354Z] [INFO] 
[2019-07-21T23:33:50.354Z] [INFO] --- maven-failsafe-plugin:3.0.0-M3:integration-test (default) @ surefire-its ---
[2019-07-21T23:33:50.354Z] [INFO] Downloading from central: https://repo.maven.apache.org/maven2/org/apache/maven/surefire/surefire-junit47/3.0.0-M3/surefire-junit47-3.0.0-M3.pom
[2019-07-21T23:33:50.354Z] [INFO] Downloaded from central: https://repo.maven.apache.org/maven2/org/apache/maven/surefire/surefire-junit47/3.0.0-M3/surefire-junit47-3.0.0-M3.pom (7.3 kB at 174 kB/s)
[2019-07-21T23:33:50.354Z] [INFO] Downloading from central: https://repo.maven.apache.org/maven2/org/apache/maven/surefire/surefire-providers/3.0.0-M3/surefire-providers-3.0.0-M3.pom
[2019-07-21T23:33:50.354Z] [INFO] Downloaded from central: https://repo.maven.apache.org/maven2/org/apache/maven/surefire/surefire-providers/3.0.0-M3/surefire-providers-3.0.0-M3.pom (2.5 kB at 65 kB/s)
[2019-07-21T23:33:50.354Z] [INFO] Downloading from central: https://repo.maven.apache.org/maven2/org/apache/maven/surefire/common-junit48/3.0.0-M3/common-junit48-3.0.0-M3.pom
[2019-07-21T23:33:50.354Z] [INFO] Downloaded from central: https://repo.maven.apache.org/maven2/org/apache/maven/surefire/common-junit48/3.0.0-M3/common-junit48-3.0.0-M3.pom (2.4 kB at 60 kB/s)
[2019-07-21T23:33:50.354Z] [INFO] Downloading from central: https://repo.maven.apache.org/maven2/org/apache/maven/surefire/common-junit4/3.0.0-M3/common-junit4-3.0.0-M3.pom
[2019-07-21T23:33:50.354Z] [INFO] Downloaded from central: https://repo.maven.apache.org/maven2/org/apache/maven/surefire/common-junit4/3.0.0-M3/common-junit4-3.0.0-M3.pom (1.9 kB at 51 kB/s)
[2019-07-21T23:33:50.354Z] [INFO] Downloading from central: https://repo.maven.apache.org/maven2/org/apache/maven/surefire/common-junit3/3.0.0-M3/common-junit3-3.0.0-M3.pom
[2019-07-21T23:33:50.354Z] [INFO] Downloaded from central: https://repo.maven.apache.org/maven2/org/apache/maven/surefire/common-junit3/3.0.0-M3/common-junit3-3.0.0-M3.pom (1.6 kB at 41 kB/s)
[2019-07-21T23:33:50.354Z] [INFO] Downloading from central: https://repo.maven.apache.org/maven2/org/apache/maven/surefire/common-java5/3.0.0-M3/common-java5-3.0.0-M3.pom
[2019-07-21T23:33:50.354Z] [INFO] Downloaded from central: https://repo.maven.apache.org/maven2/org/apache/maven/surefire/common-java5/3.0.0-M3/common-java5-3.0.0-M3.pom (3.1 kB at 77 kB/s)
[2019-07-21T23:33:50.354Z] [INFO] Downloading from central: https://repo.maven.apache.org/maven2/org/apache/maven/surefire/surefire-grouper/3.0.0-M3/surefire-grouper-3.0.0-M3.pom
[2019-07-21T23:33:50.354Z] [INFO] Downloaded from central: https://repo.maven.apache.org/maven2/org/apache/maven/surefire/surefire-grouper/3.0.0-M3/surefire-grouper-3.0.0-M3.pom (2.6 kB at 69 kB/s)
[2019-07-21T23:33:50.354Z] [INFO] Downloading from central: https://repo.maven.apache.org/maven2/org/apache/maven/surefire/surefire-junit47/3.0.0-M3/surefire-junit47-3.0.0-M3.jar
[2019-07-21T23:33:50.354Z] [INFO] Downloading from central: https://repo.maven.apache.org/maven2/org/apache/maven/surefire/common-java5/3.0.0-M3/common-java5-3.0.0-M3.jar
[2019-07-21T23:33:50.354Z] [INFO] Downloading from central: https://repo.maven.apache.org/maven2/org/apache/maven/surefire/common-junit4/3.0.0-M3/common-junit4-3.0.0-M3.jar
[2019-07-21T23:33:50.354Z] [INFO] Downloading from central: https://repo.maven.apache.org/maven2/org/apache/maven/surefire/common-junit3/3.0.0-M3/common-junit3-3.0.0-M3.jar
[2019-07-21T23:33:50.354Z] [INFO] Downloading from central: https://repo.maven.apache.org/maven2/org/apache/maven/surefire/common-junit48/3.0.0-M3/common-junit48-3.0.0-M3.jar
[2019-07-21T23:33:50.354Z] [INFO] Downloaded from central: https://repo.maven.apache.org/maven2/org/apache/maven/surefire/common-java5/3.0.0-M3/common-java5-3.0.0-M3.jar (32 kB at 919 kB/s)
[2019-07-21T23:33:50.354Z] [INFO] Downloaded from central: https://repo.maven.apache.org/maven2/org/apache/maven/surefire/common-junit3/3.0.0-M3/common-junit3-3.0.0-M3.jar (12 kB at 323 kB/s)
[2019-07-21T23:33:50.354Z] [INFO] Downloaded from central: https://repo.maven.apache.org/maven2/org/apache/maven/surefire/common-junit4/3.0.0-M3/common-junit4-3.0.0-M3.jar (28 kB at 724 kB/s)
[2019-07-21T23:33:50.354Z] [INFO] Downloading from central: https://repo.maven.apache.org/maven2/org/apache/maven/surefire/surefire-grouper/3.0.0-M3/surefire-grouper-3.0.0-M3.jar
[2019-07-21T23:33:50.354Z] [INFO] Downloaded from central: https://repo.maven.apache.org/maven2/org/apache/maven/surefire/common-junit48/3.0.0-M3/common-junit48-3.0.0-M3.jar (22 kB at 105 kB/s)
[2019-07-21T23:33:50.354Z] [INFO] Downloaded from central: https://repo.maven.apache.org/maven2/org/apache/maven/surefire/surefire-junit47/3.0.0-M3/surefire-junit47-3.0.0-M3.jar (93 kB at 393 kB/s)
[2019-07-21T23:33:50.354Z] [INFO] Downloaded from central: https://repo.maven.apache.org/maven2/org/apache/maven/surefire/surefire-grouper/3.0.0-M3/surefire-grouper-3.0.0-M3.jar (40 kB at 119 kB/s)
[2019-07-21T23:33:50.354Z] [INFO] Failsafe report directory: C:\Users\jenkins\AppData\Local\Temp\2\jenkins-maven-box-maven-surefire-SUREFIRE-1675-21\surefire-its\target\failsafe-reports
[2019-07-21T23:33:50.354Z] [INFO] Using configured provider org.apache.maven.surefire.junitcore.JUnitCoreProvider
[2019-07-21T23:33:50.354Z] [INFO] parallel='none', perCoreThreadCount=false, threadCount=1, useUnlimitedThreads=false, threadCountSuites=0, threadCountClasses=0, threadCountMethods=0, parallelOptimized=true
[2019-07-21T23:33:50.355Z] [INFO] 
[2019-07-21T23:33:50.355Z] [INFO] -------------------------------------------------------
[2019-07-21T23:33:50.355Z] [INFO]  T E S T S
[2019-07-21T23:33:50.355Z] [INFO] -------------------------------------------------------
[2019-07-21T23:34:08.575Z] [INFO] Running org.apache.maven.surefire.its.jiras.Surefire946KillMainProcessInReusableForkIT
[2019-07-21T23:34:55.447Z] [INFO] Tests run: 6, Failures: 0, Errors: 0, Skipped: 0, Time elapsed: 44.472 s - in org.apache.maven.surefire.its.jiras.Surefire946KillMainProcessInReusableForkIT
[2019-07-21T23:34:55.447Z] [INFO] 
[2019-07-21T23:34:55.447Z] [INFO] Results:
[2019-07-21T23:34:55.447Z] [INFO] 
[2019-07-21T23:34:55.447Z] [INFO] Tests run: 6, Failures: 0, Errors: 0, Skipped: 0
[2019-07-21T23:34:55.447Z] [INFO] 
[2019-07-21T23:34:55.447Z] [INFO] 
[2019-07-21T23:34:55.447Z] [INFO] --- maven-checkstyle-plugin:3.0.0:check (checkstyle-check) @ surefire-its ---
[2019-07-21T23:34:55.447Z] [INFO] 
[2019-07-21T23:34:55.447Z] [INFO] --- maven-failsafe-plugin:3.0.0-M3:verify (default) @ surefire-its ---
[2019-07-21T23:34:55.447Z] [INFO] Failsafe report directory: C:\Users\jenkins\AppData\Local\Temp\2\jenkins-maven-box-maven-surefire-SUREFIRE-1675-21\surefire-its\target\failsafe-reports
[2019-07-21T23:34:55.447Z] [INFO] 
[2019-07-21T23:34:55.447Z] [INFO] --- maven-install-plugin:2.5.2:install (default-install) @ surefire-its ---
[2019-07-21T23:34:55.447Z] [INFO] Skipping artifact installation
[2019-07-21T23:34:55.447Z] [INFO] ------------------------------------------------------------------------
[2019-07-21T23:34:55.447Z] [INFO] Reactor Summary for Apache Maven Surefire 3.0.0-SNAPSHOT:
[2019-07-21T23:34:55.447Z] [INFO] 
[2019-07-21T23:34:55.447Z] [INFO] Apache Maven Surefire .............................. SUCCESS [01:00 min]
[2019-07-21T23:34:55.447Z] [INFO] SureFire Logger API ................................ SUCCESS [ 23.072 s]
[2019-07-21T23:34:55.447Z] [INFO] SureFire API ....................................... SUCCESS [ 17.033 s]
[2019-07-21T23:34:55.447Z] [INFO] Surefire Extensions API ............................ SUCCESS [  2.871 s]
[2019-07-21T23:34:55.447Z] [INFO] SureFire Booter .................................... SUCCESS [ 15.202 s]
[2019-07-21T23:34:55.447Z] [INFO] Maven Surefire Test-Grouping Support ............... SUCCESS [ 11.195 s]
[2019-07-21T23:34:55.447Z] [INFO] SureFire Providers ................................. SUCCESS [  1.196 s]
[2019-07-21T23:34:55.447Z] [INFO] Shared JUnit3 Provider Code ........................ SUCCESS [  4.747 s]
[2019-07-21T23:34:55.447Z] [INFO] Shared Java 5 Provider Base ........................ SUCCESS [  6.834 s]
[2019-07-21T23:34:55.447Z] [INFO] Shared JUnit4 Provider Code ........................ SUCCESS [  6.735 s]
[2019-07-21T23:34:55.447Z] [INFO] Shared JUnit48 Provider Code ....................... SUCCESS [  7.309 s]
[2019-07-21T23:34:55.447Z] [INFO] SureFire JUnit Runner .............................. SUCCESS [  5.149 s]
[2019-07-21T23:34:55.447Z] [INFO] SureFire JUnit4 Runner ............................. SUCCESS [ 14.769 s]
[2019-07-21T23:34:55.447Z] [INFO] Maven Surefire Common .............................. SUCCESS [ 36.511 s]
[2019-07-21T23:34:55.447Z] [INFO] SureFire JUnitCore Runner .......................... SUCCESS [02:21 min]
[2019-07-21T23:34:55.447Z] [INFO] SureFire JUnit Platform Runner ..................... SUCCESS [ 11.199 s]
[2019-07-21T23:34:55.447Z] [INFO] SureFire TestNG Utils .............................. SUCCESS [  5.560 s]
[2019-07-21T23:34:55.447Z] [INFO] SureFire TestNG Runner ............................. SUCCESS [  6.888 s]
[2019-07-21T23:34:55.447Z] [INFO] ShadeFire JUnit3 Provider .......................... SUCCESS [  2.604 s]
[2019-07-21T23:34:55.447Z] [INFO] Surefire Report Parser ............................. SUCCESS [  8.156 s]
[2019-07-21T23:34:55.447Z] [INFO] Maven Surefire Plugin .............................. SUCCESS [ 15.749 s]
[2019-07-21T23:34:55.447Z] [INFO] Maven Failsafe Plugin .............................. SUCCESS [01:47 min]
[2019-07-21T23:34:55.447Z] [INFO] Maven Surefire Report Plugin ....................... SUCCESS [ 20.261 s]
[2019-07-21T23:34:55.447Z] [INFO] Maven Surefire Integration Tests ................... SUCCESS [01:48 min]
[2019-07-21T23:34:55.447Z] [INFO] ------------------------------------------------------------------------
[2019-07-21T23:34:55.447Z] [INFO] BUILD SUCCESS
[2019-07-21T23:34:55.447Z] [INFO] ------------------------------------------------------------------------
[2019-07-21T23:34:55.447Z] [INFO] Total time:  10:42 min
[2019-07-21T23:34:55.447Z] [INFO] Finished at: 2019-07-21T16:34:53-07:00
[2019-07-21T23:34:55.447Z] [INFO] ------------------------------------------------------------------------
[Pipeline] }
[Pipeline] // withEnv
[Pipeline] }
[Pipeline] // stage
[Pipeline] cleanWs
[2019-07-21T23:34:55.552Z] [WS-CLEANUP] Deleting project workspace...
[2019-07-21T23:34:55.553Z] [WS-CLEANUP] Deferred wipeout is used...
[2019-07-21T23:34:55.608Z] [WS-CLEANUP] done
[Pipeline] }
[Pipeline] // ws
[Pipeline] }
[Pipeline] // timestamps
[Pipeline] }
[Pipeline] // node
[Pipeline] }
[Pipeline] // parallel
[Pipeline] echo
hudson.AbortException: hudson.AbortException: No tool named OpenJDK 7 found
[Pipeline] echo
Build result: FAILURE
[Pipeline] jiraIssueSelector
[Pipeline] emailext