You are viewing a plain text version of this content. The canonical link for it is here.
Posted to dev@tuscany.apache.org by Ramkumar R <ra...@gmail.com> on 2008/11/14 11:33:09 UTC
BUILD ERROR: Building Apache Tuscany SCA CORBA Binding Runtime
[INFO]
------------------------------------------------------------------------
[INFO] Building Apache Tuscany SCA CORBA Binding Runtime
[INFO] task-segment: [clean, install]
[INFO]
------------------------------------------------------------------------
[INFO] [clean:clean]
[INFO] Deleting directory
C:\Tuscany\trunk\modules\binding-corba-runtime\target
[INFO] [resources:resources]
[INFO] Using default encoding to copy filtered resources.
[INFO] [compiler:compile]
[INFO] Compiling 44 source files to
C:\Tuscany\trunk\modules\binding-corba-runtime\target\classes
[INFO] [bundle:manifest {execution: bundle-manifest}]
[INFO] [resources:testResources]
[INFO] Using default encoding to copy filtered resources.
[INFO] [compiler:testCompile]
[INFO] Compiling 163 source files to
C:\Tuscany\trunk\modules\binding-corba-runtime\target\test-classes
[INFO]
------------------------------------------------------------------------
[ERROR] BUILD FAILURE
[INFO]
------------------------------------------------------------------------
[INFO] Compilation failure
C:\Tuscany\trunk\modules\binding-corba-runtime\src\test\java\org\apache\tuscany\sca\binding\corba\testing\service\mocks\
TestRuntimeWire.java:[35,7]
org.apache.tuscany.sca.binding.corba.testing.service.mocks.TestRuntimeWire
is not abstract a
nd does not override abstract method
invoke(org.apache.tuscany.sca.invocation.Message) in
org.apache.tuscany.sca.runtime.RuntimeWire
C:\Tuscany\trunk\modules\binding-corba-runtime\src\test\java\org\apache\tuscany\sca\binding\corba\testing\service\mocks\
TestRuntimeWire.java:[35,7]
org.apache.tuscany.sca.binding.corba.testing.service.mocks.TestRuntimeWire
is not abstract a
nd does not override abstract method
invoke(org.apache.tuscany.sca.invocation.Message) in
org.apache.tuscany.sca.runtime.RuntimeWire
I have raised a JIRA TUSCANY-2672.
--
Thanks & Regards,
Ramkumar Ramalingam
Re: BUILD ERROR: Building Apache Tuscany SCA CORBA Binding Runtime
Posted by Ramkumar R <ra...@gmail.com>.
Thanks Simon, this issues is now resolved.
On Fri, Nov 14, 2008 at 4:04 PM, Simon Laws <si...@googlemail.com>wrote:
>
>
> On Fri, Nov 14, 2008 at 10:33 AM, Ramkumar R <ra...@gmail.com>wrote:
>
>> [INFO]
>> ------------------------------------------------------------------------
>> [INFO] Building Apache Tuscany SCA CORBA Binding Runtime
>> [INFO] task-segment: [clean, install]
>> [INFO]
>> ------------------------------------------------------------------------
>> [INFO] [clean:clean]
>> [INFO] Deleting directory
>> C:\Tuscany\trunk\modules\binding-corba-runtime\target
>> [INFO] [resources:resources]
>> [INFO] Using default encoding to copy filtered resources.
>> [INFO] [compiler:compile]
>> [INFO] Compiling 44 source files to
>> C:\Tuscany\trunk\modules\binding-corba-runtime\target\classes
>> [INFO] [bundle:manifest {execution: bundle-manifest}]
>> [INFO] [resources:testResources]
>> [INFO] Using default encoding to copy filtered resources.
>> [INFO] [compiler:testCompile]
>> [INFO] Compiling 163 source files to
>> C:\Tuscany\trunk\modules\binding-corba-runtime\target\test-classes
>> [INFO]
>> ------------------------------------------------------------------------
>> [ERROR] BUILD FAILURE
>> [INFO]
>> ------------------------------------------------------------------------
>> [INFO] Compilation failure
>>
>> C:\Tuscany\trunk\modules\binding-corba-runtime\src\test\java\org\apache\tuscany\sca\binding\corba\testing\service\mocks\
>> TestRuntimeWire.java:[35,7]
>> org.apache.tuscany.sca.binding.corba.testing.service.mocks.TestRuntimeWire
>> is not abstract a
>> nd does not override abstract method
>> invoke(org.apache.tuscany.sca.invocation.Message) in
>> org.apache.tuscany.sca.runtime.RuntimeWire
>>
>>
>> C:\Tuscany\trunk\modules\binding-corba-runtime\src\test\java\org\apache\tuscany\sca\binding\corba\testing\service\mocks\
>> TestRuntimeWire.java:[35,7]
>> org.apache.tuscany.sca.binding.corba.testing.service.mocks.TestRuntimeWire
>> is not abstract a
>> nd does not override abstract method
>> invoke(org.apache.tuscany.sca.invocation.Message) in
>> org.apache.tuscany.sca.runtime.RuntimeWire
>>
>> I have raised a JIRA TUSCANY-2672.
>>
>> --
>> Thanks & Regards,
>> Ramkumar Ramalingam
>>
>
> I have a fix for this. Just switching over to 1.x so I can check in .
>
> Simon
>
--
Thanks & Regards,
Ramkumar Ramalingam
Re: BUILD ERROR: Building Apache Tuscany SCA CORBA Binding Runtime
Posted by Simon Laws <si...@googlemail.com>.
On Fri, Nov 14, 2008 at 10:33 AM, Ramkumar R <ra...@gmail.com> wrote:
> [INFO]
> ------------------------------------------------------------------------
> [INFO] Building Apache Tuscany SCA CORBA Binding Runtime
> [INFO] task-segment: [clean, install]
> [INFO]
> ------------------------------------------------------------------------
> [INFO] [clean:clean]
> [INFO] Deleting directory
> C:\Tuscany\trunk\modules\binding-corba-runtime\target
> [INFO] [resources:resources]
> [INFO] Using default encoding to copy filtered resources.
> [INFO] [compiler:compile]
> [INFO] Compiling 44 source files to
> C:\Tuscany\trunk\modules\binding-corba-runtime\target\classes
> [INFO] [bundle:manifest {execution: bundle-manifest}]
> [INFO] [resources:testResources]
> [INFO] Using default encoding to copy filtered resources.
> [INFO] [compiler:testCompile]
> [INFO] Compiling 163 source files to
> C:\Tuscany\trunk\modules\binding-corba-runtime\target\test-classes
> [INFO]
> ------------------------------------------------------------------------
> [ERROR] BUILD FAILURE
> [INFO]
> ------------------------------------------------------------------------
> [INFO] Compilation failure
>
> C:\Tuscany\trunk\modules\binding-corba-runtime\src\test\java\org\apache\tuscany\sca\binding\corba\testing\service\mocks\
> TestRuntimeWire.java:[35,7]
> org.apache.tuscany.sca.binding.corba.testing.service.mocks.TestRuntimeWire
> is not abstract a
> nd does not override abstract method
> invoke(org.apache.tuscany.sca.invocation.Message) in
> org.apache.tuscany.sca.runtime.RuntimeWire
>
>
> C:\Tuscany\trunk\modules\binding-corba-runtime\src\test\java\org\apache\tuscany\sca\binding\corba\testing\service\mocks\
> TestRuntimeWire.java:[35,7]
> org.apache.tuscany.sca.binding.corba.testing.service.mocks.TestRuntimeWire
> is not abstract a
> nd does not override abstract method
> invoke(org.apache.tuscany.sca.invocation.Message) in
> org.apache.tuscany.sca.runtime.RuntimeWire
>
> I have raised a JIRA TUSCANY-2672.
>
> --
> Thanks & Regards,
> Ramkumar Ramalingam
>
I have a fix for this. Just switching over to 1.x so I can check in .
Simon