You are viewing a plain text version of this content. The canonical link for it is here.
Posted to dev@lucene.apache.org by Policeman Jenkins Server <je...@thetaphi.de> on 2015/10/08 19:26:47 UTC

[JENKINS-EA] Lucene-Solr-5.x-Linux (32bit/jdk1.9.0-ea-b82) - Build # 14166 - Still Failing!

Build: http://jenkins.thetaphi.de/job/Lucene-Solr-5.x-Linux/14166/
Java: 32bit/jdk1.9.0-ea-b82 -client -XX:+UseSerialGC

1 tests failed.
FAILED:  org.apache.solr.cloud.SolrCloudExampleTest.testLoadDocsIntoGettingStartedCollection

Error Message:
Delete action failed!

Stack Trace:
java.lang.AssertionError: Delete action failed!
	at __randomizedtesting.SeedInfo.seed([30600CFFB245AF0E:23033E90832A16A8]:0)
	at org.junit.Assert.fail(Assert.java:93)
	at org.junit.Assert.assertTrue(Assert.java:43)
	at org.apache.solr.cloud.SolrCloudExampleTest.doTestDeleteAction(SolrCloudExampleTest.java:169)
	at org.apache.solr.cloud.SolrCloudExampleTest.testLoadDocsIntoGettingStartedCollection(SolrCloudExampleTest.java:145)
	at sun.reflect.NativeMethodAccessorImpl.invoke0(Native Method)
	at sun.reflect.NativeMethodAccessorImpl.invoke(NativeMethodAccessorImpl.java:62)
	at sun.reflect.DelegatingMethodAccessorImpl.invoke(DelegatingMethodAccessorImpl.java:43)
	at java.lang.reflect.Method.invoke(Method.java:519)
	at com.carrotsearch.randomizedtesting.RandomizedRunner.invoke(RandomizedRunner.java:1665)
	at com.carrotsearch.randomizedtesting.RandomizedRunner$8.evaluate(RandomizedRunner.java:864)
	at com.carrotsearch.randomizedtesting.RandomizedRunner$9.evaluate(RandomizedRunner.java:900)
	at com.carrotsearch.randomizedtesting.RandomizedRunner$10.evaluate(RandomizedRunner.java:914)
	at org.apache.solr.BaseDistributedSearchTestCase$ShardsRepeatRule$ShardsFixedStatement.callStatement(BaseDistributedSearchTestCase.java:963)
	at org.apache.solr.BaseDistributedSearchTestCase$ShardsRepeatRule$ShardsStatement.evaluate(BaseDistributedSearchTestCase.java:938)
	at com.carrotsearch.randomizedtesting.rules.SystemPropertiesRestoreRule$1.evaluate(SystemPropertiesRestoreRule.java:57)
	at org.apache.lucene.util.TestRuleSetupTeardownChained$1.evaluate(TestRuleSetupTeardownChained.java:50)
	at org.apache.lucene.util.AbstractBeforeAfterRule$1.evaluate(AbstractBeforeAfterRule.java:46)
	at org.apache.lucene.util.TestRuleThreadAndTestName$1.evaluate(TestRuleThreadAndTestName.java:49)
	at org.apache.lucene.util.TestRuleIgnoreAfterMaxFailures$1.evaluate(TestRuleIgnoreAfterMaxFailures.java:65)
	at org.apache.lucene.util.TestRuleMarkFailure$1.evaluate(TestRuleMarkFailure.java:48)
	at com.carrotsearch.randomizedtesting.rules.StatementAdapter.evaluate(StatementAdapter.java:36)
	at com.carrotsearch.randomizedtesting.ThreadLeakControl$StatementRunner.run(ThreadLeakControl.java:367)
	at com.carrotsearch.randomizedtesting.ThreadLeakControl.forkTimeoutingTask(ThreadLeakControl.java:809)
	at com.carrotsearch.randomizedtesting.ThreadLeakControl$3.evaluate(ThreadLeakControl.java:460)
	at com.carrotsearch.randomizedtesting.RandomizedRunner.runSingleTest(RandomizedRunner.java:873)
	at com.carrotsearch.randomizedtesting.RandomizedRunner$5.evaluate(RandomizedRunner.java:775)
	at com.carrotsearch.randomizedtesting.RandomizedRunner$6.evaluate(RandomizedRunner.java:809)
	at com.carrotsearch.randomizedtesting.RandomizedRunner$7.evaluate(RandomizedRunner.java:820)
	at com.carrotsearch.randomizedtesting.rules.StatementAdapter.evaluate(StatementAdapter.java:36)
	at com.carrotsearch.randomizedtesting.rules.SystemPropertiesRestoreRule$1.evaluate(SystemPropertiesRestoreRule.java:57)
	at org.apache.lucene.util.AbstractBeforeAfterRule$1.evaluate(AbstractBeforeAfterRule.java:46)
	at com.carrotsearch.randomizedtesting.rules.StatementAdapter.evaluate(StatementAdapter.java:36)
	at org.apache.lucene.util.TestRuleStoreClassName$1.evaluate(TestRuleStoreClassName.java:42)
	at com.carrotsearch.randomizedtesting.rules.NoShadowingOrOverridesOnMethodsRule$1.evaluate(NoShadowingOrOverridesOnMethodsRule.java:39)
	at com.carrotsearch.randomizedtesting.rules.NoShadowingOrOverridesOnMethodsRule$1.evaluate(NoShadowingOrOverridesOnMethodsRule.java:39)
	at com.carrotsearch.randomizedtesting.rules.StatementAdapter.evaluate(StatementAdapter.java:36)
	at com.carrotsearch.randomizedtesting.rules.StatementAdapter.evaluate(StatementAdapter.java:36)
	at com.carrotsearch.randomizedtesting.rules.StatementAdapter.evaluate(StatementAdapter.java:36)
	at org.apache.lucene.util.TestRuleAssertionsRequired$1.evaluate(TestRuleAssertionsRequired.java:54)
	at org.apache.lucene.util.TestRuleMarkFailure$1.evaluate(TestRuleMarkFailure.java:48)
	at org.apache.lucene.util.TestRuleIgnoreAfterMaxFailures$1.evaluate(TestRuleIgnoreAfterMaxFailures.java:65)
	at org.apache.lucene.util.TestRuleIgnoreTestSuites$1.evaluate(TestRuleIgnoreTestSuites.java:55)
	at com.carrotsearch.randomizedtesting.rules.StatementAdapter.evaluate(StatementAdapter.java:36)
	at com.carrotsearch.randomizedtesting.ThreadLeakControl$StatementRunner.run(ThreadLeakControl.java:367)
	at java.lang.Thread.run(Thread.java:746)




Build Log:
[...truncated 10798 lines...]
   [junit4] Suite: org.apache.solr.cloud.SolrCloudExampleTest
   [junit4]   2> Creating dataDir: /home/jenkins/workspace/Lucene-Solr-5.x-Linux/solr/build/solr-core/test/J0/temp/solr.cloud.SolrCloudExampleTest_30600CFFB245AF0E-001/init-core-data-001
   [junit4]   2> 1328280 INFO  (SUITE-SolrCloudExampleTest-seed#[30600CFFB245AF0E]-worker) [    ] o.a.s.SolrTestCaseJ4 Randomized ssl (false) and clientAuth (false)
   [junit4]   2> 1328280 INFO  (SUITE-SolrCloudExampleTest-seed#[30600CFFB245AF0E]-worker) [    ] o.a.s.BaseDistributedSearchTestCase Setting hostContext system property: /
   [junit4]   2> 1328282 INFO  (TEST-SolrCloudExampleTest.testLoadDocsIntoGettingStartedCollection-seed#[30600CFFB245AF0E]) [    ] o.a.s.c.ZkTestServer STARTING ZK TEST SERVER
   [junit4]   2> 1328282 INFO  (Thread-4209) [    ] o.a.s.c.ZkTestServer client port:0.0.0.0/0.0.0.0:0
   [junit4]   2> 1328282 INFO  (Thread-4209) [    ] o.a.s.c.ZkTestServer Starting server
   [junit4]   2> 1328382 INFO  (TEST-SolrCloudExampleTest.testLoadDocsIntoGettingStartedCollection-seed#[30600CFFB245AF0E]) [    ] o.a.s.c.ZkTestServer start zk server on port:42061
   [junit4]   2> 1328382 INFO  (TEST-SolrCloudExampleTest.testLoadDocsIntoGettingStartedCollection-seed#[30600CFFB245AF0E]) [    ] o.a.s.c.c.SolrZkClient Using default ZkCredentialsProvider
   [junit4]   2> 1328383 INFO  (TEST-SolrCloudExampleTest.testLoadDocsIntoGettingStartedCollection-seed#[30600CFFB245AF0E]) [    ] o.a.s.c.c.ConnectionManager Waiting for client to connect to ZooKeeper
   [junit4]   2> 1328384 INFO  (zkCallback-989-thread-1) [    ] o.a.s.c.c.ConnectionManager Watcher org.apache.solr.common.cloud.ConnectionManager@ea2e4b name:ZooKeeperConnection Watcher:127.0.0.1:42061 got event WatchedEvent state:SyncConnected type:None path:null path:null type:None
   [junit4]   2> 1328384 INFO  (TEST-SolrCloudExampleTest.testLoadDocsIntoGettingStartedCollection-seed#[30600CFFB245AF0E]) [    ] o.a.s.c.c.ConnectionManager Client is connected to ZooKeeper
   [junit4]   2> 1328385 INFO  (TEST-SolrCloudExampleTest.testLoadDocsIntoGettingStartedCollection-seed#[30600CFFB245AF0E]) [    ] o.a.s.c.c.SolrZkClient Using default ZkACLProvider
   [junit4]   2> 1328385 INFO  (TEST-SolrCloudExampleTest.testLoadDocsIntoGettingStartedCollection-seed#[30600CFFB245AF0E]) [    ] o.a.s.c.c.SolrZkClient makePath: /solr
   [junit4]   2> 1328386 INFO  (TEST-SolrCloudExampleTest.testLoadDocsIntoGettingStartedCollection-seed#[30600CFFB245AF0E]) [    ] o.a.s.c.c.SolrZkClient Using default ZkCredentialsProvider
   [junit4]   2> 1328386 INFO  (TEST-SolrCloudExampleTest.testLoadDocsIntoGettingStartedCollection-seed#[30600CFFB245AF0E]) [    ] o.a.s.c.c.ConnectionManager Waiting for client to connect to ZooKeeper
   [junit4]   2> 1328387 INFO  (zkCallback-990-thread-1) [    ] o.a.s.c.c.ConnectionManager Watcher org.apache.solr.common.cloud.ConnectionManager@1304fcc name:ZooKeeperConnection Watcher:127.0.0.1:42061/solr got event WatchedEvent state:SyncConnected type:None path:null path:null type:None
   [junit4]   2> 1328387 INFO  (TEST-SolrCloudExampleTest.testLoadDocsIntoGettingStartedCollection-seed#[30600CFFB245AF0E]) [    ] o.a.s.c.c.ConnectionManager Client is connected to ZooKeeper
   [junit4]   2> 1328387 INFO  (TEST-SolrCloudExampleTest.testLoadDocsIntoGettingStartedCollection-seed#[30600CFFB245AF0E]) [    ] o.a.s.c.c.SolrZkClient Using default ZkACLProvider
   [junit4]   2> 1328387 INFO  (TEST-SolrCloudExampleTest.testLoadDocsIntoGettingStartedCollection-seed#[30600CFFB245AF0E]) [    ] o.a.s.c.c.SolrZkClient makePath: /collections/collection1
   [junit4]   2> 1328388 INFO  (TEST-SolrCloudExampleTest.testLoadDocsIntoGettingStartedCollection-seed#[30600CFFB245AF0E]) [    ] o.a.s.c.c.SolrZkClient makePath: /collections/collection1/shards
   [junit4]   2> 1328389 INFO  (TEST-SolrCloudExampleTest.testLoadDocsIntoGettingStartedCollection-seed#[30600CFFB245AF0E]) [    ] o.a.s.c.c.SolrZkClient makePath: /collections/control_collection
   [junit4]   2> 1328390 INFO  (TEST-SolrCloudExampleTest.testLoadDocsIntoGettingStartedCollection-seed#[30600CFFB245AF0E]) [    ] o.a.s.c.c.SolrZkClient makePath: /collections/control_collection/shards
   [junit4]   2> 1328390 INFO  (TEST-SolrCloudExampleTest.testLoadDocsIntoGettingStartedCollection-seed#[30600CFFB245AF0E]) [    ] o.a.s.c.AbstractZkTestCase put /home/jenkins/workspace/Lucene-Solr-5.x-Linux/solr/core/src/test-files/solr/collection1/conf/solrconfig-tlog.xml to /configs/conf1/solrconfig.xml
   [junit4]   2> 1328391 INFO  (TEST-SolrCloudExampleTest.testLoadDocsIntoGettingStartedCollection-seed#[30600CFFB245AF0E]) [    ] o.a.s.c.c.SolrZkClient makePath: /configs/conf1/solrconfig.xml
   [junit4]   2> 1328392 INFO  (TEST-SolrCloudExampleTest.testLoadDocsIntoGettingStartedCollection-seed#[30600CFFB245AF0E]) [    ] o.a.s.c.AbstractZkTestCase put /home/jenkins/workspace/Lucene-Solr-5.x-Linux/solr/core/src/test-files/solr/collection1/conf/schema.xml to /configs/conf1/schema.xml
   [junit4]   2> 1328392 INFO  (TEST-SolrCloudExampleTest.testLoadDocsIntoGettingStartedCollection-seed#[30600CFFB245AF0E]) [    ] o.a.s.c.c.SolrZkClient makePath: /configs/conf1/schema.xml
   [junit4]   2> 1328393 INFO  (TEST-SolrCloudExampleTest.testLoadDocsIntoGettingStartedCollection-seed#[30600CFFB245AF0E]) [    ] o.a.s.c.AbstractZkTestCase put /home/jenkins/workspace/Lucene-Solr-5.x-Linux/solr/core/src/test-files/solr/collection1/conf/solrconfig.snippet.randomindexconfig.xml to /configs/conf1/solrconfig.snippet.randomindexconfig.xml
   [junit4]   2> 1328393 INFO  (TEST-SolrCloudExampleTest.testLoadDocsIntoGettingStartedCollection-seed#[30600CFFB245AF0E]) [    ] o.a.s.c.c.SolrZkClient makePath: /configs/conf1/solrconfig.snippet.randomindexconfig.xml
   [junit4]   2> 1328394 INFO  (TEST-SolrCloudExampleTest.testLoadDocsIntoGettingStartedCollection-seed#[30600CFFB245AF0E]) [    ] o.a.s.c.AbstractZkTestCase put /home/jenkins/workspace/Lucene-Solr-5.x-Linux/solr/core/src/test-files/solr/collection1/conf/stopwords.txt to /configs/conf1/stopwords.txt
   [junit4]   2> 1328394 INFO  (TEST-SolrCloudExampleTest.testLoadDocsIntoGettingStartedCollection-seed#[30600CFFB245AF0E]) [    ] o.a.s.c.c.SolrZkClient makePath: /configs/conf1/stopwords.txt
   [junit4]   2> 1328395 INFO  (TEST-SolrCloudExampleTest.testLoadDocsIntoGettingStartedCollection-seed#[30600CFFB245AF0E]) [    ] o.a.s.c.AbstractZkTestCase put /home/jenkins/workspace/Lucene-Solr-5.x-Linux/solr/core/src/test-files/solr/collection1/conf/protwords.txt to /configs/conf1/protwords.txt
   [junit4]   2> 1328395 INFO  (TEST-SolrCloudExampleTest.testLoadDocsIntoGettingStartedCollection-seed#[30600CFFB245AF0E]) [    ] o.a.s.c.c.SolrZkClient makePath: /configs/conf1/protwords.txt
   [junit4]   2> 1328395 INFO  (TEST-SolrCloudExampleTest.testLoadDocsIntoGettingStartedCollection-seed#[30600CFFB245AF0E]) [    ] o.a.s.c.AbstractZkTestCase put /home/jenkins/workspace/Lucene-Solr-5.x-Linux/solr/core/src/test-files/solr/collection1/conf/currency.xml to /configs/conf1/currency.xml
   [junit4]   2> 1328395 INFO  (TEST-SolrCloudExampleTest.testLoadDocsIntoGettingStartedCollection-seed#[30600CFFB245AF0E]) [    ] o.a.s.c.c.SolrZkClient makePath: /configs/conf1/currency.xml
   [junit4]   2> 1328396 INFO  (TEST-SolrCloudExampleTest.testLoadDocsIntoGettingStartedCollection-seed#[30600CFFB245AF0E]) [    ] o.a.s.c.AbstractZkTestCase put /home/jenkins/workspace/Lucene-Solr-5.x-Linux/solr/core/src/test-files/solr/collection1/conf/enumsConfig.xml to /configs/conf1/enumsConfig.xml
   [junit4]   2> 1328396 INFO  (TEST-SolrCloudExampleTest.testLoadDocsIntoGettingStartedCollection-seed#[30600CFFB245AF0E]) [    ] o.a.s.c.c.SolrZkClient makePath: /configs/conf1/enumsConfig.xml
   [junit4]   2> 1328397 INFO  (TEST-SolrCloudExampleTest.testLoadDocsIntoGettingStartedCollection-seed#[30600CFFB245AF0E]) [    ] o.a.s.c.AbstractZkTestCase put /home/jenkins/workspace/Lucene-Solr-5.x-Linux/solr/core/src/test-files/solr/collection1/conf/open-exchange-rates.json to /configs/conf1/open-exchange-rates.json
   [junit4]   2> 1328397 INFO  (TEST-SolrCloudExampleTest.testLoadDocsIntoGettingStartedCollection-seed#[30600CFFB245AF0E]) [    ] o.a.s.c.c.SolrZkClient makePath: /configs/conf1/open-exchange-rates.json
   [junit4]   2> 1328398 INFO  (TEST-SolrCloudExampleTest.testLoadDocsIntoGettingStartedCollection-seed#[30600CFFB245AF0E]) [    ] o.a.s.c.AbstractZkTestCase put /home/jenkins/workspace/Lucene-Solr-5.x-Linux/solr/core/src/test-files/solr/collection1/conf/mapping-ISOLatin1Accent.txt to /configs/conf1/mapping-ISOLatin1Accent.txt
   [junit4]   2> 1328398 INFO  (TEST-SolrCloudExampleTest.testLoadDocsIntoGettingStartedCollection-seed#[30600CFFB245AF0E]) [    ] o.a.s.c.c.SolrZkClient makePath: /configs/conf1/mapping-ISOLatin1Accent.txt
   [junit4]   2> 1328399 INFO  (TEST-SolrCloudExampleTest.testLoadDocsIntoGettingStartedCollection-seed#[30600CFFB245AF0E]) [    ] o.a.s.c.AbstractZkTestCase put /home/jenkins/workspace/Lucene-Solr-5.x-Linux/solr/core/src/test-files/solr/collection1/conf/old_synonyms.txt to /configs/conf1/old_synonyms.txt
   [junit4]   2> 1328399 INFO  (TEST-SolrCloudExampleTest.testLoadDocsIntoGettingStartedCollection-seed#[30600CFFB245AF0E]) [    ] o.a.s.c.c.SolrZkClient makePath: /configs/conf1/old_synonyms.txt
   [junit4]   2> 1328400 INFO  (TEST-SolrCloudExampleTest.testLoadDocsIntoGettingStartedCollection-seed#[30600CFFB245AF0E]) [    ] o.a.s.c.AbstractZkTestCase put /home/jenkins/workspace/Lucene-Solr-5.x-Linux/solr/core/src/test-files/solr/collection1/conf/synonyms.txt to /configs/conf1/synonyms.txt
   [junit4]   2> 1328400 INFO  (TEST-SolrCloudExampleTest.testLoadDocsIntoGettingStartedCollection-seed#[30600CFFB245AF0E]) [    ] o.a.s.c.c.SolrZkClient makePath: /configs/conf1/synonyms.txt
   [junit4]   2> 1328460 INFO  (TEST-SolrCloudExampleTest.testLoadDocsIntoGettingStartedCollection-seed#[30600CFFB245AF0E]) [    ] o.a.s.SolrTestCaseJ4 Writing core.properties file to /home/jenkins/workspace/Lucene-Solr-5.x-Linux/solr/build/solr-core/test/J0/temp/solr.cloud.SolrCloudExampleTest_30600CFFB245AF0E-001/control-001/cores/collection1
   [junit4]   2> 1328461 INFO  (TEST-SolrCloudExampleTest.testLoadDocsIntoGettingStartedCollection-seed#[30600CFFB245AF0E]) [    ] o.e.j.s.Server jetty-9.2.13.v20150730
   [junit4]   2> 1328461 INFO  (TEST-SolrCloudExampleTest.testLoadDocsIntoGettingStartedCollection-seed#[30600CFFB245AF0E]) [    ] o.e.j.s.h.ContextHandler Started o.e.j.s.ServletContextHandler@d9126e{/,null,AVAILABLE}
   [junit4]   2> 1328469 INFO  (TEST-SolrCloudExampleTest.testLoadDocsIntoGettingStartedCollection-seed#[30600CFFB245AF0E]) [    ] o.e.j.s.ServerConnector Started ServerConnector@7222f8{HTTP/1.1}{127.0.0.1:41224}
   [junit4]   2> 1328469 INFO  (TEST-SolrCloudExampleTest.testLoadDocsIntoGettingStartedCollection-seed#[30600CFFB245AF0E]) [    ] o.e.j.s.Server Started @1329766ms
   [junit4]   2> 1328469 INFO  (TEST-SolrCloudExampleTest.testLoadDocsIntoGettingStartedCollection-seed#[30600CFFB245AF0E]) [    ] o.a.s.c.s.e.JettySolrRunner Jetty properties: {solr.data.dir=/home/jenkins/workspace/Lucene-Solr-5.x-Linux/solr/build/solr-core/test/J0/temp/solr.cloud.SolrCloudExampleTest_30600CFFB245AF0E-001/tempDir-001/control/data, hostContext=/, hostPort=41224, coreRootDirectory=/home/jenkins/workspace/Lucene-Solr-5.x-Linux/solr/build/solr-core/test/J0/temp/solr.cloud.SolrCloudExampleTest_30600CFFB245AF0E-001/control-001/cores}
   [junit4]   2> 1328469 INFO  (TEST-SolrCloudExampleTest.testLoadDocsIntoGettingStartedCollection-seed#[30600CFFB245AF0E]) [    ] o.a.s.s.SolrDispatchFilter SolrDispatchFilter.init(): sun.misc.Launcher$AppClassLoader@181c5f3
   [junit4]   2> 1328470 INFO  (TEST-SolrCloudExampleTest.testLoadDocsIntoGettingStartedCollection-seed#[30600CFFB245AF0E]) [    ] o.a.s.c.SolrResourceLoader new SolrResourceLoader for directory: '/home/jenkins/workspace/Lucene-Solr-5.x-Linux/solr/build/solr-core/test/J0/temp/solr.cloud.SolrCloudExampleTest_30600CFFB245AF0E-001/control-001/'
   [junit4]   2> 1328481 INFO  (TEST-SolrCloudExampleTest.testLoadDocsIntoGettingStartedCollection-seed#[30600CFFB245AF0E]) [    ] o.a.s.c.c.SolrZkClient Using default ZkCredentialsProvider
   [junit4]   2> 1328481 INFO  (TEST-SolrCloudExampleTest.testLoadDocsIntoGettingStartedCollection-seed#[30600CFFB245AF0E]) [    ] o.a.s.c.c.ConnectionManager Waiting for client to connect to ZooKeeper
   [junit4]   2> 1328482 INFO  (zkCallback-991-thread-1) [    ] o.a.s.c.c.ConnectionManager Watcher org.apache.solr.common.cloud.ConnectionManager@12e2360 name:ZooKeeperConnection Watcher:127.0.0.1:42061/solr got event WatchedEvent state:SyncConnected type:None path:null path:null type:None
   [junit4]   2> 1328482 INFO  (TEST-SolrCloudExampleTest.testLoadDocsIntoGettingStartedCollection-seed#[30600CFFB245AF0E]) [    ] o.a.s.c.c.ConnectionManager Client is connected to ZooKeeper
   [junit4]   2> 1328483 INFO  (TEST-SolrCloudExampleTest.testLoadDocsIntoGettingStartedCollection-seed#[30600CFFB245AF0E]) [    ] o.a.s.c.c.SolrZkClient Using default ZkACLProvider
   [junit4]   2> 1328483 INFO  (TEST-SolrCloudExampleTest.testLoadDocsIntoGettingStartedCollection-seed#[30600CFFB245AF0E]) [    ] o.a.s.s.SolrDispatchFilter Loading solr.xml from SolrHome (not found in ZooKeeper)
   [junit4]   2> 1328483 INFO  (TEST-SolrCloudExampleTest.testLoadDocsIntoGettingStartedCollection-seed#[30600CFFB245AF0E]) [    ] o.a.s.c.SolrXmlConfig Loading container configuration from /home/jenkins/workspace/Lucene-Solr-5.x-Linux/solr/build/solr-core/test/J0/temp/solr.cloud.SolrCloudExampleTest_30600CFFB245AF0E-001/control-001/solr.xml
   [junit4]   2> 1328489 INFO  (TEST-SolrCloudExampleTest.testLoadDocsIntoGettingStartedCollection-seed#[30600CFFB245AF0E]) [    ] o.a.s.c.CoresLocator Config-defined core root directory: /home/jenkins/workspace/Lucene-Solr-5.x-Linux/solr/build/solr-core/test/J0/temp/solr.cloud.SolrCloudExampleTest_30600CFFB245AF0E-001/control-001/cores
   [junit4]   2> 1328489 INFO  (TEST-SolrCloudExampleTest.testLoadDocsIntoGettingStartedCollection-seed#[30600CFFB245AF0E]) [    ] o.a.s.c.CoreContainer New CoreContainer 17242077
   [junit4]   2> 1328489 INFO  (TEST-SolrCloudExampleTest.testLoadDocsIntoGettingStartedCollection-seed#[30600CFFB245AF0E]) [    ] o.a.s.c.CoreContainer Loading cores into CoreContainer [instanceDir=/home/jenkins/workspace/Lucene-Solr-5.x-Linux/solr/build/solr-core/test/J0/temp/solr.cloud.SolrCloudExampleTest_30600CFFB245AF0E-001/control-001/]
   [junit4]   2> 1328489 INFO  (TEST-SolrCloudExampleTest.testLoadDocsIntoGettingStartedCollection-seed#[30600CFFB245AF0E]) [    ] o.a.s.c.CoreContainer loading shared library: /home/jenkins/workspace/Lucene-Solr-5.x-Linux/solr/build/solr-core/test/J0/temp/solr.cloud.SolrCloudExampleTest_30600CFFB245AF0E-001/control-001/lib
   [junit4]   2> 1328489 WARN  (TEST-SolrCloudExampleTest.testLoadDocsIntoGettingStartedCollection-seed#[30600CFFB245AF0E]) [    ] o.a.s.c.SolrResourceLoader Can't find (or read) directory to add to classloader: lib (resolved as: /home/jenkins/workspace/Lucene-Solr-5.x-Linux/solr/build/solr-core/test/J0/temp/solr.cloud.SolrCloudExampleTest_30600CFFB245AF0E-001/control-001/lib).
   [junit4]   2> 1328498 INFO  (TEST-SolrCloudExampleTest.testLoadDocsIntoGettingStartedCollection-seed#[30600CFFB245AF0E]) [    ] o.a.s.h.c.HttpShardHandlerFactory created with socketTimeout : 90000,urlScheme : ,connTimeout : 15000,maxConnectionsPerHost : 20,maxConnections : 10000,corePoolSize : 0,maximumPoolSize : 2147483647,maxThreadIdleTime : 5,sizeOfQueue : -1,fairnessPolicy : false,useRetries : false,
   [junit4]   2> 1328500 INFO  (TEST-SolrCloudExampleTest.testLoadDocsIntoGettingStartedCollection-seed#[30600CFFB245AF0E]) [    ] o.a.s.u.UpdateShardHandler Creating UpdateShardHandler HTTP client with params: socketTimeout=340000&connTimeout=45000&retry=true
   [junit4]   2> 1328500 INFO  (TEST-SolrCloudExampleTest.testLoadDocsIntoGettingStartedCollection-seed#[30600CFFB245AF0E]) [    ] o.a.s.l.LogWatcher SLF4J impl is org.slf4j.impl.Log4jLoggerFactory
   [junit4]   2> 1328500 INFO  (TEST-SolrCloudExampleTest.testLoadDocsIntoGettingStartedCollection-seed#[30600CFFB245AF0E]) [    ] o.a.s.l.LogWatcher Registering Log Listener [Log4j (org.slf4j.impl.Log4jLoggerFactory)]
   [junit4]   2> 1328500 INFO  (TEST-SolrCloudExampleTest.testLoadDocsIntoGettingStartedCollection-seed#[30600CFFB245AF0E]) [    ] o.a.s.c.ZkContainer Zookeeper client=127.0.0.1:42061/solr
   [junit4]   2> 1328501 INFO  (TEST-SolrCloudExampleTest.testLoadDocsIntoGettingStartedCollection-seed#[30600CFFB245AF0E]) [    ] o.a.s.c.ZkController zkHost includes chroot
   [junit4]   2> 1328501 INFO  (TEST-SolrCloudExampleTest.testLoadDocsIntoGettingStartedCollection-seed#[30600CFFB245AF0E]) [    ] o.a.s.c.c.SolrZkClient Using default ZkCredentialsProvider
   [junit4]   2> 1328501 INFO  (TEST-SolrCloudExampleTest.testLoadDocsIntoGettingStartedCollection-seed#[30600CFFB245AF0E]) [    ] o.a.s.c.c.ConnectionManager Waiting for client to connect to ZooKeeper
   [junit4]   2> 1328502 INFO  (zkCallback-993-thread-1) [    ] o.a.s.c.c.ConnectionManager Watcher org.apache.solr.common.cloud.ConnectionManager@1bb5836 name:ZooKeeperConnection Watcher:127.0.0.1:42061 got event WatchedEvent state:SyncConnected type:None path:null path:null type:None
   [junit4]   2> 1328503 INFO  (TEST-SolrCloudExampleTest.testLoadDocsIntoGettingStartedCollection-seed#[30600CFFB245AF0E]) [    ] o.a.s.c.c.ConnectionManager Client is connected to ZooKeeper
   [junit4]   2> 1328503 INFO  (TEST-SolrCloudExampleTest.testLoadDocsIntoGettingStartedCollection-seed#[30600CFFB245AF0E]) [    ] o.a.s.c.c.SolrZkClient Using default ZkACLProvider
   [junit4]   2> 1328504 INFO  (TEST-SolrCloudExampleTest.testLoadDocsIntoGettingStartedCollection-seed#[30600CFFB245AF0E]) [n:127.0.0.1:41224_    ] o.a.s.c.c.ConnectionManager Waiting for client to connect to ZooKeeper
   [junit4]   2> 1328504 INFO  (zkCallback-994-thread-1-processing-n:127.0.0.1:41224_) [n:127.0.0.1:41224_    ] o.a.s.c.c.ConnectionManager Watcher org.apache.solr.common.cloud.ConnectionManager@1e249f4 name:ZooKeeperConnection Watcher:127.0.0.1:42061/solr got event WatchedEvent state:SyncConnected type:None path:null path:null type:None
   [junit4]   2> 1328504 INFO  (TEST-SolrCloudExampleTest.testLoadDocsIntoGettingStartedCollection-seed#[30600CFFB245AF0E]) [n:127.0.0.1:41224_    ] o.a.s.c.c.ConnectionManager Client is connected to ZooKeeper
   [junit4]   2> 1328505 INFO  (TEST-SolrCloudExampleTest.testLoadDocsIntoGettingStartedCollection-seed#[30600CFFB245AF0E]) [n:127.0.0.1:41224_    ] o.a.s.c.c.SolrZkClient makePath: /overseer/queue
   [junit4]   2> 1328506 INFO  (TEST-SolrCloudExampleTest.testLoadDocsIntoGettingStartedCollection-seed#[30600CFFB245AF0E]) [n:127.0.0.1:41224_    ] o.a.s.c.c.SolrZkClient makePath: /overseer/collection-queue-work
   [junit4]   2> 1328508 INFO  (TEST-SolrCloudExampleTest.testLoadDocsIntoGettingStartedCollection-seed#[30600CFFB245AF0E]) [n:127.0.0.1:41224_    ] o.a.s.c.c.SolrZkClient makePath: /overseer/collection-map-running
   [junit4]   2> 1328509 INFO  (TEST-SolrCloudExampleTest.testLoadDocsIntoGettingStartedCollection-seed#[30600CFFB245AF0E]) [n:127.0.0.1:41224_    ] o.a.s.c.c.SolrZkClient makePath: /overseer/collection-map-completed
   [junit4]   2> 1328509 INFO  (TEST-SolrCloudExampleTest.testLoadDocsIntoGettingStartedCollection-seed#[30600CFFB245AF0E]) [n:127.0.0.1:41224_    ] o.a.s.c.c.SolrZkClient makePath: /overseer/collection-map-failure
   [junit4]   2> 1328510 INFO  (TEST-SolrCloudExampleTest.testLoadDocsIntoGettingStartedCollection-seed#[30600CFFB245AF0E]) [n:127.0.0.1:41224_    ] o.a.s.c.c.SolrZkClient makePath: /live_nodes
   [junit4]   2> 1328511 INFO  (TEST-SolrCloudExampleTest.testLoadDocsIntoGettingStartedCollection-seed#[30600CFFB245AF0E]) [n:127.0.0.1:41224_    ] o.a.s.c.c.SolrZkClient makePath: /aliases.json
   [junit4]   2> 1328511 INFO  (TEST-SolrCloudExampleTest.testLoadDocsIntoGettingStartedCollection-seed#[30600CFFB245AF0E]) [n:127.0.0.1:41224_    ] o.a.s.c.c.SolrZkClient makePath: /clusterstate.json
   [junit4]   2> 1328512 INFO  (TEST-SolrCloudExampleTest.testLoadDocsIntoGettingStartedCollection-seed#[30600CFFB245AF0E]) [n:127.0.0.1:41224_    ] o.a.s.c.c.SolrZkClient makePath: /security.json
   [junit4]   2> 1328512 INFO  (TEST-SolrCloudExampleTest.testLoadDocsIntoGettingStartedCollection-seed#[30600CFFB245AF0E]) [n:127.0.0.1:41224_    ] o.a.s.c.ZkController Register node as live in ZooKeeper:/live_nodes/127.0.0.1:41224_
   [junit4]   2> 1328513 INFO  (TEST-SolrCloudExampleTest.testLoadDocsIntoGettingStartedCollection-seed#[30600CFFB245AF0E]) [n:127.0.0.1:41224_    ] o.a.s.c.c.SolrZkClient makePath: /live_nodes/127.0.0.1:41224_
   [junit4]   2> 1328514 INFO  (TEST-SolrCloudExampleTest.testLoadDocsIntoGettingStartedCollection-seed#[30600CFFB245AF0E]) [n:127.0.0.1:41224_    ] o.a.s.c.c.SolrZkClient makePath: /overseer_elect
   [junit4]   2> 1328514 INFO  (TEST-SolrCloudExampleTest.testLoadDocsIntoGettingStartedCollection-seed#[30600CFFB245AF0E]) [n:127.0.0.1:41224_    ] o.a.s.c.c.SolrZkClient makePath: /overseer_elect/election
   [junit4]   2> 1328515 INFO  (TEST-SolrCloudExampleTest.testLoadDocsIntoGettingStartedCollection-seed#[30600CFFB245AF0E]) [n:127.0.0.1:41224_    ] o.a.s.c.Overseer Overseer (id=null) closing
   [junit4]   2> 1328515 INFO  (TEST-SolrCloudExampleTest.testLoadDocsIntoGettingStartedCollection-seed#[30600CFFB245AF0E]) [n:127.0.0.1:41224_    ] o.a.s.c.LeaderElector Joined leadership election with path: /overseer_elect/election/94655274102554628-127.0.0.1:41224_-n_0000000000
   [junit4]   2> 1328515 INFO  (TEST-SolrCloudExampleTest.testLoadDocsIntoGettingStartedCollection-seed#[30600CFFB245AF0E]) [n:127.0.0.1:41224_    ] o.a.s.c.OverseerElectionContext I am going to be the leader 127.0.0.1:41224_
   [junit4]   2> 1328516 INFO  (TEST-SolrCloudExampleTest.testLoadDocsIntoGettingStartedCollection-seed#[30600CFFB245AF0E]) [n:127.0.0.1:41224_    ] o.a.s.c.c.SolrZkClient makePath: /overseer_elect/leader
   [junit4]   2> 1328516 INFO  (TEST-SolrCloudExampleTest.testLoadDocsIntoGettingStartedCollection-seed#[30600CFFB245AF0E]) [n:127.0.0.1:41224_    ] o.a.s.c.Overseer Overseer (id=94655274102554628-127.0.0.1:41224_-n_0000000000) starting
   [junit4]   2> 1328517 INFO  (TEST-SolrCloudExampleTest.testLoadDocsIntoGettingStartedCollection-seed#[30600CFFB245AF0E]) [n:127.0.0.1:41224_    ] o.a.s.c.c.SolrZkClient makePath: /overseer/queue-work
   [junit4]   2> 1328520 INFO  (TEST-SolrCloudExampleTest.testLoadDocsIntoGettingStartedCollection-seed#[30600CFFB245AF0E]) [n:127.0.0.1:41224_    ] o.a.s.c.OverseerAutoReplicaFailoverThread Starting OverseerAutoReplicaFailoverThread autoReplicaFailoverWorkLoopDelay=10000 autoReplicaFailoverWaitAfterExpiration=30000 autoReplicaFailoverBadNodeExpiration=60000
   [junit4]   2> 1328521 INFO  (OverseerCollectionConfigSetProcessor-94655274102554628-127.0.0.1:41224_-n_0000000000) [n:127.0.0.1:41224_    ] o.a.s.c.OverseerTaskProcessor Process current queue of overseer operations
   [junit4]   2> 1328521 INFO  (TEST-SolrCloudExampleTest.testLoadDocsIntoGettingStartedCollection-seed#[30600CFFB245AF0E]) [n:127.0.0.1:41224_    ] o.a.s.c.c.ZkStateReader Updating cluster state from ZooKeeper... 
   [junit4]   2> 1328521 INFO  (OverseerStateUpdate-94655274102554628-127.0.0.1:41224_-n_0000000000) [n:127.0.0.1:41224_    ] o.a.s.c.Overseer Starting to work on the main queue
   [junit4]   2> 1328591 INFO  (TEST-SolrCloudExampleTest.testLoadDocsIntoGettingStartedCollection-seed#[30600CFFB245AF0E]) [n:127.0.0.1:41224_    ] o.a.s.c.CoreContainer Security conf doesn't exist. Skipping setup for authorization module.
   [junit4]   2> 1328591 INFO  (TEST-SolrCloudExampleTest.testLoadDocsIntoGettingStartedCollection-seed#[30600CFFB245AF0E]) [n:127.0.0.1:41224_    ] o.a.s.c.CoreContainer No authentication plugin used.
   [junit4]   2> 1328592 INFO  (TEST-SolrCloudExampleTest.testLoadDocsIntoGettingStartedCollection-seed#[30600CFFB245AF0E]) [n:127.0.0.1:41224_    ] o.a.s.c.CoresLocator Looking for core definitions underneath /home/jenkins/workspace/Lucene-Solr-5.x-Linux/solr/build/solr-core/test/J0/temp/solr.cloud.SolrCloudExampleTest_30600CFFB245AF0E-001/control-001/cores
   [junit4]   2> 1328592 INFO  (TEST-SolrCloudExampleTest.testLoadDocsIntoGettingStartedCollection-seed#[30600CFFB245AF0E]) [n:127.0.0.1:41224_    ] o.a.s.c.SolrCore Created CoreDescriptor: {name=collection1, config=solrconfig.xml, transient=false, schema=schema.xml, loadOnStartup=true, configSetProperties=configsetprops.json, instanceDir=/home/jenkins/workspace/Lucene-Solr-5.x-Linux/solr/build/solr-core/test/J0/temp/solr.cloud.SolrCloudExampleTest_30600CFFB245AF0E-001/control-001/cores/collection1, collection=control_collection, absoluteInstDir=/home/jenkins/workspace/Lucene-Solr-5.x-Linux/solr/build/solr-core/test/J0/temp/solr.cloud.SolrCloudExampleTest_30600CFFB245AF0E-001/control-001/cores/collection1/, coreNodeName=, dataDir=data/, shard=}
   [junit4]   2> 1328592 INFO  (TEST-SolrCloudExampleTest.testLoadDocsIntoGettingStartedCollection-seed#[30600CFFB245AF0E]) [n:127.0.0.1:41224_    ] o.a.s.c.CoresLocator Found core collection1 in /home/jenkins/workspace/Lucene-Solr-5.x-Linux/solr/build/solr-core/test/J0/temp/solr.cloud.SolrCloudExampleTest_30600CFFB245AF0E-001/control-001/cores/collection1/
   [junit4]   2> 1328592 INFO  (TEST-SolrCloudExampleTest.testLoadDocsIntoGettingStartedCollection-seed#[30600CFFB245AF0E]) [n:127.0.0.1:41224_    ] o.a.s.c.CoresLocator Found 1 core definitions
   [junit4]   2> 1328593 INFO  (TEST-SolrCloudExampleTest.testLoadDocsIntoGettingStartedCollection-seed#[30600CFFB245AF0E]) [n:127.0.0.1:41224_    ] o.a.s.s.SolrDispatchFilter user.dir=/home/jenkins/workspace/Lucene-Solr-5.x-Linux/solr/build/solr-core/test/J0
   [junit4]   2> 1328593 INFO  (TEST-SolrCloudExampleTest.testLoadDocsIntoGettingStartedCollection-seed#[30600CFFB245AF0E]) [n:127.0.0.1:41224_    ] o.a.s.s.SolrDispatchFilter SolrDispatchFilter.init() done
   [junit4]   2> 1328593 INFO  (coreLoadExecutor-4253-thread-1-processing-n:127.0.0.1:41224_) [n:127.0.0.1:41224_ c:control_collection   x:collection1] o.a.s.c.ZkController publishing state=down
   [junit4]   2> 1328593 INFO  (coreLoadExecutor-4253-thread-1-processing-n:127.0.0.1:41224_) [n:127.0.0.1:41224_ c:control_collection   x:collection1] o.a.s.c.ZkController numShards not found on descriptor - reading it from system property
   [junit4]   2> 1328594 INFO  (OverseerStateUpdate-94655274102554628-127.0.0.1:41224_-n_0000000000) [n:127.0.0.1:41224_    ] o.a.s.c.Overseer processMessage: queueSize: 1, message = {
   [junit4]   2>   "core":"collection1",
   [junit4]   2>   "roles":null,
   [junit4]   2>   "base_url":"http://127.0.0.1:41224",
   [junit4]   2>   "node_name":"127.0.0.1:41224_",
   [junit4]   2>   "numShards":"1",
   [junit4]   2>   "state":"down",
   [junit4]   2>   "shard":null,
   [junit4]   2>   "collection":"control_collection",
   [junit4]   2>   "operation":"state"} current state version: 0
   [junit4]   2> 1328594 INFO  (coreLoadExecutor-4253-thread-1-processing-n:127.0.0.1:41224_) [n:127.0.0.1:41224_ c:control_collection   x:collection1] o.a.s.c.ZkController look for our core node name
   [junit4]   2> 1328594 INFO  (OverseerStateUpdate-94655274102554628-127.0.0.1:41224_-n_0000000000) [n:127.0.0.1:41224_    ] o.a.s.c.o.ReplicaMutator Update state numShards=1 message={
   [junit4]   2>   "core":"collection1",
   [junit4]   2>   "roles":null,
   [junit4]   2>   "base_url":"http://127.0.0.1:41224",
   [junit4]   2>   "node_name":"127.0.0.1:41224_",
   [junit4]   2>   "numShards":"1",
   [junit4]   2>   "state":"down",
   [junit4]   2>   "shard":null,
   [junit4]   2>   "collection":"control_collection",
   [junit4]   2>   "operation":"state"}
   [junit4]   2> 1328595 INFO  (OverseerStateUpdate-94655274102554628-127.0.0.1:41224_-n_0000000000) [n:127.0.0.1:41224_    ] o.a.s.c.o.ClusterStateMutator building a new cName: control_collection
   [junit4]   2> 1328595 INFO  (OverseerStateUpdate-94655274102554628-127.0.0.1:41224_-n_0000000000) [n:127.0.0.1:41224_    ] o.a.s.c.o.ReplicaMutator Assigning new node to shard shard=shard1
   [junit4]   2> 1328596 INFO  (zkCallback-994-thread-1-processing-n:127.0.0.1:41224_) [n:127.0.0.1:41224_    ] o.a.s.c.c.ZkStateReader A cluster state change: WatchedEvent state:SyncConnected type:NodeDataChanged path:/clusterstate.json, has occurred - updating... (live nodes size: 1)
   [junit4]   2> 1329595 INFO  (coreLoadExecutor-4253-thread-1-processing-n:127.0.0.1:41224_) [n:127.0.0.1:41224_ c:control_collection   x:collection1] o.a.s.c.ZkController waiting to find shard id in clusterstate for collection1
   [junit4]   2> 1329595 INFO  (coreLoadExecutor-4253-thread-1-processing-n:127.0.0.1:41224_) [n:127.0.0.1:41224_ c:control_collection   x:collection1] o.a.s.c.ZkController Check for collection zkNode:control_collection
   [junit4]   2> 1329595 INFO  (coreLoadExecutor-4253-thread-1-processing-n:127.0.0.1:41224_) [n:127.0.0.1:41224_ c:control_collection   x:collection1] o.a.s.c.ZkController Collection zkNode exists
   [junit4]   2> 1329595 INFO  (coreLoadExecutor-4253-thread-1-processing-n:127.0.0.1:41224_) [n:127.0.0.1:41224_ c:control_collection   x:collection1] o.a.s.c.c.ZkStateReader Load collection config from:/collections/control_collection
   [junit4]   2> 1329595 INFO  (coreLoadExecutor-4253-thread-1-processing-n:127.0.0.1:41224_) [n:127.0.0.1:41224_ c:control_collection   x:collection1] o.a.s.c.c.ZkStateReader path=/collections/control_collection configName=conf1 specified config exists in ZooKeeper
   [junit4]   2> 1329596 INFO  (coreLoadExecutor-4253-thread-1-processing-n:127.0.0.1:41224_) [n:127.0.0.1:41224_ c:control_collection   x:collection1] o.a.s.c.SolrResourceLoader new SolrResourceLoader for directory: '/home/jenkins/workspace/Lucene-Solr-5.x-Linux/solr/build/solr-core/test/J0/temp/solr.cloud.SolrCloudExampleTest_30600CFFB245AF0E-001/control-001/cores/collection1/'
   [junit4]   2> 1329605 INFO  (coreLoadExecutor-4253-thread-1-processing-n:127.0.0.1:41224_) [n:127.0.0.1:41224_ c:control_collection   x:collection1] o.a.s.c.Config loaded config solrconfig.xml with version 0 
   [junit4]   2> 1329610 INFO  (coreLoadExecutor-4253-thread-1-processing-n:127.0.0.1:41224_) [n:127.0.0.1:41224_ c:control_collection   x:collection1] o.a.s.c.SolrConfig current version of requestparams : -1
   [junit4]   2> 1329615 INFO  (coreLoadExecutor-4253-thread-1-processing-n:127.0.0.1:41224_) [n:127.0.0.1:41224_ c:control_collection   x:collection1] o.a.s.c.SolrConfig Using Lucene MatchVersion: 5.4.0
   [junit4]   2> 1329622 INFO  (coreLoadExecutor-4253-thread-1-processing-n:127.0.0.1:41224_) [n:127.0.0.1:41224_ c:control_collection   x:collection1] o.a.s.c.Config Loaded SolrConfig: solrconfig.xml
   [junit4]   2> 1329623 INFO  (coreLoadExecutor-4253-thread-1-processing-n:127.0.0.1:41224_) [n:127.0.0.1:41224_ c:control_collection   x:collection1] o.a.s.s.IndexSchema Reading Solr Schema from /configs/conf1/schema.xml
   [junit4]   2> 1329628 INFO  (coreLoadExecutor-4253-thread-1-processing-n:127.0.0.1:41224_) [n:127.0.0.1:41224_ c:control_collection   x:collection1] o.a.s.s.IndexSchema [collection1] Schema name=test
   [junit4]   2> 1329738 INFO  (coreLoadExecutor-4253-thread-1-processing-n:127.0.0.1:41224_) [n:127.0.0.1:41224_ c:control_collection   x:collection1] o.a.s.s.OpenExchangeRatesOrgProvider Initialized with rates=open-exchange-rates.json, refreshInterval=1440.
   [junit4]   2> 1329742 INFO  (coreLoadExecutor-4253-thread-1-processing-n:127.0.0.1:41224_) [n:127.0.0.1:41224_ c:control_collection   x:collection1] o.a.s.s.IndexSchema default search field in schema is text
   [junit4]   2> 1329743 INFO  (coreLoadExecutor-4253-thread-1-processing-n:127.0.0.1:41224_) [n:127.0.0.1:41224_ c:control_collection   x:collection1] o.a.s.s.IndexSchema unique key field: id
   [junit4]   2> 1329749 INFO  (coreLoadExecutor-4253-thread-1-processing-n:127.0.0.1:41224_) [n:127.0.0.1:41224_ c:control_collection   x:collection1] o.a.s.s.FileExchangeRateProvider Reloading exchange rates from file currency.xml
   [junit4]   2> 1329751 INFO  (coreLoadExecutor-4253-thread-1-processing-n:127.0.0.1:41224_) [n:127.0.0.1:41224_ c:control_collection   x:collection1] o.a.s.s.FileExchangeRateProvider Reloading exchange rates from file currency.xml
   [junit4]   2> 1329752 INFO  (coreLoadExecutor-4253-thread-1-processing-n:127.0.0.1:41224_) [n:127.0.0.1:41224_ c:control_collection   x:collection1] o.a.s.s.OpenExchangeRatesOrgProvider Reloading exchange rates from open-exchange-rates.json
   [junit4]   2> 1329753 WARN  (coreLoadExecutor-4253-thread-1-processing-n:127.0.0.1:41224_) [n:127.0.0.1:41224_ c:control_collection   x:collection1] o.a.s.s.OpenExchangeRatesOrgProvider Unknown key IMPORTANT NOTE
   [junit4]   2> 1329753 WARN  (coreLoadExecutor-4253-thread-1-processing-n:127.0.0.1:41224_) [n:127.0.0.1:41224_ c:control_collection   x:collection1] o.a.s.s.OpenExchangeRatesOrgProvider Expected key, got STRING
   [junit4]   2> 1329753 INFO  (coreLoadExecutor-4253-thread-1-processing-n:127.0.0.1:41224_) [n:127.0.0.1:41224_ c:control_collection   x:collection1] o.a.s.s.OpenExchangeRatesOrgProvider Reloading exchange rates from open-exchange-rates.json
   [junit4]   2> 1329753 WARN  (coreLoadExecutor-4253-thread-1-processing-n:127.0.0.1:41224_) [n:127.0.0.1:41224_ c:control_collection   x:collection1] o.a.s.s.OpenExchangeRatesOrgProvider Unknown key IMPORTANT NOTE
   [junit4]   2> 1329753 WARN  (coreLoadExecutor-4253-thread-1-processing-n:127.0.0.1:41224_) [n:127.0.0.1:41224_ c:control_collection   x:collection1] o.a.s.s.OpenExchangeRatesOrgProvider Expected key, got STRING
   [junit4]   2> 1329754 INFO  (coreLoadExecutor-4253-thread-1-processing-n:127.0.0.1:41224_) [n:127.0.0.1:41224_ c:control_collection   x:collection1] o.a.s.c.ConfigSetProperties Did not find ConfigSet properties, assuming default properties: Can't find resource 'configsetprops.json' in classpath or '/configs/conf1', cwd=/home/jenkins/workspace/Lucene-Solr-5.x-Linux/solr/build/solr-core/test/J0
   [junit4]   2> 1329754 INFO  (coreLoadExecutor-4253-thread-1-processing-n:127.0.0.1:41224_) [n:127.0.0.1:41224_ c:control_collection   x:collection1] o.a.s.c.CoreContainer Creating SolrCore 'collection1' using configuration from collection control_collection
   [junit4]   2> 1329754 INFO  (coreLoadExecutor-4253-thread-1-processing-n:127.0.0.1:41224_) [n:127.0.0.1:41224_ c:control_collection s:shard1 r:core_node1 x:collection1] o.a.s.c.SolrCore org.apache.solr.core.MockDirectoryFactory
   [junit4]   2> 1329754 INFO  (coreLoadExecutor-4253-thread-1-processing-n:127.0.0.1:41224_) [n:127.0.0.1:41224_ c:control_collection s:shard1 r:core_node1 x:collection1] o.a.s.c.SolrCore [[collection1] ] Opening new SolrCore at [/home/jenkins/workspace/Lucene-Solr-5.x-Linux/solr/build/solr-core/test/J0/temp/solr.cloud.SolrCloudExampleTest_30600CFFB245AF0E-001/control-001/cores/collection1/], dataDir=[null]
   [junit4]   2> 1329755 INFO  (coreLoadExecutor-4253-thread-1-processing-n:127.0.0.1:41224_) [n:127.0.0.1:41224_ c:control_collection s:shard1 r:core_node1 x:collection1] o.a.s.c.JmxMonitoredMap JMX monitoring is enabled. Adding Solr mbeans to JMX Server: com.sun.jmx.mbeanserver.JmxMBeanServer@1c4b8ba
   [junit4]   2> 1329755 INFO  (coreLoadExecutor-4253-thread-1-processing-n:127.0.0.1:41224_) [n:127.0.0.1:41224_ c:control_collection s:shard1 r:core_node1 x:collection1] o.a.s.c.CachingDirectoryFactory return new directory for /home/jenkins/workspace/Lucene-Solr-5.x-Linux/solr/build/solr-core/test/J0/temp/solr.cloud.SolrCloudExampleTest_30600CFFB245AF0E-001/control-001/cores/collection1/data
   [junit4]   2> 1329755 INFO  (coreLoadExecutor-4253-thread-1-processing-n:127.0.0.1:41224_) [n:127.0.0.1:41224_ c:control_collection s:shard1 r:core_node1 x:collection1] o.a.s.c.SolrCore New index directory detected: old=null new=/home/jenkins/workspace/Lucene-Solr-5.x-Linux/solr/build/solr-core/test/J0/temp/solr.cloud.SolrCloudExampleTest_30600CFFB245AF0E-001/control-001/cores/collection1/data/index/
   [junit4]   2> 1329755 WARN  (coreLoadExecutor-4253-thread-1-processing-n:127.0.0.1:41224_) [n:127.0.0.1:41224_ c:control_collection s:shard1 r:core_node1 x:collection1] o.a.s.c.SolrCore [collection1] Solr index directory '/home/jenkins/workspace/Lucene-Solr-5.x-Linux/solr/build/solr-core/test/J0/temp/solr.cloud.SolrCloudExampleTest_30600CFFB245AF0E-001/control-001/cores/collection1/data/index' doesn't exist. Creating new index...
   [junit4]   2> 1329755 INFO  (coreLoadExecutor-4253-thread-1-processing-n:127.0.0.1:41224_) [n:127.0.0.1:41224_ c:control_collection s:shard1 r:core_node1 x:collection1] o.a.s.c.CachingDirectoryFactory return new directory for /home/jenkins/workspace/Lucene-Solr-5.x-Linux/solr/build/solr-core/test/J0/temp/solr.cloud.SolrCloudExampleTest_30600CFFB245AF0E-001/control-001/cores/collection1/data/index
   [junit4]   2> 1329756 INFO  (coreLoadExecutor-4253-thread-1-processing-n:127.0.0.1:41224_) [n:127.0.0.1:41224_ c:control_collection s:shard1 r:core_node1 x:collection1] o.a.s.u.RandomMergePolicy RandomMergePolicy wrapping class org.apache.lucene.index.TieredMergePolicy: [TieredMergePolicy: maxMergeAtOnce=28, maxMergeAtOnceExplicit=13, maxMergedSegmentMB=12.2392578125, floorSegmentMB=1.0419921875, forceMergeDeletesPctAllowed=26.331537933919396, segmentsPerTier=44.0, maxCFSSegmentSizeMB=8.796093022207999E12, noCFSRatio=0.10933649967272041
   [junit4]   2> 1329756 INFO  (coreLoadExecutor-4253-thread-1-processing-n:127.0.0.1:41224_) [n:127.0.0.1:41224_ c:control_collection s:shard1 r:core_node1 x:collection1] o.a.s.c.SolrCore SolrDeletionPolicy.onCommit: commits: num=1
   [junit4]   2> 	commit{dir=MockDirectoryWrapper(RAMDirectory@6c2df3 lockFactory=org.apache.lucene.store.SingleInstanceLockFactory@197fbf3),segFN=segments_1,generation=1}
   [junit4]   2> 1329756 INFO  (coreLoadExecutor-4253-thread-1-processing-n:127.0.0.1:41224_) [n:127.0.0.1:41224_ c:control_collection s:shard1 r:core_node1 x:collection1] o.a.s.c.SolrCore newest commit generation = 1
   [junit4]   2> 1329756 INFO  (OldIndexDirectoryCleanupThreadForCore-collection1) [n:127.0.0.1:41224_ c:control_collection s:shard1 r:core_node1 x:collection1] o.a.s.c.SolrCore Looking for old index directories to cleanup for core collection1 in /home/jenkins/workspace/Lucene-Solr-5.x-Linux/solr/build/solr-core/test/J0/temp/solr.cloud.SolrCloudExampleTest_30600CFFB245AF0E-001/control-001/cores/collection1/data/
   [junit4]   2> 1329756 WARN  (OldIndexDirectoryCleanupThreadForCore-collection1) [n:127.0.0.1:41224_ c:control_collection s:shard1 r:core_node1 x:collection1] o.a.s.c.DirectoryFactory /home/jenkins/workspace/Lucene-Solr-5.x-Linux/solr/build/solr-core/test/J0/temp/solr.cloud.SolrCloudExampleTest_30600CFFB245AF0E-001/control-001/cores/collection1/data/ does not point to a valid data directory; skipping clean-up of old index directories.
   [junit4]   2> 1329758 INFO  (coreLoadExecutor-4253-thread-1-processing-n:127.0.0.1:41224_) [n:127.0.0.1:41224_ c:control_collection s:shard1 r:core_node1 x:collection1] o.a.s.u.p.UpdateRequestProcessorChain creating updateRequestProcessorChain "nodistrib"
   [junit4]   2> 1329758 INFO  (coreLoadExecutor-4253-thread-1-processing-n:127.0.0.1:41224_) [n:127.0.0.1:41224_ c:control_collection s:shard1 r:core_node1 x:collection1] o.a.s.u.p.UpdateRequestProcessorChain creating updateRequestProcessorChain "dedupe"
   [junit4]   2> 1329758 INFO  (coreLoadExecutor-4253-thread-1-processing-n:127.0.0.1:41224_) [n:127.0.0.1:41224_ c:control_collection s:shard1 r:core_node1 x:collection1] o.a.s.u.p.UpdateRequestProcessorChain inserting DistributedUpdateProcessorFactory into updateRequestProcessorChain "dedupe"
   [junit4]   2> 1329759 INFO  (coreLoadExecutor-4253-thread-1-processing-n:127.0.0.1:41224_) [n:127.0.0.1:41224_ c:control_collection s:shard1 r:core_node1 x:collection1] o.a.s.u.p.UpdateRequestProcessorChain creating updateRequestProcessorChain "stored_sig"
   [junit4]   2> 1329759 INFO  (coreLoadExecutor-4253-thread-1-processing-n:127.0.0.1:41224_) [n:127.0.0.1:41224_ c:control_collection s:shard1 r:core_node1 x:collection1] o.a.s.u.p.UpdateRequestProcessorChain inserting DistributedUpdateProcessorFactory into updateRequestProcessorChain "stored_sig"
   [junit4]   2> 1329759 INFO  (coreLoadExecutor-4253-thread-1-processing-n:127.0.0.1:41224_) [n:127.0.0.1:41224_ c:control_collection s:shard1 r:core_node1 x:collection1] o.a.s.u.p.UpdateRequestProcessorChain creating updateRequestProcessorChain "distrib-dup-test-chain-explicit"
   [junit4]   2> 1329759 INFO  (coreLoadExecutor-4253-thread-1-processing-n:127.0.0.1:41224_) [n:127.0.0.1:41224_ c:control_collection s:shard1 r:core_node1 x:collection1] o.a.s.u.p.UpdateRequestProcessorChain creating updateRequestProcessorChain "distrib-dup-test-chain-implicit"
   [junit4]   2> 1329759 INFO  (coreLoadExecutor-4253-thread-1-processing-n:127.0.0.1:41224_) [n:127.0.0.1:41224_ c:control_collection s:shard1 r:core_node1 x:collection1] o.a.s.u.p.UpdateRequestProcessorChain inserting DistributedUpdateProcessorFactory into updateRequestProcessorChain "distrib-dup-test-chain-implicit"
   [junit4]   2> 1329759 INFO  (coreLoadExecutor-4253-thread-1-processing-n:127.0.0.1:41224_) [n:127.0.0.1:41224_ c:control_collection s:shard1 r:core_node1 x:collection1] o.a.s.c.SolrCore no updateRequestProcessorChain defined as default, creating implicit default
   [junit4]   2> 1329760 INFO  (coreLoadExecutor-4253-thread-1-processing-n:127.0.0.1:41224_) [n:127.0.0.1:41224_ c:control_collection s:shard1 r:core_node1 x:collection1] o.a.s.h.l.XMLLoader xsltCacheLifetimeSeconds=60
   [junit4]   2> 1329761 INFO  (coreLoadExecutor-4253-thread-1-processing-n:127.0.0.1:41224_) [n:127.0.0.1:41224_ c:control_collection s:shard1 r:core_node1 x:collection1] o.a.s.h.l.XMLLoader xsltCacheLifetimeSeconds=60
   [junit4]   2> 1329762 INFO  (coreLoadExecutor-4253-thread-1-processing-n:127.0.0.1:41224_) [n:127.0.0.1:41224_ c:control_collection s:shard1 r:core_node1 x:collection1] o.a.s.h.l.XMLLoader xsltCacheLifetimeSeconds=60
   [junit4]   2> 1329763 INFO  (coreLoadExecutor-4253-thread-1-processing-n:127.0.0.1:41224_) [n:127.0.0.1:41224_ c:control_collection s:shard1 r:core_node1 x:collection1] o.a.s.h.l.XMLLoader xsltCacheLifetimeSeconds=60
   [junit4]   2> 1329765 INFO  (coreLoadExecutor-4253-thread-1-processing-n:127.0.0.1:41224_) [n:127.0.0.1:41224_ c:control_collection s:shard1 r:core_node1 x:collection1] o.a.s.c.RequestHandlers Registered paths: /admin/mbeans,standard,/update/csv,/update/json/docs,/admin/luke,/admin/segments,/get,/admin/system,/replication,/admin/properties,/config,/schema,/admin/plugins,/admin/logging,/update/json,/admin/threads,/admin/ping,/update,/admin/file
   [junit4]   2> 1329765 INFO  (coreLoadExecutor-4253-thread-1-processing-n:127.0.0.1:41224_) [n:127.0.0.1:41224_ c:control_collection s:shard1 r:core_node1 x:collection1] o.a.s.c.SolrCore Using default statsCache cache: org.apache.solr.search.stats.LocalStatsCache
   [junit4]   2> 1329765 INFO  (coreLoadExecutor-4253-thread-1-processing-n:127.0.0.1:41224_) [n:127.0.0.1:41224_ c:control_collection s:shard1 r:core_node1 x:collection1] o.a.s.u.UpdateHandler Using UpdateLog implementation: org.apache.solr.update.UpdateLog
   [junit4]   2> 1329766 INFO  (coreLoadExecutor-4253-thread-1-processing-n:127.0.0.1:41224_) [n:127.0.0.1:41224_ c:control_collection s:shard1 r:core_node1 x:collection1] o.a.s.u.UpdateLog Initializing UpdateLog: dataDir= defaultSyncLevel=FLUSH numRecordsToKeep=100 maxNumLogsToKeep=10 numVersionBuckets=65536
   [junit4]   2> 1329766 INFO  (coreLoadExecutor-4253-thread-1-processing-n:127.0.0.1:41224_) [n:127.0.0.1:41224_ c:control_collection s:shard1 r:core_node1 x:collection1] o.a.s.c.SolrCore Hard AutoCommit: disabled
   [junit4]   2> 1329766 INFO  (coreLoadExecutor-4253-thread-1-processing-n:127.0.0.1:41224_) [n:127.0.0.1:41224_ c:control_collection s:shard1 r:core_node1 x:collection1] o.a.s.c.SolrCore Soft AutoCommit: disabled
   [junit4]   2> 1329766 INFO  (coreLoadExecutor-4253-thread-1-processing-n:127.0.0.1:41224_) [n:127.0.0.1:41224_ c:control_collection s:shard1 r:core_node1 x:collection1] o.a.s.u.RandomMergePolicy RandomMergePolicy wrapping class org.apache.lucene.index.LogByteSizeMergePolicy: [LogByteSizeMergePolicy: minMergeSize=1677721, mergeFactor=21, maxMergeSize=2147483648, maxMergeSizeForForcedMerge=9223372036854775807, calibrateSizeByDeletes=false, maxMergeDocs=2147483647, maxCFSSegmentSizeMB=8.796093022207999E12, noCFSRatio=0.7366803562022702]
   [junit4]   2> 1329767 INFO  (coreLoadExecutor-4253-thread-1-processing-n:127.0.0.1:41224_) [n:127.0.0.1:41224_ c:control_collection s:shard1 r:core_node1 x:collection1] o.a.s.c.SolrCore SolrDeletionPolicy.onInit: commits: num=1
   [junit4]   2> 	commit{dir=MockDirectoryWrapper(RAMDirectory@6c2df3 lockFactory=org.apache.lucene.store.SingleInstanceLockFactory@197fbf3),segFN=segments_1,generation=1}
   [junit4]   2> 1329767 INFO  (coreLoadExecutor-4253-thread-1-processing-n:127.0.0.1:41224_) [n:127.0.0.1:41224_ c:control_collection s:shard1 r:core_node1 x:collection1] o.a.s.c.SolrCore newest commit generation = 1
   [junit4]   2> 1329767 INFO  (coreLoadExecutor-4253-thread-1-processing-n:127.0.0.1:41224_) [n:127.0.0.1:41224_ c:control_collection s:shard1 r:core_node1 x:collection1] o.a.s.s.SolrIndexSearcher Opening Searcher@197403f[collection1] main
   [junit4]   2> 1329767 INFO  (coreLoadExecutor-4253-thread-1-processing-n:127.0.0.1:41224_) [n:127.0.0.1:41224_ c:control_collection s:shard1 r:core_node1 x:collection1] o.a.s.c.c.ZkStateReader Load collection config from:/collections/control_collection
   [junit4]   2> 1329767 INFO  (coreLoadExecutor-4253-thread-1-processing-n:127.0.0.1:41224_) [n:127.0.0.1:41224_ c:control_collection s:shard1 r:core_node1 x:collection1] o.a.s.c.c.ZkStateReader path=/collections/control_collection configName=conf1 specified config exists in ZooKeeper
   [junit4]   2> 1329767 INFO  (coreLoadExecutor-4253-thread-1-processing-n:127.0.0.1:41224_) [n:127.0.0.1:41224_ c:control_collection s:shard1 r:core_node1 x:collection1] o.a.s.r.ManagedResourceStorage Setting up ZooKeeper-based storage for the RestManager with znodeBase: /configs/conf1
   [junit4]   2> 1329767 INFO  (coreLoadExecutor-4253-thread-1-processing-n:127.0.0.1:41224_) [n:127.0.0.1:41224_ c:control_collection s:shard1 r:core_node1 x:collection1] o.a.s.r.ManagedResourceStorage Configured ZooKeeperStorageIO with znodeBase: /configs/conf1
   [junit4]   2> 1329767 INFO  (coreLoadExecutor-4253-thread-1-processing-n:127.0.0.1:41224_) [n:127.0.0.1:41224_ c:control_collection s:shard1 r:core_node1 x:collection1] o.a.s.r.RestManager Initializing RestManager with initArgs: {}
   [junit4]   2> 1329768 INFO  (coreLoadExecutor-4253-thread-1-processing-n:127.0.0.1:41224_) [n:127.0.0.1:41224_ c:control_collection s:shard1 r:core_node1 x:collection1] o.a.s.r.ManagedResourceStorage Reading _rest_managed.json using ZooKeeperStorageIO:path=/configs/conf1
   [junit4]   2> 1329768 INFO  (coreLoadExecutor-4253-thread-1-processing-n:127.0.0.1:41224_) [n:127.0.0.1:41224_ c:control_collection s:shard1 r:core_node1 x:collection1] o.a.s.r.ManagedResourceStorage No data found for znode /configs/conf1/_rest_managed.json
   [junit4]   2> 1329768 INFO  (coreLoadExecutor-4253-thread-1-processing-n:127.0.0.1:41224_) [n:127.0.0.1:41224_ c:control_collection s:shard1 r:core_node1 x:collection1] o.a.s.r.ManagedResourceStorage Loaded null at path _rest_managed.json using ZooKeeperStorageIO:path=/configs/conf1
   [junit4]   2> 1329768 INFO  (coreLoadExecutor-4253-thread-1-processing-n:127.0.0.1:41224_) [n:127.0.0.1:41224_ c:control_collection s:shard1 r:core_node1 x:collection1] o.a.s.r.RestManager Initializing 0 registered ManagedResources
   [junit4]   2> 1329768 INFO  (coreLoadExecutor-4253-thread-1-processing-n:127.0.0.1:41224_) [n:127.0.0.1:41224_ c:control_collection s:shard1 r:core_node1 x:collection1] o.a.s.h.ReplicationHandler Commits will be reserved for  10000
   [junit4]   2> 1329768 INFO  (searcherExecutor-4254-thread-1-processing-n:127.0.0.1:41224_ x:collection1 s:shard1 c:control_collection r:core_node1) [n:127.0.0.1:41224_ c:control_collection s:shard1 r:core_node1 x:collection1] o.a.s.c.SolrCore [collection1] Registered new searcher Searcher@197403f[collection1] main{ExitableDirectoryReader(UninvertingDirectoryReader())}
   [junit4]   2> 1329768 INFO  (coreLoadExecutor-4253-thread-1-processing-n:127.0.0.1:41224_) [n:127.0.0.1:41224_ c:control_collection s:shard1 r:core_node1 x:collection1] o.a.s.u.UpdateLog Looking up max value of version field to seed version buckets
   [junit4]   2> 1329768 INFO  (coreLoadExecutor-4253-thread-1-processing-n:127.0.0.1:41224_) [n:127.0.0.1:41224_ c:control_collection s:shard1 r:core_node1 x:collection1] o.a.s.u.VersionInfo Refreshing highest value of _version_ for 65536 version buckets from index
   [junit4]   2> 1329768 INFO  (coreLoadExecutor-4253-thread-1-processing-n:127.0.0.1:41224_) [n:127.0.0.1:41224_ c:control_collection s:shard1 r:core_node1 x:collection1] o.a.s.u.VersionInfo No terms found for _version_, cannot seed version bucket highest value from index
   [junit4]   2> 1329769 INFO  (coreLoadExecutor-4253-thread-1-processing-n:127.0.0.1:41224_) [n:127.0.0.1:41224_ c:control_collection s:shard1 r:core_node1 x:collection1] o.a.s.u.UpdateLog Could not find max version in index or recent updates, using new clock 1514484387199057920
   [junit4]   2> 1329770 INFO  (coreLoadExecutor-4253-thread-1-processing-n:127.0.0.1:41224_) [n:127.0.0.1:41224_ c:control_collection s:shard1 r:core_node1 x:collection1] o.a.s.u.UpdateLog Took 1.0ms to seed version buckets with highest version 1514484387199057920
   [junit4]   2> 1329770 INFO  (coreLoadExecutor-4253-thread-1-processing-n:127.0.0.1:41224_) [n:127.0.0.1:41224_ c:control_collection s:shard1 r:core_node1 x:collection1] o.a.s.c.ZkController watch zkdir /configs/conf1
   [junit4]   2> 1329771 INFO  (coreLoadExecutor-4253-thread-1-processing-n:127.0.0.1:41224_) [n:127.0.0.1:41224_ c:control_collection s:shard1 r:core_node1 x:collection1] o.a.s.c.CoreContainer registering core: collection1
   [junit4]   2> 1329771 INFO  (coreZkRegister-4247-thread-1-processing-n:127.0.0.1:41224_ x:collection1 s:shard1 c:control_collection r:core_node1) [n:127.0.0.1:41224_ c:control_collection s:shard1 r:core_node1 x:collection1] o.a.s.c.ZkController Register replica - core:collection1 address:http://127.0.0.1:41224 collection:control_collection shard:shard1
   [junit4]   2> 1329771 INFO  (coreZkRegister-4247-thread-1-processing-n:127.0.0.1:41224_ x:collection1 s:shard1 c:control_collection r:core_node1) [n:127.0.0.1:41224_ c:control_collection s:shard1 r:core_node1 x:collection1] o.a.s.c.c.SolrZkClient makePath: /collections/control_collection/leader_elect/shard1/election
   [junit4]   2> 1329773 INFO  (coreZkRegister-4247-thread-1-processing-n:127.0.0.1:41224_ x:collection1 s:shard1 c:control_collection r:core_node1) [n:127.0.0.1:41224_ c:control_collection s:shard1 r:core_node1 x:collection1] o.a.s.c.LeaderElector Joined leadership election with path: /collections/control_collection/leader_elect/shard1/election/94655274102554628-core_node1-n_0000000000
   [junit4]   2> 1329773 INFO  (coreZkRegister-4247-thread-1-processing-n:127.0.0.1:41224_ x:collection1 s:shard1 c:control_collection r:core_node1) [n:127.0.0.1:41224_ c:control_collection s:shard1 r:core_node1 x:collection1] o.a.s.c.ShardLeaderElectionContext Running the leader process for shard shard1
   [junit4]   2> 1329774 INFO  (coreZkRegister-4247-thread-1-processing-n:127.0.0.1:41224_ x:collection1 s:shard1 c:control_collection r:core_node1) [n:127.0.0.1:41224_ c:control_collection s:shard1 r:core_node1 x:collection1] o.a.s.c.ShardLeaderElectionContext Enough replicas found to continue.
   [junit4]   2> 1329774 INFO  (coreZkRegister-4247-thread-1-processing-n:127.0.0.1:41224_ x:collection1 s:shard1 c:control_collection r:core_node1) [n:127.0.0.1:41224_ c:control_collection s:shard1 r:core_node1 x:collection1] o.a.s.c.ShardLeaderElectionContext I may be the new leader - try and sync
   [junit4]   2> 1329774 INFO  (OverseerStateUpdate-94655274102554628-127.0.0.1:41224_-n_0000000000) [n:127.0.0.1:41224_    ] o.a.s.c.Overseer processMessage: queueSize: 1, message = {
   [junit4]   2>   "operation":"leader",
   [junit4]   2>   "shard":"shard1",
   [junit4]   2>   "collection":"control_collection"} current state version: 1
   [junit4]   2> 1329774 INFO  (coreZkRegister-4247-thread-1-processing-n:127.0.0.1:41224_ x:collection1 s:shard1 c:control_collection r:core_node1) [n:127.0.0.1:41224_ c:control_collection s:shard1 r:core_node1 x:collection1] o.a.s.c.SyncStrategy Sync replicas to http://127.0.0.1:41224/collection1/
   [junit4]   2> 1329775 INFO  (coreZkRegister-4247-thread-1-processing-n:127.0.0.1:41224_ x:collection1 s:shard1 c:control_collection r:core_node1) [n:127.0.0.1:41224_ c:control_collection s:shard1 r:core_node1 x:collection1] o.a.s.c.SyncStrategy Sync Success - now sync replicas to me
   [junit4]   2> 1329775 INFO  (coreZkRegister-4247-thread-1-processing-n:127.0.0.1:41224_ x:collection1 s:shard1 c:control_collection r:core_node1) [n:127.0.0.1:41224_ c:control_collection s:shard1 r:core_node1 x:collection1] o.a.s.c.SyncStrategy http://127.0.0.1:41224/collection1/ has no replicas
   [junit4]   2> 1329775 INFO  (coreZkRegister-4247-thread-1-processing-n:127.0.0.1:41224_ x:collection1 s:shard1 c:control_collection r:core_node1) [n:127.0.0.1:41224_ c:control_collection s:shard1 r:core_node1 x:collection1] o.a.s.c.ShardLeaderElectionContext I am the new leader: http://127.0.0.1:41224/collection1/ shard1
   [junit4]   2> 1329775 INFO  (coreZkRegister-4247-thread-1-processing-n:127.0.0.1:41224_ x:collection1 s:shard1 c:control_collection r:core_node1) [n:127.0.0.1:41224_ c:control_collection s:shard1 r:core_node1 x:collection1] o.a.s.c.c.SolrZkClient makePath: /collections/control_collection/leaders/shard1
   [junit4]   2> 1329776 INFO  (coreZkRegister-4247-thread-1-processing-n:127.0.0.1:41224_ x:collection1 s:shard1 c:control_collection r:core_node1) [n:127.0.0.1:41224_ c:control_collection s:shard1 r:core_node1 x:collection1] o.a.s.c.ShardLeaderElectionContextBase Creating leader registration node
   [junit4]   2> 1329777 INFO  (OverseerStateUpdate-94655274102554628-127.0.0.1:41224_-n_0000000000) [n:127.0.0.1:41224_    ] o.a.s.c.Overseer processMessage: queueSize: 1, message = {
   [junit4]   2>   "operation":"leader",
   [junit4]   2>   "shard":"shard1",
   [junit4]   2>   "collection":"control_collection",
   [junit4]   2>   "base_url":"http://127.0.0.1:41224",
   [junit4]   2>   "core":"collection1",
   [junit4]   2>   "state":"active"} current state version: 1
   [junit4]   2> 1329879 INFO  (zkCallback-994-thread-1-processing-n:127.0.0.1:41224_) [n:127.0.0.1:41224_    ] o.a.s.c.c.ZkStateReader A cluster state change: WatchedEvent state:SyncConnected type:NodeDataChanged path:/clusterstate.json, has occurred - updating... (live nodes size: 1)
   [junit4]   2> 1329928 INFO  (coreZkRegister-4247-thread-1-processing-n:127.0.0.1:41224_ x:collection1 s:shard1 c:control_collection r:core_node1) [n:127.0.0.1:41224_ c:control_collection s:shard1 r:core_node1 x:collection1] o.a.s.c.ZkController We are http://127.0.0.1:41224/collection1/ and leader is http://127.0.0.1:41224/collection1/
   [junit4]   2> 1329928 INFO  (coreZkRegister-4247-thread-1-processing-n:127.0.0.1:41224_ x:collection1 s:shard1 c:control_collection r:core_node1) [n:127.0.0.1:41224_ c:control_collection s:shard1 r:core_node1 x:collection1] o.a.s.c.ZkController No LogReplay needed for core=collection1 baseURL=http://127.0.0.1:41224
   [junit4]   2> 1329928 INFO  (coreZkRegister-4247-thread-1-processing-n:127.0.0.1:41224_ x:collection1 s:shard1 c:control_collection r:core_node1) [n:127.0.0.1:41224_ c:control_collection s:shard1 r:core_node1 x:collection1] o.a.s.c.ZkController I am the leader, no recovery necessary
   [junit4]   2> 1329928 INFO  (coreZkRegister-4247-thread-1-processing-n:127.0.0.1:41224_ x:collection1 s:shard1 c:control_collection r:core_node1) [n:127.0.0.1:41224_ c:control_collection s:shard1 r:core_node1 x:collection1] o.a.s.c.ZkController publishing state=active
   [junit4]   2> 1329928 INFO  (coreZkRegister-4247-thread-1-processing-n:127.0.0.1:41224_ x:collection1 s:shard1 c:control_collection r:core_node1) [n:127.0.0.1:41224_ c:control_collection s:shard1 r:core_node1 x:collection1] o.a.s.c.ZkController numShards not found on descriptor - reading it from system property
   [junit4]   2> 1329929 INFO  (OverseerStateUpdate-94655274102554628-127.0.0.1:41224_-n_0000000000) [n:127.0.0.1:41224_    ] o.a.s.c.Overseer processMessage: queueSize: 1, message = {
   [junit4]   2>   "core":"collection1",
   [junit4]   2>   "core_node_name":"core_node1",
   [junit4]   2>   "roles":null,
   [junit4]   2>   "base_url":"http://127.0.0.1:41224",
   [junit4]   2>   "node_name":"127.0.0.1:41224_",
   [junit4]   2>   "numShards":"1",
   [junit4]   2>   "state":"active",
   [junit4]   2>   "shard":"shard1",
   [junit4]   2>   "collection":"control_collection",
   [junit4]   2>   "operation":"state"} current state version: 2
   [junit4]   2> 1329929 INFO  (OverseerStateUpdate-94655274102554628-127.0.0.1:41224_-n_0000000000) [n:127.0.0.1:41224_    ] o.a.s.c.o.ReplicaMutator Update state numShards=1 message={
   [junit4]   2>   "core":"collection1",
   [junit4]   2>   "core_node_name":"core_node1",
   [junit4]   2>   "roles":null,
   [junit4]   2>   "base_url":"http://127.0.0.1:41224",
   [junit4]   2>   "node_name":"127.0.0.1:41224_",
   [junit4]   2>   "numShards":"1",
   [junit4]   2>   "state":"active",
   [junit4]   2>   "shard":"shard1",
   [junit4]   2>   "collection":"control_collection",
   [junit4]   2>   "operation":"state"}
   [junit4]   2> 1330031 INFO  (zkCallback-994-thread-1-processing-n:127.0.0.1:41224_) [n:127.0.0.1:41224_    ] o.a.s.c.c.ZkStateReader A cluster state change: WatchedEvent state:SyncConnected type:NodeDataChanged path:/clusterstate.json, has occurred - updating... (live nodes size: 1)
   [junit4]   2> 1330095 INFO  (TEST-SolrCloudExampleTest.testLoadDocsIntoGettingStartedCollection-seed#[30600CFFB245AF0E]) [    ] o.a.s.c.c.SolrZkClient Using default ZkCredentialsProvider
   [junit4]   2> 1330095 INFO  (TEST-SolrCloudExampleTest.testLoadDocsIntoGettingStartedCollection-seed#[30600CFFB245AF0E]) [    ] o.a.s.c.c.ConnectionManager Waiting for client to connect to ZooKeeper
   [junit4]   2> 1330096 INFO  (zkCallback-996-thread-1) [    ] o.a.s.c.c.ConnectionManager Watcher org.apache.solr.common.cloud.ConnectionManager@a7ec19 name:ZooKeeperConnection Watcher:127.0.0.1:42061/solr got event WatchedEvent state:SyncConnected type:None path:null path:null type:None
   [junit4]   2> 1330096 INFO  (TEST-SolrCloudExampleTest.testLoadDocsIntoGettingStartedCollection-seed#[30600CFFB245AF0E]) [    ] o.a.s.c.c.ConnectionManager Client is connected to ZooKeeper
   [junit4]   2> 1330096 INFO  (TEST-SolrCloudExampleTest.testLoadDocsIntoGettingStartedCollection-seed#[30600CFFB245AF0E]) [    ] o.a.s.c.c.SolrZkClient Using default ZkACLProvider
   [junit4]   2> 1330096 INFO  (TEST-SolrCloudExampleTest.testLoadDocsIntoGettingStartedCollection-seed#[30600CFFB245AF0E]) [    ] o.a.s.c.c.ZkStateReader Updating cluster state from ZooKeeper... 
   [junit4]   2> 1330098 INFO  (TEST-SolrCloudExampleTest.testLoadDocsIntoGettingStartedCollection-seed#[30600CFFB245AF0E]) [    ] o.a.s.c.ChaosMonkey monkey: init - expire sessions:false cause connection loss:false
   [junit4]   2> 1330098 INFO  (TEST-SolrCloudExampleTest.testLoadDocsIntoGettingStartedCollection-seed#[30600CFFB245AF0E]) [    ] o.a.s.c.AbstractFullDistribZkTestBase Creating collection1 with stateFormat=2
   [junit4]   2> 1330098 INFO  (TEST-SolrCloudExampleTest.testLoadDocsIntoGettingStartedCollection-seed#[30600CFFB245AF0E]) [    ] o.a.s.c.c.SolrZkClient Using default ZkCredentialsProvider
   [junit4]   2> 1330098 INFO  (TEST-SolrCloudExampleTest.testLoadDocsIntoGettingStartedCollection-seed#[30600CFFB245AF0E]) [    ] o.a.s.c.c.ConnectionManager Waiting for client to connect to ZooKeeper
   [junit4]   2> 1330099 INFO  (zkCallback-997-thread-1) [    ] o.a.s.c.c.ConnectionManager Watcher org.apache.solr.common.cloud.ConnectionManager@135f9cf name:ZooKeeperConnection Watcher:127.0.0.1:42061/solr got event WatchedEvent state:SyncConnected type:None path:null path:null type:None
   [junit4]   2> 1330099 INFO  (TEST-SolrCloudExampleTest.testLoadDocsIntoGettingStartedCollection-seed#[30600CFFB245AF0E]) [    ] o.a.s.c.c.ConnectionManager Client is connected to ZooKeeper
   [junit4]   2> 1330099 INFO  (TEST-SolrCloudExampleTest.testLoadDocsIntoGettingStartedCollection-seed#[30600CFFB245AF0E]) [    ] o.a.s.c.c.SolrZkClient Using default ZkACLProvider
   [junit4]   2> 1330100 INFO  (OverseerStateUpdate-94655274102554628-127.0.0.1:41224_-n_0000000000) [n:127.0.0.1:41224_    ] o.a.s.c.Overseer processMessage: queueSize: 1, message = {
   [junit4]   2>   "operation":"create",
   [junit4]   2>   "name":"collection1",
   [junit4]   2>   "numShards":"2",
   [junit4]   2>   "stateFormat":"2"} current state version: 3
   [junit4]   2> 1330101 INFO  (OverseerStateUpdate-94655274102554628-127.0.0.1:41224_-n_0000000000) [n:127.0.0.1:41224_    ] o.a.s.c.o.ClusterStateMutator building a new cName: collection1
   [junit4]   2> 1330159 INFO  (TEST-SolrCloudExampleTest.testLoadDocsIntoGettingStartedCollection-seed#[30600CFFB245AF0E]) [    ] o.a.s.SolrTestCaseJ4 Writing core.properties file to /home/jenkins/workspace/Lucene-Solr-5.x-Linux/solr/build/solr-core/test/J0/temp/solr.cloud.SolrCloudExampleTest_30600CFFB245AF0E-001/shard-1-001/cores/collection1
   [junit4]   2> 1330159 INFO  (TEST-SolrCloudExampleTest.testLoadDocsIntoGettingStartedCollection-seed#[30600CFFB245AF0E]) [    ] o.a.s.c.AbstractFullDistribZkTestBase create jetty 1 in directory /home/jenkins/workspace/Lucene-Solr-5.x-Linux/solr/build/solr-core/test/J0/temp/solr.cloud.SolrCloudExampleTest_30600CFFB245AF0E-001/shard-1-001
   [junit4]   2> 1330160 INFO  (TEST-SolrCloudExampleTest.testLoadDocsIntoGettingStartedCollection-seed#[30600CFFB245AF0E]) [    ] o.e.j.s.Server jetty-9.2.13.v20150730
   [junit4]   2> 1330161 INFO  (TEST-SolrCloudExampleTest.testLoadDocsIntoGettingStartedCollection-seed#[30600CFFB245AF0E]) [    ] o.e.j.s.h.ContextHandler Started o.e.j.s.ServletContextHandler@44cb97{/,null,AVAILABLE}
   [junit4]   2> 1330161 INFO  (TEST-SolrCloudExampleTest.testLoadDocsIntoGettingStartedCollection-seed#[30600CFFB245AF0E]) [    ] o.e.j.s.ServerConnector Started ServerConnector@1f47aa8{HTTP/1.1}{127.0.0.1:42495}
   [junit4]   2> 1330161 INFO  (TEST-SolrCloudExampleTest.testLoadDocsIntoGettingStartedCollection-seed#[30600CFFB245AF0E]) [    ] o.e.j.s.Server Started @1331459ms
   [junit4]   2> 1330161 INFO  (TEST-SolrCloudExampleTest.testLoadDocsIntoGettingStartedCollection-seed#[30600CFFB245AF0E]) [    ] o.a.s.c.s.e.JettySolrRunner Jetty properties: {solr.data.dir=/home/jenkins/workspace/Lucene-Solr-5.x-Linux/solr/build/solr-core/test/J0/temp/solr.cloud.SolrCloudExampleTest_30600CFFB245AF0E-001/tempDir-001/jetty1, solrconfig=solrconfig.xml, hostContext=/, hostPort=42495, coreRootDirectory=/home/jenkins/workspace/Lucene-Solr-5.x-Linux/solr/build/solr-core/test/J0/temp/solr.cloud.SolrCloudExampleTest_30600CFFB245AF0E-001/shard-1-001/cores}
   [junit4]   2> 1330162 INFO  (TEST-SolrCloudExampleTest.testLoadDocsIntoGettingStartedCollection-seed#[30600CFFB245AF0E]) [    ] o.a.s.s.SolrDispatchFilter SolrDispatchFilter.init(): sun.misc.Launcher$AppClassLoader@181c5f3
   [junit4]   2> 1330162 INFO  (TEST-SolrCloudExampleTest.testLoadDocsIntoGettingStartedCollection-seed#[30600CFFB245AF0E]) [    ] o.a.s.c.SolrResourceLoader new SolrResourceLoader for directory: '/home/jenkins/workspace/Lucene-Solr-5.x-Linux/solr/build/solr-core/test/J0/temp/solr.cloud.SolrCloudExampleTest_30600CFFB245AF0E-001/shard-1-001/'
   [junit4]   2> 1330172 INFO  (TEST-SolrCloudExampleTest.testLoadDocsIntoGettingStartedCollection-seed#[30600CFFB245AF0E]) [    ] o.a.s.c.c.SolrZkClient Using default ZkCredentialsProvider
   [junit4]   2> 1330172 INFO  (TEST-SolrCloudExampleTest.testLoadDocsIntoGettingStartedCollection-seed#[30600CFFB245AF0E]) [    ] o.a.s.c.c.ConnectionManager Waiting for client to connect to ZooKeeper
   [junit4]   2> 1330173 INFO  (zkCallback-998-thread-1) [    ] o.a.s.c.c.ConnectionManager Watcher org.apache.solr.common.cloud.ConnectionManager@b5eb04 name:ZooKeeperConnection Watcher:127.0.0.1:42061/solr got event WatchedEvent state:SyncConnected type:None path:null path:null type:None
   [junit4]   2> 1330173 INFO  (TEST-SolrCloudExampleTest.testLoadDocsIntoGettingStartedCollection-seed#[30600CFFB245AF0E]) [    ] o.a.s.c.c.ConnectionManager Client is connected to ZooKeeper
   [junit4]   2> 1330174 INFO  (TEST-SolrCloudExampleTest.testLoadDocsIntoGettingStartedCollection-seed#[30600CFFB245AF0E]) [    ] o.a.s.c.c.SolrZkClient Using default ZkACLProvider
   [junit4]   2> 1330174 INFO  (TEST-SolrCloudExampleTest.testLoadDocsIntoGettingStartedCollection-seed#[30600CFFB245AF0E]) [    ] o.a.s.s.SolrDispatchFilter Loading solr.xml from SolrHome (not found in ZooKeeper)
   [junit4]   2> 1330174 INFO  (TEST-SolrCloudExampleTest.testLoadDocsIntoGettingStartedCollection-seed#[30600CFFB245AF0E]) [    ] o.a.s.c.SolrXmlConfig Loading container configuration from /home/jenkins/workspace/Lucene-Solr-5.x-Linux/solr/build/solr-core/test/J0/temp/solr.cloud.SolrCloudExampleTest_30600CFFB245AF0E-001/shard-1-001/solr.xml
   [junit4]   2> 1330177 INFO  (TEST-SolrCloudExampleTest.testLoadDocsIntoGettingStartedCollection-seed#[30600CFFB245AF0E]) [    ] o.a.s.c.CoresLocator Config-defined core root directory: /home/jenkins/workspace/Lucene-Solr-5.x-Linux/solr/build/solr-core/test/J0/temp/solr.cloud.SolrCloudExampleTest_30600CFFB245AF0E-001/shard-1-001/cores
   [junit4]   2> 1330178 INFO  (TEST-SolrCloudExampleTest.testLoadDocsIntoGettingStartedCollection-seed#[30600CFFB245AF0E]) [    ] o.a.s.c.CoreContainer New CoreContainer 22545668
   [junit4]   2> 1330178 INFO  (TEST-SolrCloudExampleTest.testLoadDocsIntoGettingStartedCollection-seed#[30600CFFB245AF0E]) [    ] o.a.s.c.CoreContainer Loading cores into CoreContainer [instanceDir=/home/jenkins/workspace/Lucene-Solr-5.x-Linux/solr/build/solr-core/test/J0/temp/solr.cloud.SolrCloudExampleTest_30600CFFB245AF0E-001/shard-1-001/]
   [junit4]   2> 1330178 INFO  (TEST-SolrCloudExampleTest.testLoadDocsIntoGettingStartedCollection-seed#[30600CFFB245AF0E]) [    ] o.a.s.c.CoreContainer loading shared library: /home/jenkins/workspace/Lucene-Solr-5.x-Linux/solr/build/solr-core/test/J0/temp/solr.cloud.SolrCloudExampleTest_30600CFFB245AF0E-001/shard-1-001/lib
   [junit4]   2> 1330178 WARN  (TEST-SolrCloudExampleTest.testLoadDocsIntoGettingStartedCollection-seed#[30600CFFB245AF0E]) [    ] o.a.s.c.SolrResourceLoader Can't find (or read) directory to add to classloader: lib (resolved as: /home/jenkins/workspace/Lucene-Solr-5.x-Linux/solr/build/solr-core/test/J0/temp/solr.cloud.SolrCloudExampleTest_30600CFFB245AF0E-001/shard-1-001/lib).
   [junit4]   2> 1330183 INFO  (TEST-SolrCloudExampleTest.testLoadDocsIntoGettingStartedCollection-seed#[30600CFFB245AF0E]) [    ] o.a.s.h.c.HttpShardHandlerFactory created with socketTimeout : 90000,urlScheme : ,connTimeout : 15000,maxConnectionsPerHost : 20,maxConnections : 10000,corePoolSize : 0,maximumPoolSize : 2147483647,maxThreadIdleTime : 5,sizeOfQueue : -1,fairnessPolicy : false,useRetries : false,
   [junit4]   2> 1330184 INFO  (TEST-SolrCloudExampleTest.testLoadDocsIntoGettingStartedCollection-seed#[30600CFFB245AF0E]) [    ] o.a.s.u.UpdateShardHandler Creating UpdateShardHandler HTTP client with params: socketTimeout=340000&connTimeout=45000&retry=true
   [junit4]   2> 1330185 INFO  (TEST-SolrCloudExampleTest.testLoadDocsIntoGettingStartedCollection-seed#[30600CFFB245AF0E]) [    ] o.a.s.l.LogWatcher SLF4J impl is org.slf4j.impl.Log4jLoggerFactory
   [junit4]   2> 1330185 INFO  (TEST-SolrCloudExampleTest.testLoadDocsIntoGettingStartedCollection-seed#[30600CFFB245AF0E]) [    ] o.a.s.l.LogWatcher Registering Log Listener [Log4j (org.slf4j.impl.Log4jLoggerFactory)]
   [junit4]   2> 1330185 INFO  (TEST-SolrCloudExampleTest.testLoadDocsIntoGettingStartedCollection-seed#[30600CFFB245AF0E]) [    ] o.a.s.c.ZkContainer Zookeeper client=127.0.0.1:42061/solr
   [junit4]   2> 1330185 INFO  (TEST-SolrCloudExampleTest.testLoadDocsIntoGettingStartedCollection-seed#[30600CFFB245AF0E]) [    ] o.a.s.c.ZkController zkHost includes chroot
   [junit4]   2> 1330185 INFO  (TEST-SolrCloudExampleTest.testLoadDocsIntoGettingStartedCollection-seed#[30600CFFB245AF0E]) [    ] o.a.s.c.c.SolrZkClient Using default ZkCredentialsProvider
   [junit4]   2> 1330185 INFO  (TEST-SolrCloudExampleTest.testLoadDocsIntoGettingStartedCollection-seed#[30600CFFB245AF0E]) [    ] o.a.s.c.c.ConnectionManager Waiting for client to connect to ZooKeeper
   [junit4]   2> 1330186 INFO  (zkCallback-1000-thread-1) [    ] o.a.s.c.c.ConnectionManager Watcher org.apache.solr.common.cloud.ConnectionManager@f2c721 name:ZooKeeperConnection Watcher:127.0.0.1:42061 got event WatchedEvent state:SyncConnected type:None path:null path:null type:None
   [junit4]   2> 1330186 INFO  (TEST-SolrCloudExampleTest.testLoadDocsIntoGettingStartedCollection-seed#[30600CFFB245AF0E]) [    ] o.a.s.c.c.ConnectionManager Client is connected to ZooKeeper
   [junit4]   2> 1330187 INFO  (TEST-SolrCloudExampleTest.testLoadDocsIntoGettingStartedCollection-seed#[30600CFFB245AF0E]) [    ] o.a.s.c.c.SolrZkClient Using default ZkACLProvider
   [junit4]   2> 1330187 INFO  (TEST-SolrCloudExampleTest.testLoadDocsIntoGettingStartedCollection-seed#[30600CFFB245AF0E]) [n:127.0.0.1:42495_    ] o.a.s.c.c.ConnectionManager Waiting for client to connect to ZooKeeper
   [junit4]   2> 1330188 INFO  (zkCallback-1001-thread-1-processing-n:127.0.0.1:42495_) [n:127.0.0.1:42495_    ] o.a.s.c.c.ConnectionManager Watcher org.apache.solr.common.cloud.ConnectionManager@38f7e5 name:ZooKeeperConnection Watcher:127.0.0.1:42061/solr got event WatchedEvent state:SyncConnected type:None path:null path:null type:None
   [junit4]   2> 1330188 INFO  (TEST-SolrCloudExampleTest.testLoadDocsIntoGettingStartedCollection-seed#[30600CFFB245AF0E]) [n:127.0.0.1:42495_    ] o.a.s.c.c.ConnectionManager Client is connected to ZooKeeper
   [junit4]   2> 1330191 INFO  (TEST-SolrCloudExampleTest.testLoadDocsIntoGettingStartedCollection-seed#[30600CFFB245AF0E]) [n:127.0.0.1:42495_    ] o.a.s.c.c.ZkStateReader Updating cluster state from ZooKeeper... 
   [junit4]   2> 1330202 INFO  (OverseerStateUpdate-94655274102554628-127.0.0.1:41224_-n_0000000000) [n:127.0.0.1:41224_    ] o.a.s.c.o.ZkStateWriter going to create_collection /collections/collection1/state.json
   [junit4]   2> 1331193 INFO  (TEST-SolrCloudExampleTest.testLoadDocsIntoGettingStartedCollection-seed#[30600CFFB245AF0E]) [n:127.0.0.1:42495_    ] o.a.s.c.ZkController Register node as live in ZooKeeper:/live_nodes/127.0.0.1:42495_
   [junit4]   2> 1331194 INFO  (TEST-SolrCloudExampleTest.testLoadDocsIntoGettingStartedCollection-seed#[30600CFFB245AF0E]) [n:127.0.0.1:42495_    ] o.a.s.c.c.SolrZkClient makePath: /live_nodes/127.0.0.1:42495_
   [junit4]   2> 1331194 INFO  (zkCallback-996-thread-1) [    ] o.a.s.c.c.ZkStateReader A live node change: WatchedEvent state:SyncConnected type:NodeChildrenChanged path:/live_nodes, has occurred - updating... (live nodes size: 1)
   [junit4]   2> 1331194 INFO  (zkCallback-1001-thread-1-processing-n:127.0.0.1:42495_) [n:127.0.0.1:42495_    ] o.a.s.c.c.ZkStateReader A live node change: WatchedEvent state:SyncConnected type:NodeChildrenChanged path:/live_nodes, has occurred - updating... (live nodes size: 1)
   [junit4]   2> 1331194 INFO  (zkCallback-994-thread-1-processing-n:127.0.0.1:41224_) [n:127.0.0.1:41224_    ] o.a.s.c.c.ZkStateReader A live node change: WatchedEvent state:SyncConnected type:NodeChildrenChanged path:/live_nodes, has occurred - updating... (live nodes size: 1)
   [junit4]   2> 1331195 INFO  (TEST-SolrCloudExampleTest.testLoadDocsIntoGettingStartedCollection-seed#[30600CFFB245AF0E]) [n:127.0.0.1:42495_    ] o.a.s.c.Overseer Overseer (id=null) closing
   [junit4]   2> 1331195 INFO  (TEST-SolrCloudExampleTest.testLoadDocsIntoGettingStartedCollection-seed#[30600CFFB245AF0E]) [n:127.0.0.1:42495_    ] o.a.s.c.LeaderElector Joined leadership election with path: /overseer_elect/election/94655274102554633-127.0.0.1:42495_-n_0000000001
   [junit4]   2> 1331196 INFO  (TEST-SolrCloudExampleTest.testLoadDocsIntoGettingStartedCollection-seed#[30600CFFB245AF0E]) [n:127.0.0.1:42495_    ] o.a.s.c.LeaderElector Watching path /overseer_elect/election/94655274102554628-127.0.0.1:41224_-n_0000000000 to know if I could be the leader
   [junit4]   2> 1331239 INFO  (TEST-SolrCloudExampleTest.testLoadDocsIntoGettingStartedCollection-seed#[30600CFFB245AF0E]) [n:127.0.0.1:42495_    ] o.a.s.c.CoreContainer Security conf doesn't exist. Skipping setup for authorization module.
   [junit4]   2> 1331239 INFO  (TEST-SolrCloudExampleTest.testLoadDocsIntoGettingStartedCollection-seed#[30600CFFB245AF0E]) [n:127.0.0.1:42495_    ] o.a.s.c.CoreContainer No authentication plugin used.
   [junit4]   2> 1331240 INFO  (TEST-SolrCloudExampleTest.testLoadDocsIntoGettingStartedCollection-seed#[30600CFFB245AF0E]) [n:127.0.0.1:42495_    ] o.a.s.c.CoresLocator Looking for core definitions underneath /home/jenkins/workspace/Lucene-Solr-5.x-Linux/solr/build/solr-core/test/J0/temp/solr.cloud.SolrCloudExampleTest_30600CFFB245AF0E-001/shard-1-001/cores
   [junit4]   2> 1331241 INFO  (TEST-SolrCloudExampleTest.testLoadDocsIntoGettingStartedCollection-seed#[30600CFFB245AF0E]) [n:127.0.0.1:42495_    ] o.a.s.c.SolrCore Created CoreDescriptor: {name=collection1, config=solrconfig.xml, transient=false, schema=schema.xml, loadOnStartup=true, configSetProperties=configsetprops.json, instanceDir=/home/jenkins/workspace/Lucene-Solr-5.x-Linux/solr/build/solr-core/test/J0/temp/solr.cloud.SolrCloudExampleTest_30600CFFB245AF0E-001/shard-1-001/cores/collection1, collection=collection1, absoluteInstDir=/home/jenkins/workspace/Lucene-Solr-5.x-Linux/solr/build/solr-core/test/J0/temp/solr.cloud.SolrCloudExampleTest_30600CFFB245AF0E-001/shard-1-001/cores/collection1/, coreNodeName=, dataDir=data/, shard=}
   [junit4]   2> 1331241 INFO  (TEST-SolrCloudExampleTest.testLoadDocsIntoGettingStartedCollection-seed#[30600CFFB245AF0E]) [n:127.0.0.1:42495_    ] o.a.s.c.CoresLocator Found core collection1 in /home/jenkins/workspace/Lucene-Solr-5.x-Linux/solr/build/solr-core/test/J0/temp/solr.cloud.SolrCloudExampleTest_30600CFFB245AF0E-001/shard-1-001/cores/collection1/
   [junit4]   2> 1331241 INFO  (TEST-SolrCloudExampleTest.testLoadDocsIntoGettingStartedCollection-seed#[30600CFFB245AF0E]) [n:127.0.0.1:42495_    ] o.a.s.c.CoresLocator Found 1 core definitions
   [junit4]   2> 1331241 INFO  (TEST-SolrCloudExampleTest.testLoadDocsIntoGettingStartedCollection-seed#[30600CFFB245AF0E]) [n:127.0.0.1:42495_    ] o.a.s.s.SolrDispatchFilter user.dir=/home/jenkins/workspace/Lucene-Solr-5.x-Linux/solr/build/solr-core/test/J0
   [junit4]   2> 1331241 INFO  (TEST-SolrCloudExampleTest.testLoadDocsIntoGettingStartedCollection-seed#[30600CFFB245AF0E]) [n:127.0.0.1:42495_    ] o.a.s.s.SolrDispatchFilter SolrDispatchFilter.init() done
   [junit4]   2> 1331242 INFO  (coreLoadExecutor-4264-thread-1-processing-n:127.0.0.1:42495_) [n:127.0.0.1:42495_ c:collection1   x:collection1] o.a.s.c.ZkController publishing state=down
   [junit4]   2> 1331242 INFO  (coreLoadExecutor-4264-thread-1-processing-n:127.0.0.1:42495_) [n:127.0.0.1:42495_ c:collection1   x:collection1] o.a.s.c.ZkController numShards not found on descriptor - reading it from system property
   [junit4]   2> 1331243 INFO  (coreLoadExecutor-4264-thread-1-processing-n:127.0.0.1:42495_) [n:127.0.0.1:42495_ c:collection1   x:collection1] o.a.s.c.ZkController Registering watch for collection collection1
   [junit4]   2> 1331243 INFO  (coreLoadExecutor-4264-thread-1-processing-n:127.0.0.1:42495_) [n:127.0.0.1:42495_ c:collection1   x:collection1] o.a.s.c.c.ZkStateReader addZkWatch collection1
   [junit4]   2> 1331243 INFO  (OverseerStateUpdate-94655274102554628-127.0.0.1:41224_-n_0000000000) [n:127.0.0.1:41224_    ] o.a.s.c.Overseer processMessage: queueSize: 1, message = {
   [junit4]   2>   "core":"collection1",
   [junit4]   2>   "roles":null,
   [junit4]   2>   "base_url":"http://127.0.0.1:42495",
   [junit4]   2>   "node_name":"127.0.0.1:42495_",
   [junit4]   2>   "numShards":"2",
   [junit4]   2>   "state":"down",
   [junit4]   2>   "shard":null,
   [junit4]   2>   "collection":"collection1",
   [junit4]   2>   "operation":"state"} current state version: 3
   [junit4]   2> 1331243 INFO  (coreLoadExecutor-4264-thread-1-processing-n:127.0.0.1:42495_) [n:127.0.0.1:42495_ c:collection1   x:collection1] o.a.s.c.c.ZkStateReader Add data for collection1 ver 0 
   [junit4]   2> 1331243 INFO  (coreLoadExecutor-4264-thread-1-processing-n:127.0.0.1:42495_) [n:127.0.0.1:42495_ c:collection1   x:collection1] o.a.s.c.ZkController look for our core node name
   [junit4]   2> 1331243 INFO  (OverseerStateUpdate-94655274102554628-127.0.0.1:41224_-n_0000000000) [n:127.0.0.1:41224_    ] o.a.s.c.o.ReplicaMutator Update state numShards=2 message={
   [junit4]   2>   "core":"collection1",
   [junit4]   2>   "roles":null,
   [junit4]   2>   "base_url":"http://127.0.0.1:42495",
   [junit4]   2>   "node_name":"127.0.0.1:42495_",
   [junit4]   2>   "numShards":"2",
   [junit4]   2>   "state":"down",
   [junit4]   2>   "shard":null,
   [junit4]   2>   "collection":"collection1",
   [junit4]   2>   "operation":"state"}
   [junit4]   2> 1331243 INFO  (OverseerStateUpdate-94655274102554628-127.0.0.1:41224_-n_0000000000) [n:127.0.0.1:41224_    ] o.a.s.c.o.ReplicaMutator Collection already exists with numShards=2
   [junit4]   2> 1331243 INFO  (OverseerStateUpdate-94655274102554628-127.0.0.1:41224_-n_0000000000) [n:127.0.0.1:41224_    ] o.a.s.c.o.ReplicaMutator Assigning new node to shard shard=shard2
   [junit4]   2> 1331344 INFO  (OverseerStateUpdate-94655274102554628-127.0.0.1:41224_-n_0000000000) [n:127.0.0.1:41224_    ] o.a.s.c.o.ZkStateWriter going to update_collection /collections/collection1/state.json version: 0
   [junit4]   2> 1331345 INFO  (zkCallback-1001-thread-1-processing-n:127.0.0.1:42495_) [n:127.0.0.1:42495_    ] o.a.s.c.c.ZkStateReader A cluster state change: WatchedEvent state:SyncConnected type:NodeDataChanged path:/collections/collection1/state.json for collection collection1 has occurred - updating... (live nodes size: 2)
   [junit4]   2> 1331345 INFO  (zkCallback-1001-thread-1-processing-n:127.0.0.1:42495_) [n:127.0.0.1:42495_    ] o.a.s.c.c.ZkStateReader Updating data for collection1 from 0 to 1 
   [junit4]   2> 1332243 INFO  (coreLoadExecutor-4264-thread-1-processing-n:127.0.0.1:42495_) [n:127.0.0.1:42495_ c:collection1   x:collection1] o.a.s.c.ZkController waiting to find shard id in clusterstate for collection1
   [junit4]   2> 1332243 INFO  (coreLoadExecutor-4264-thread-1-processing-n:127.0.0.1:42495_) [n:127.0.0.1:42495_ c:collection1   x:collection1] o.a.s.c.ZkController Check for collection zkNode:collection1
   [junit4]   2> 1332244 INFO  (coreLoadExecutor-4264-thread-1-processing-n:127.0.0.1:42495_) [n:127.0.0.1:42495_ c:collection1   x:collection1] o.a.s.c.ZkController Collection zkNode exists
   [junit4]   2> 1332244 INFO  (coreLoadExecutor-4264-thread-1-processing-n:127.0.0.1:42495_) [n:127.0.0.1:42495_ c:collection1   x:collection1] o.a.s.c.c.ZkStateReader Load collection config from:/collections/collection1
   [junit4]   2> 1332244 INFO  (coreLoadExecutor-4264-thread-1-processing-n:127.0.0.1:42495_) [n:127.0.0.1:42495_ c:collection1   x:collection1] o.a.s.c.c.ZkStateReader path=/collections/collection1 configName=conf1 specified config exists in ZooKeeper
   [junit4]   2> 1332244 INFO  (coreLoadExecutor-4264-thread-1-processing-n:127.0.0.1:42495_) [n:127.0.0.1:42495_ c:collection1   x:collection1] o.a.s.c.SolrResourceLoader new SolrResourceLoader for directory: '/home/jenkins/workspace/Lucene-Solr-5.x-Linux/solr/build/solr-core/test/J0/temp/solr.cloud.SolrCloudExampleTest_30600CFFB245AF0E-001/shard-1-001/cores/collection1/'
   [junit4]   2> 1332254 INFO  (coreLoadExecutor-4264-thread-1-processing-n:127.0.0.1:42495_) [n:127.0.0.1:42495_ c:collection1   x:collection1] o.a.s.c.Config loaded config solrconfig.xml with version 0 
   [junit4]   2> 1332257 INFO  (coreLoadExecutor-4264-thread-1-processing-n:127.0.0.1:42495_) [n:127.0.0.1:42495_ c:collection1   x:collection1] o.a.s.c.SolrConfig current version of requestparams : -1
   [junit4]   2> 1332260 INFO  (coreLoadExecutor-4264-thread-1-processing-n:127.0.0.1:42495_) [n:127.0.0.1:42495_ c:collection1   x:collection1] o.a.s.c.SolrConfig Using Lucene MatchVersion: 5.4.0
   [junit4]   2> 1332267 INFO  (coreLoadExecutor-4264-thread-1-processing-n:127.0.0.1:42495_) [n:127.0.0.1:42495_ c:collection1   x:collection1] o.a.s.c.Config Loaded SolrConfig: solrconfig.xml
   [junit4]   2> 1332267 INFO  (coreLoadExecutor-4264-thread-1-processing-n:127.0.0.1:42495_) [n:127.0.0.1:42495_ c:collection1   x:collection1] o.a.s.s.IndexSchema Reading Solr Schema from /configs/conf1/schema.xml
   [junit4]   2> 1332273 INFO  (coreLoadExecutor-4264-thread-1-processing-n:127.0.0.1:42495_) [n:127.0.0.1:42495_ c:collection1   x:collection1] o.a.s.s.IndexSchema [collection1] Schema name=test
   [junit4]   2> 1332355 INFO  (coreLoadExecutor-4264-thread-1-processing-n:127.0.0.1:42495_) [n:127.0.0.1:42495_ c:collection1   x:collection1] o.a.s.s.OpenExchangeRatesOrgProvider Initialized with rates=open-exchange-rates.json, refreshInterval=1440.
   [junit4]   2> 1332359 INFO  (coreLoadExecutor-4264-thread-1-processing-n:127.0.0.1:42495_) [n:127.0.0.1:42495_ c:collection1   x:collection1] o.a.s.s.IndexSchema default search field in schema is text
   [junit4]   2> 1332374 INFO  (coreLoadExecutor-4264-thread-1-processing-n:127.0.0.1:42495_) [n:127.0.0.1:42495_ c:collection1   x:collection1] o.a.s.s.IndexSchema unique key field: id
   [junit4]   2> 1332379 INFO  (coreLoadExecutor-4264-thread-1-processing-n:127.0.0.1:42495_) [n:127.0.0.1:42495_ c:collection1   x:collection1] o.a.s.s.FileExchangeRateProvider Reloading exchange rates from file currency.xml
   [junit4]   2> 1332380 INFO  (coreLoadExecutor-4264-thread-1-processing-n:127.0.0.1:42495_) [n:127.0.0.1:42495_ c:collection1   x:collection1] o.a.s.s.FileExchangeRateProvider Reloading exchange rates from file currency.xml
   [junit4]   2> 1332382 INFO  (coreLoadExecutor-4264-thread-1-processing-n:127.0.0.1:42495_) [n:127.0.0.1:42495_ c:collection1   x:collection1] o.a.s.s.OpenExchangeRatesOrgProvider Reloading exchange rates from open-exchange-rates.json
   [junit4]   2> 1332382 WARN  (coreLoadExecutor-4264-thread-1-processing-n:127.0.0.1:42495_) [n:127.0.0.1:42495_ c:collection1   x:collection1] o.a.s.s.OpenExchangeRatesOrgProvider Unknown key IMPORTANT NOTE
   [junit4]   2> 1332382 WARN  (coreLoadExecutor-4264-thread-1-processing-n:127.0.0.1:42495_) [n:127.0.0.1:42495_ c:collection1   x:collection1] o.a.s.s.OpenExchangeRatesOrgProvider Expected key, got STRING
   [junit4]   2> 1332382 INFO  (coreLoadExecutor-4264-thread-1-processing-n:127.0.0.1:42495_) [n:127.0.0.1:42495_ c:collection1   x:collection1] o.a.s.s.OpenExchangeRatesOrgProvider Reloading exchange rates from open-exchange-rates.json
   [junit4]   2> 1332383 WARN  (coreLoadExecutor-4264-thread-1-processing-n:127.0.0.1:42495_) [n:127.0.0.1:42495_ c:collection1   x:collection1] o.a.s.s.OpenExchangeRatesOrgProvider Unknown key IMPORTANT NOTE
   [junit4]   2> 1332383 WARN  (coreLoadExecutor-4264-thread-1-processing-n:127.0.0.1:42495_) [n:127.0.0.1:42495_ c:collection1   x:collection1] o.a.s.s.OpenExchangeRatesOrgProvider Expected key, got STRING
   [junit4]   2> 1332383 INFO  (coreLoadExecutor-4264-thread-1-processing-n:127.0.0.1:42495_) [n:127.0.0.1:42495_ c:collection1   x:collection1] o.a.s.c.ConfigSetProperties Did not find ConfigSet properties, assuming default properties: Can't find resource 'configsetprops.json' in classpath or '/configs/conf1', cwd=/home/jenkins/workspace/Lucene-Solr-5.x-Linux/solr/build/solr-core/test/J0
   [junit4]   2> 1332384 INFO  (coreLoadExecutor-4264-thread-1-processing-n:127.0.0.1:42495_) [n:127.0.0.1:42495_ c:collection1   x:collection1] o.a.s.c.CoreContainer Creating SolrCore 'collection1' using configuration from collection collection1
   [junit4]   2> 1332384 INFO  (coreLoadExecutor-4264-thread-1-processing-n:127.0.0.1:42495_) [n:127.0.0.1:42495_ c:collection1 s:shard2 r:core_node1 x:collection1] o.a.s.c.SolrCore org.apache.solr.core.MockDirectoryFactory
   [junit4]   2

[...truncated too long message...]

ElectionContextBase.cancelElection(ElectionContext.java:166)
   [junit4]   2> 	at org.apache.solr.cloud.ShardLeaderElectionContext.cancelElection(ElectionContext.java:268)
   [junit4]   2> 	at org.apache.solr.cloud.ShardLeaderElectionContext.runLeaderProcess(ElectionContext.java:450)
   [junit4]   2> 	at org.apache.solr.cloud.LeaderElector.runIamLeaderProcess(LeaderElector.java:197)
   [junit4]   2> 	at org.apache.solr.cloud.LeaderElector.checkIfIamLeader(LeaderElector.java:157)
   [junit4]   2> 	at org.apache.solr.cloud.LeaderElector.access$200(LeaderElector.java:58)
   [junit4]   2> 	at org.apache.solr.cloud.LeaderElector$ElectionWatcher.process(LeaderElector.java:388)
   [junit4]   2> 	at org.apache.solr.common.cloud.SolrZkClient$3$1.run(SolrZkClient.java:264)
   [junit4]   2> 	at java.util.concurrent.Executors$RunnableAdapter.call(Executors.java:511)
   [junit4]   2> 	at java.util.concurrent.FutureTask.run(FutureTask.java:265)
   [junit4]   2> 	at org.apache.solr.common.util.ExecutorUtil$MDCAwareThreadPoolExecutor$1.run(ExecutorUtil.java:231)
   [junit4]   2> 	at java.util.concurrent.ThreadPoolExecutor.runWorker(ThreadPoolExecutor.java:1142)
   [junit4]   2> 	at java.util.concurrent.ThreadPoolExecutor$Worker.run(ThreadPoolExecutor.java:617)
   [junit4]   2> 	at java.lang.Thread.run(Thread.java:746)
   [junit4]   2> 1368295 INFO  (TEST-SolrCloudExampleTest.testLoadDocsIntoGettingStartedCollection-seed#[30600CFFB245AF0E]) [    ] o.e.j.s.ServerConnector Stopped ServerConnector@1b76f02{HTTP/1.1}{127.0.0.1:0}
   [junit4]   2> 1368295 INFO  (TEST-SolrCloudExampleTest.testLoadDocsIntoGettingStartedCollection-seed#[30600CFFB245AF0E]) [    ] o.e.j.s.h.ContextHandler Stopped o.e.j.s.ServletContextHandler@1f6a445{/,null,UNAVAILABLE}
   [junit4]   2> 1368296 INFO  (TEST-SolrCloudExampleTest.testLoadDocsIntoGettingStartedCollection-seed#[30600CFFB245AF0E]) [n:127.0.0.1:53786_ c:collection1 s:shard1 r:core_node4 x:collection1] o.a.s.c.ZkTestServer connecting to 127.0.0.1:42061 42061
   [junit4]   2> 1368338 INFO  (Thread-4209) [    ] o.a.s.c.ZkTestServer connecting to 127.0.0.1:42061 42061
   [junit4]   2> 1368338 WARN  (Thread-4209) [    ] o.a.s.c.ZkTestServer Watch limit violations: 
   [junit4]   2> Maximum concurrent create/delete watches above limit:
   [junit4]   2> 
   [junit4]   2> 	9	/solr/aliases.json
   [junit4]   2> 	8	/solr/configs/gettingstarted/managed-schema
   [junit4]   2> 	8	/solr/configs/gettingstarted
   [junit4]   2> 	5	/solr/security.json
   [junit4]   2> 	5	/solr/configs/conf1
   [junit4]   2> 
   [junit4]   2> Maximum concurrent data watches above limit:
   [junit4]   2> 
   [junit4]   2> 	9	/solr/clusterstate.json
   [junit4]   2> 	4	/solr/collections/collection1/state.json
   [junit4]   2> 	4	/solr/collections/gettingstarted/state.json
   [junit4]   2> 
   [junit4]   2> Maximum concurrent children watches above limit:
   [junit4]   2> 
   [junit4]   2> 	9	/solr/live_nodes
   [junit4]   2> 	9	/solr/collections
   [junit4]   2> 	5	/solr/overseer/collection-queue-work
   [junit4]   2> 	4	/solr/overseer/queue
   [junit4]   2> 	2	/solr/overseer/queue-work
   [junit4]   2> 
   [junit4]   2> NOTE: reproduce with: ant test  -Dtestcase=SolrCloudExampleTest -Dtests.method=testLoadDocsIntoGettingStartedCollection -Dtests.seed=30600CFFB245AF0E -Dtests.multiplier=3 -Dtests.slow=true -Dtests.locale=ur_PK -Dtests.timezone=Africa/Windhoek -Dtests.asserts=true -Dtests.file.encoding=UTF-8
   [junit4] FAILURE 40.1s J0 | SolrCloudExampleTest.testLoadDocsIntoGettingStartedCollection <<<
   [junit4]    > Throwable #1: java.lang.AssertionError: Delete action failed!
   [junit4]    > 	at __randomizedtesting.SeedInfo.seed([30600CFFB245AF0E:23033E90832A16A8]:0)
   [junit4]    > 	at org.apache.solr.cloud.SolrCloudExampleTest.doTestDeleteAction(SolrCloudExampleTest.java:169)
   [junit4]    > 	at org.apache.solr.cloud.SolrCloudExampleTest.testLoadDocsIntoGettingStartedCollection(SolrCloudExampleTest.java:145)
   [junit4]    > 	at org.apache.solr.BaseDistributedSearchTestCase$ShardsRepeatRule$ShardsFixedStatement.callStatement(BaseDistributedSearchTestCase.java:963)
   [junit4]    > 	at org.apache.solr.BaseDistributedSearchTestCase$ShardsRepeatRule$ShardsStatement.evaluate(BaseDistributedSearchTestCase.java:938)
   [junit4]    > 	at java.lang.Thread.run(Thread.java:746)
   [junit4]   2> 1368345 INFO  (SUITE-SolrCloudExampleTest-seed#[30600CFFB245AF0E]-worker) [n:127.0.0.1:53786_ c:collection1 s:shard1 r:core_node4 x:collection1] o.a.s.SolrTestCaseJ4 ###deleteCore
   [junit4]   2> NOTE: leaving temporary files on disk at: /home/jenkins/workspace/Lucene-Solr-5.x-Linux/solr/build/solr-core/test/J0/temp/solr.cloud.SolrCloudExampleTest_30600CFFB245AF0E-001
   [junit4]   2> Oct 08, 2015 5:21:41 PM com.carrotsearch.randomizedtesting.ThreadLeakControl checkThreadLeaks
   [junit4]   2> WARNING: Will linger awaiting termination of 2 leaked thread(s).
   [junit4]   2> NOTE: test params are: codec=Asserting(Lucene53): {}, docValues:{}, sim=RandomSimilarityProvider(queryNorm=false,coord=no): {}, locale=ur_PK, timezone=Africa/Windhoek
   [junit4]   2> NOTE: Linux 3.19.0-30-generic i386/Oracle Corporation 1.9.0-ea (32-bit)/cpus=12,threads=1,free=80066600,total=401268736
   [junit4]   2> NOTE: All tests run in this JVM: [TestCustomDocTransformer, TestMergePolicyConfig, TestNamedUpdateProcessors, RecoveryAfterSoftCommitTest, DisMaxRequestHandlerTest, XsltUpdateRequestHandlerTest, TestEmbeddedSolrServerConstructors, TestScoreJoinQPNoScore, TestLuceneMatchVersion, TestBinaryField, TestLazyCores, TestRTimerTree, DocExpirationUpdateProcessorFactoryTest, TestSolr4Spatial2, TestManagedResource, TestSolrDynamicMBean, TestAnalyzedSuggestions, DefaultValueUpdateProcessorTest, RequiredFieldsTest, ZkStateWriterTest, UUIDUpdateProcessorFallbackTest, ReturnFieldsTest, SegmentsInfoRequestHandlerTest, BasicZkTest, SharedFSAutoReplicaFailoverTest, IndexSchemaRuntimeFieldTest, ShardSplitTest, ParsingFieldUpdateProcessorsTest, TestHighFrequencyDictionaryFactory, ConcurrentDeleteAndCreateCollectionTest, DistributedSpellCheckComponentTest, BasicAuthIntegrationTest, TestCollapseQParserPlugin, BasicDistributedZkTest, TimeZoneUtilsTest, CacheHeaderTest, TestRandomFaceting, TestPivotHelperCode, PingRequestHandlerTest, CopyFieldTest, TestConfigSetsAPIZkFailure, TestManagedSynonymFilterFactory, AnalysisAfterCoreReloadTest, TestSchemaManager, ResponseHeaderTest, SharedFSAutoReplicaFailoverUtilsTest, DateFieldTest, AddBlockUpdateTest, TestCursorMarkWithoutUniqueKey, CollectionsAPIAsyncDistributedZkTest, DistributedMLTComponentTest, MigrateRouteKeyTest, TestRandomDVFaceting, QueryEqualityTest, SolrCoreTest, TestOmitPositions, TestBulkSchemaConcurrent, TestFunctionQuery, DateMathParserTest, TestConfigSetProperties, TestArbitraryIndexDir, TestStressLucene, TestIBSimilarityFactory, TestInfoStreamLogging, SolrRequestParserTest, OpenExchangeRatesOrgProviderTest, TestSolrJ, TestLRUStatsCache, OutputWriterTest, TestCollectionAPI, LeaderInitiatedRecoveryOnShardRestartTest, BadCopyFieldTest, AssignTest, TestDocumentBuilder, QueryResultKeyTest, SynonymTokenizerTest, DistributedFacetPivotSmallTest, ResponseLogComponentTest, TestPhraseSuggestions, OverriddenZkACLAndCredentialsProvidersTest, TestSortingResponseWriter, SOLR749Test, TestDistributedSearch, HdfsBasicDistributedZk2Test, TestStandardQParsers, TestSolrXml, BasicDistributedZk2Test, SyncSliceTest, OpenCloseCoreStressTest, RecoveryZkTest, TestReplicationHandler, TestDistributedGrouping, TestHashPartitioner, HardAutoCommitTest, TestRangeQuery, SimpleFacetsTest, TestGroupingSearch, BasicFunctionalityTest, TestBadConfig, DistributedQueryElevationComponentTest, TestCoreDiscovery, TestFoldingMultitermQuery, SuggesterTest, TestCSVLoader, PolyFieldTest, NoCacheHeaderTest, SchemaVersionSpecificBehaviorTest, TestPseudoReturnFields, TestUpdate, TestAtomicUpdateErrorCases, TestRemoteStreaming, DistanceFunctionTest, SolrInfoMBeanTest, IndexBasedSpellCheckerTest, TestQueryUtils, TestReversedWildcardFilterFactory, FileBasedSpellCheckerTest, TestIndexingPerformance, TestSolrQueryParser, MBeansHandlerTest, CSVRequestHandlerTest, TestBinaryResponseWriter, SolrIndexConfigTest, TestConfig, TestCodecSupport, TestSweetSpotSimilarityFactory, TestLMDirichletSimilarityFactory, ResourceLoaderTest, TestFastLRUCache, TestSuggestSpellingConverter, RAMDirectoryFactoryTest, CursorPagingTest, TestJettySolrRunner, AliasIntegrationTest, CloudExitableDirectoryReaderTest, ConnectionManagerTest, DeleteReplicaTest, DistribDocExpirationUpdateProcessorTest, OverseerCollectionConfigSetProcessorTest, OverseerStatusTest, OverseerTaskQueueTest, SolrCloudExampleTest]
   [junit4] Completed [417/540] on J0 in 40.84s, 1 test, 1 failure <<< FAILURES!

[...truncated 390 lines...]
BUILD FAILED
/home/jenkins/workspace/Lucene-Solr-5.x-Linux/build.xml:785: The following error occurred while executing this line:
/home/jenkins/workspace/Lucene-Solr-5.x-Linux/build.xml:729: The following error occurred while executing this line:
/home/jenkins/workspace/Lucene-Solr-5.x-Linux/build.xml:59: The following error occurred while executing this line:
/home/jenkins/workspace/Lucene-Solr-5.x-Linux/solr/build.xml:233: The following error occurred while executing this line:
/home/jenkins/workspace/Lucene-Solr-5.x-Linux/solr/common-build.xml:526: The following error occurred while executing this line:
/home/jenkins/workspace/Lucene-Solr-5.x-Linux/lucene/common-build.xml:1452: The following error occurred while executing this line:
/home/jenkins/workspace/Lucene-Solr-5.x-Linux/lucene/common-build.xml:1006: There were test failures: 540 suites (7 ignored), 2131 tests, 1 failure, 71 ignored (35 assumptions) [seed: 30600CFFB245AF0E]

Total time: 55 minutes 7 seconds
Build step 'Invoke Ant' marked build as failure
Archiving artifacts
[WARNINGS] Skipping publisher since build result is FAILURE
Recording test results
Email was triggered for: Failure - Any
Sending email for trigger: Failure - Any