You are viewing a plain text version of this content. The canonical link for it is here.
Posted to builds@beam.apache.org by Apache Jenkins Server <je...@builds.apache.org> on 2023/05/05 17:04:10 UTC
Build failed in Jenkins: beam_PostCommit_Java_ValidatesRunner_Flink_Java11 #4441
See <https://ci-beam.apache.org/job/beam_PostCommit_Java_ValidatesRunner_Flink_Java11/4441/display/redirect?page=changes>
Changes:
[noreply] Bump github.com/aws/aws-sdk-go-v2/service/s3 in /sdks (#26565)
------------------------------------------
[...truncated 17.12 KB...]
> Task :sdks:java:io:google-cloud-platform:processResources NO-SOURCE
> Task :model:fn-execution:processResources
> Task :model:job-management:processResources
> Task :sdks:java:core:generateGrammarSource FROM-CACHE
> Task :sdks:java:extensions:protobuf:extractProto
> Task :sdks:java:extensions:protobuf:processResources NO-SOURCE
> Task :runners:flink:1.15:processResources
> Task :sdks:java:core:processResources
> Task :sdks:java:build-tools:compileJava FROM-CACHE
> Task :sdks:java:core:generateTestAvroProtocol NO-SOURCE
> Task :runners:flink:1.15:copyTestSourceOverrides
> Task :runners:flink:1.15:copyTestResourcesOverrides NO-SOURCE
> Task :runners:flink:1.15:processTestResources
> Task :sdks:java:build-tools:processResources
> Task :sdks:java:build-tools:classes
> Task :sdks:java:build-tools:jar
> Task :sdks:java:core:generateTestAvroJava
> Task :sdks:java:core:generateTestGrammarSource NO-SOURCE
> Task :sdks:java:core:processTestResources
> Task :model:pipeline:extractIncludeProto
> Task :model:pipeline:extractProto
> Task :model:pipeline:generateProto FROM-CACHE
> Task :model:pipeline:compileJava FROM-CACHE
> Task :model:pipeline:processResources
> Task :model:pipeline:classes
> Task :model:pipeline:jar
> Task :model:pipeline:shadowJar FROM-CACHE
> Task :model:fn-execution:extractIncludeProto
> Task :model:job-management:extractIncludeProto
> Task :model:fn-execution:generateProto FROM-CACHE
> Task :model:job-management:generateProto FROM-CACHE
> Task :model:job-management:compileJava FROM-CACHE
> Task :model:job-management:classes
> Task :model:fn-execution:compileJava FROM-CACHE
> Task :model:fn-execution:classes
> Task :model:job-management:shadowJar FROM-CACHE
> Task :model:fn-execution:shadowJar FROM-CACHE
> Task :sdks:java:core:compileJava FROM-CACHE
> Task :sdks:java:core:classes
> Task :sdks:java:core:shadowJar FROM-CACHE
> Task :sdks:java:extensions:arrow:compileJava FROM-CACHE
> Task :sdks:java:extensions:arrow:classes UP-TO-DATE
> Task :sdks:java:extensions:arrow:jar
> Task :sdks:java:extensions:avro:compileJava FROM-CACHE
> Task :sdks:java:extensions:avro:classes UP-TO-DATE
> Task :sdks:java:fn-execution:compileJava FROM-CACHE
> Task :sdks:java:fn-execution:classes UP-TO-DATE
> Task :sdks:java:extensions:avro:jar
> Task :sdks:java:fn-execution:jar
> Task :runners:core-construction-java:compileJava FROM-CACHE
> Task :runners:core-construction-java:classes UP-TO-DATE
> Task :sdks:java:extensions:protobuf:extractIncludeProto
> Task :runners:core-construction-java:jar
> Task :sdks:java:extensions:protobuf:generateProto NO-SOURCE
> Task :sdks:java:extensions:protobuf:compileJava FROM-CACHE
> Task :sdks:java:extensions:protobuf:classes UP-TO-DATE
> Task :sdks:java:extensions:protobuf:jar
> Task :runners:core-java:compileJava FROM-CACHE
> Task :runners:core-java:classes UP-TO-DATE
> Task :sdks:java:core:compileTestJava FROM-CACHE
> Task :sdks:java:core:testClasses
> Task :runners:core-java:jar
> Task :sdks:java:core:shadowTestJar FROM-CACHE
> Task :sdks:java:extensions:google-cloud-platform-core:compileJava FROM-CACHE
> Task :sdks:java:extensions:google-cloud-platform-core:classes UP-TO-DATE
> Task :sdks:java:harness:compileJava FROM-CACHE
> Task :sdks:java:harness:classes UP-TO-DATE
> Task :sdks:java:extensions:google-cloud-platform-core:jar
> Task :sdks:java:harness:jar
> Task :runners:java-fn-execution:compileJava FROM-CACHE
> Task :runners:java-fn-execution:classes UP-TO-DATE
> Task :runners:java-fn-execution:jar
> Task :runners:core-java:compileTestJava FROM-CACHE
> Task :runners:core-java:testClasses UP-TO-DATE
> Task :sdks:java:expansion-service:compileJava FROM-CACHE
> Task :sdks:java:expansion-service:classes UP-TO-DATE
> Task :runners:core-java:testJar
> Task :sdks:java:expansion-service:jar
> Task :runners:java-job-service:compileJava FROM-CACHE
> Task :runners:java-job-service:classes UP-TO-DATE
> Task :runners:java-job-service:jar
> Task :sdks:java:io:google-cloud-platform:compileJava FROM-CACHE
> Task :sdks:java:io:google-cloud-platform:classes UP-TO-DATE
> Task :sdks:java:io:google-cloud-platform:jar
> Task :runners:flink:1.15:compileJava
Note: Some input files use or override a deprecated API.
Note: Recompile with -Xlint:deprecation for details.
Note: Some input files use unchecked or unsafe operations.
Note: Recompile with -Xlint:unchecked for details.
> Task :runners:flink:1.15:classes
> Task :runners:flink:1.15:jar
> Task :runners:flink:1.15:compileTestJava
Note: Some input files use or override a deprecated API.
Note: Recompile with -Xlint:deprecation for details.
Note: Some input files use unchecked or unsafe operations.
Note: Recompile with -Xlint:unchecked for details.
> Task :runners:flink:1.15:testClasses
> Task :runners:flink:1.15:testJar
Deprecated Gradle features were used in this build, making it incompatible with Gradle 8.0.
You can use '--warning-mode all' to show the individual deprecation warnings and determine if they come from your own scripts or plugins.
See https://docs.gradle.org/7.5.1/userguide/command_line_interface.html#sec:command_line_warnings
BUILD SUCCESSFUL in 3m 53s
94 actionable tasks: 60 executed, 32 from cache, 2 up-to-date
Build scan background action failed.
java.lang.IllegalArgumentException: com.gradle.enterprise.gradleplugin.internal.extension.a is not an interface
at java.lang.reflect.Proxy$ProxyClassFactory.apply(Proxy.java:590)
at java.lang.reflect.Proxy$ProxyClassFactory.apply(Proxy.java:557)
at java.lang.reflect.WeakCache$Factory.get(WeakCache.java:230)
at java.lang.reflect.WeakCache.get(WeakCache.java:127)
at java.lang.reflect.Proxy.getProxyClass0(Proxy.java:419)
at java.lang.reflect.Proxy.newProxyInstance(Proxy.java:719)
at com.gradle.ProxyFactory$ProxyingInvocationHandler.createLocalProxy(ProxyFactory.java:66)
at com.gradle.ProxyFactory$ProxyingInvocationHandler.lambda$adaptActionArg$1(ProxyFactory.java:61)
at com.gradle.enterprise.gradleplugin.internal.extension.b$3.run(SourceFile:100)
at java.util.concurrent.Executors$RunnableAdapter.call(Executors.java:511)
at java.util.concurrent.FutureTask.run(FutureTask.java:266)
at java.util.concurrent.ThreadPoolExecutor.runWorker(ThreadPoolExecutor.java:1149)
at java.util.concurrent.ThreadPoolExecutor$Worker.run(ThreadPoolExecutor.java:624)
at java.lang.Thread.run(Thread.java:750)
Publishing build scan...
https://ge.apache.org/s/pknwi4ksyybhw
Build step 'Invoke Gradle script' changed build result to SUCCESS
[Gradle] - Launching build.
[src] $ <https://ci-beam.apache.org/job/beam_PostCommit_Java_ValidatesRunner_Flink_Java11/ws/src/gradlew> -x shadowJar -x shadowTestJar -x compileJava -x compileTestJava -x jar -x testJar -x classes -x testClasses -Dorg.gradle.java.home=/usr/lib/jvm/java-11-openjdk-amd64 --continue --max-workers=12 -Dorg.gradle.jvmargs=-Xms2g -Dorg.gradle.jvmargs=-Xmx6g -Dorg.gradle.vfs.watch=false -Pdocker-pull-licenses :runners:flink:1.15:validatesRunner
To honour the JVM settings for this build a single-use Daemon process will be forked. See https://docs.gradle.org/7.5.1/userguide/gradle_daemon.html#sec:disabling_the_daemon.
Daemon will be stopped at the end of the build
Configuration on demand is an incubating feature.
Gradle Enterprise plugins resolution: https://plugins.gradle.org/m2
Enforcing Gradle Enterprise: https://ge.apache.org, allowUntrustedServer: false
Applying com.gradle.CommonCustomUserDataGradlePlugin via init script
> Task :buildSrc:compileJava NO-SOURCE
> Task :buildSrc:compileGroovy
> Task :buildSrc:pluginDescriptors UP-TO-DATE
> Task :buildSrc:processResources UP-TO-DATE
> Task :buildSrc:classes
> Task :buildSrc:jar
> Task :buildSrc:assemble
> Task :buildSrc:spotlessGroovy UP-TO-DATE
> Task :buildSrc:spotlessGroovyCheck UP-TO-DATE
> Task :buildSrc:spotlessGroovyGradle UP-TO-DATE
> Task :buildSrc:spotlessGroovyGradleCheck UP-TO-DATE
> Task :buildSrc:spotlessCheck UP-TO-DATE
> Task :buildSrc:pluginUnderTestMetadata
> Task :buildSrc:compileTestJava NO-SOURCE
> Task :buildSrc:compileTestGroovy NO-SOURCE
> Task :buildSrc:processTestResources NO-SOURCE
> Task :buildSrc:testClasses UP-TO-DATE
> Task :buildSrc:test NO-SOURCE
> Task :buildSrc:validatePlugins
> Task :buildSrc:check
> Task :buildSrc:build
> Configure project :sdks:java:container:java8
docker-pull-licenses set, creating go-licenses
> Configure project :sdks:java:container:java11
docker-pull-licenses set, creating go-licenses
> Configure project :sdks:go:container
docker-pull-licenses set, running go-licenses
> Configure project :sdks:java:container:java17
docker-pull-licenses set, creating go-licenses
> Task :runners:flink:1.15:validatesRunnerBatch
WARNING: An illegal reflective access operation has occurred
WARNING: Illegal reflective access by org.apache.flink.api.java.ClosureCleaner (file:/home/jenkins/.gradle/caches/modules-2/files-2.1/org.apache.flink/flink-core/1.15.0/41836e7311354a678c72284a81fde0d0c48ed905/flink-core-1.15.0.jar) to field java.lang.String.value
WARNING: Please consider reporting this to the maintainers of org.apache.flink.api.java.ClosureCleaner
WARNING: Use --illegal-access=warn to enable warnings of further illegal reflective access operations
WARNING: All illegal access operations will be denied in a future release
> Task :runners:flink:1.15:validatesRunnerStreaming
WARNING: An illegal reflective access operation has occurred
WARNING: Illegal reflective access by org.apache.flink.api.java.ClosureCleaner (file:/home/jenkins/.gradle/caches/modules-2/files-2.1/org.apache.flink/flink-core/1.15.0/41836e7311354a678c72284a81fde0d0c48ed905/flink-core-1.15.0.jar) to field java.lang.String.value
WARNING: Please consider reporting this to the maintainers of org.apache.flink.api.java.ClosureCleaner
WARNING: Use --illegal-access=warn to enable warnings of further illegal reflective access operations
WARNING: All illegal access operations will be denied in a future release
WARNING: An illegal reflective access operation has occurred
WARNING: Illegal reflective access by org.apache.flink.api.java.ClosureCleaner (file:/home/jenkins/.gradle/caches/modules-2/files-2.1/org.apache.flink/flink-core/1.15.0/41836e7311354a678c72284a81fde0d0c48ed905/flink-core-1.15.0.jar) to field java.lang.String.value
WARNING: Please consider reporting this to the maintainers of org.apache.flink.api.java.ClosureCleaner
WARNING: Use --illegal-access=warn to enable warnings of further illegal reflective access operations
WARNING: All illegal access operations will be denied in a future release
org.apache.beam.sdk.transforms.ParDoLifecycleTest > testTeardownCalledAfterExceptionInProcessElementStateful FAILED
java.lang.AssertionError at Assert.java:89
322 tests completed, 1 failed, 2 skipped
> Task :runners:flink:1.15:validatesRunnerStreaming FAILED
> Task :runners:flink:1.15:validatesRunnerStreamingCheckpointing
WARNING: An illegal reflective access operation has occurred
WARNING: Illegal reflective access by org.apache.flink.api.java.ClosureCleaner (file:/home/jenkins/.gradle/caches/modules-2/files-2.1/org.apache.flink/flink-core/1.15.0/41836e7311354a678c72284a81fde0d0c48ed905/flink-core-1.15.0.jar) to field java.lang.String.value
WARNING: Please consider reporting this to the maintainers of org.apache.flink.api.java.ClosureCleaner
WARNING: Use --illegal-access=warn to enable warnings of further illegal reflective access operations
WARNING: All illegal access operations will be denied in a future release
FAILURE: Build failed with an exception.
* What went wrong:
Execution failed for task ':runners:flink:1.15:validatesRunnerStreaming'.
> There were failing tests. See the report at: file://<https://ci-beam.apache.org/job/beam_PostCommit_Java_ValidatesRunner_Flink_Java11/ws/src/runners/flink/1.15/build/reports/tests/validatesRunnerStreaming/index.html>
* Try:
> Run with --stacktrace option to get the stack trace.
> Run with --info or --debug option to get more log output.
* Get more help at https://help.gradle.org
Deprecated Gradle features were used in this build, making it incompatible with Gradle 8.0.
You can use '--warning-mode all' to show the individual deprecation warnings and determine if they come from your own scripts or plugins.
See https://docs.gradle.org/7.5.1/userguide/command_line_interface.html#sec:command_line_warnings
BUILD FAILED in 18m 31s
13 actionable tasks: 7 executed, 6 up-to-date
Build scan background action failed.
java.lang.IllegalArgumentException: com.gradle.enterprise.gradleplugin.internal.extension.a is not an interface
at java.lang.reflect.Proxy$ProxyBuilder.validateProxyInterfaces(Proxy.java:688)
at java.lang.reflect.Proxy$ProxyBuilder.<init>(Proxy.java:627)
at java.lang.reflect.Proxy.lambda$getProxyConstructor$1(Proxy.java:426)
at jdk.internal.loader.AbstractClassLoaderValue$Memoizer.get(AbstractClassLoaderValue.java:329)
at jdk.internal.loader.AbstractClassLoaderValue.computeIfAbsent(AbstractClassLoaderValue.java:205)
at java.lang.reflect.Proxy.getProxyConstructor(Proxy.java:424)
at java.lang.reflect.Proxy.newProxyInstance(Proxy.java:1006)
at com.gradle.ProxyFactory$ProxyingInvocationHandler.createLocalProxy(ProxyFactory.java:66)
at com.gradle.ProxyFactory$ProxyingInvocationHandler.lambda$adaptActionArg$1(ProxyFactory.java:61)
at com.gradle.enterprise.gradleplugin.internal.extension.b$3.run(SourceFile:100)
at java.util.concurrent.Executors$RunnableAdapter.call(Executors.java:515)
at java.util.concurrent.FutureTask.run(FutureTask.java:264)
at java.util.concurrent.ThreadPoolExecutor.runWorker(ThreadPoolExecutor.java:1128)
at java.util.concurrent.ThreadPoolExecutor$Worker.run(ThreadPoolExecutor.java:628)
at java.lang.Thread.run(Thread.java:829)
Publishing build scan...
https://ge.apache.org/s/hhf7rdoddbyue
Build step 'Invoke Gradle script' changed build result to FAILURE
Build step 'Invoke Gradle script' marked build as failure
---------------------------------------------------------------------
To unsubscribe, e-mail: builds-unsubscribe@beam.apache.org
For additional commands, e-mail: builds-help@beam.apache.org
Jenkins build is back to normal : beam_PostCommit_Java_ValidatesRunner_Flink_Java11 #4445
Posted by Apache Jenkins Server <je...@builds.apache.org>.
See <https://ci-beam.apache.org/job/beam_PostCommit_Java_ValidatesRunner_Flink_Java11/4445/display/redirect?page=changes>
---------------------------------------------------------------------
To unsubscribe, e-mail: builds-unsubscribe@beam.apache.org
For additional commands, e-mail: builds-help@beam.apache.org
Build failed in Jenkins: beam_PostCommit_Java_ValidatesRunner_Flink_Java11 #4444
Posted by Apache Jenkins Server <je...@builds.apache.org>.
See <https://ci-beam.apache.org/job/beam_PostCommit_Java_ValidatesRunner_Flink_Java11/4444/display/redirect>
Changes:
------------------------------------------
[...truncated 14.41 KB...]
> Task :sdks:java:extensions:avro:generateAvroProtocol NO-SOURCE
> Task :sdks:java:extensions:arrow:processResources NO-SOURCE
> Task :sdks:java:harness:processResources NO-SOURCE
> Task :sdks:java:extensions:avro:generateAvroJava NO-SOURCE
> Task :model:job-management:extractProto
> Task :sdks:java:extensions:avro:processResources NO-SOURCE
> Task :model:fn-execution:extractProto
> Task :sdks:java:extensions:protobuf:createCheckerFrameworkManifest
> Task :sdks:java:io:google-cloud-platform:createCheckerFrameworkManifest
> Task :runners:flink:1.15:createCheckerFrameworkManifest
> Task :runners:flink:1.15:copyResourcesOverrides NO-SOURCE
> Task :sdks:java:io:google-cloud-platform:processResources NO-SOURCE
> Task :model:job-management:processResources
> Task :sdks:java:core:generateGrammarSource FROM-CACHE
> Task :sdks:java:extensions:protobuf:extractProto
> Task :runners:flink:1.15:processResources
> Task :model:fn-execution:processResources
> Task :sdks:java:extensions:protobuf:processResources NO-SOURCE
> Task :runners:flink:1.15:copyTestSourceOverrides
> Task :runners:flink:1.15:copyTestResourcesOverrides NO-SOURCE
> Task :sdks:java:core:processResources
> Task :sdks:java:core:generateTestAvroProtocol NO-SOURCE
> Task :runners:flink:1.15:processTestResources
> Task :sdks:java:build-tools:compileJava FROM-CACHE
> Task :sdks:java:build-tools:processResources
> Task :sdks:java:build-tools:classes
> Task :sdks:java:build-tools:jar
> Task :sdks:java:core:generateTestAvroJava
> Task :sdks:java:core:generateTestGrammarSource NO-SOURCE
> Task :sdks:java:core:processTestResources
> Task :model:pipeline:extractIncludeProto
> Task :model:pipeline:extractProto
> Task :model:pipeline:generateProto FROM-CACHE
> Task :model:pipeline:compileJava FROM-CACHE
> Task :model:pipeline:processResources
> Task :model:pipeline:classes
> Task :model:pipeline:jar
> Task :model:pipeline:shadowJar FROM-CACHE
> Task :model:job-management:extractIncludeProto
> Task :model:fn-execution:extractIncludeProto
> Task :model:job-management:generateProto FROM-CACHE
> Task :model:fn-execution:generateProto FROM-CACHE
> Task :model:job-management:compileJava FROM-CACHE
> Task :model:job-management:classes
> Task :model:fn-execution:compileJava FROM-CACHE
> Task :model:fn-execution:classes
> Task :model:fn-execution:shadowJar FROM-CACHE
> Task :model:job-management:shadowJar FROM-CACHE
> Task :sdks:java:core:compileJava FROM-CACHE
> Task :sdks:java:core:classes
> Task :sdks:java:core:shadowJar FROM-CACHE
> Task :sdks:java:extensions:arrow:compileJava FROM-CACHE
> Task :sdks:java:extensions:arrow:classes UP-TO-DATE
> Task :sdks:java:extensions:arrow:jar
> Task :sdks:java:extensions:avro:compileJava FROM-CACHE
> Task :sdks:java:extensions:avro:classes UP-TO-DATE
> Task :sdks:java:extensions:avro:jar
> Task :sdks:java:fn-execution:compileJava FROM-CACHE
> Task :sdks:java:fn-execution:classes UP-TO-DATE
> Task :sdks:java:fn-execution:jar
> Task :runners:core-construction-java:compileJava FROM-CACHE
> Task :runners:core-construction-java:classes UP-TO-DATE
> Task :sdks:java:extensions:protobuf:extractIncludeProto
> Task :sdks:java:extensions:protobuf:generateProto NO-SOURCE
> Task :runners:core-construction-java:jar
> Task :sdks:java:extensions:protobuf:compileJava FROM-CACHE
> Task :sdks:java:extensions:protobuf:classes UP-TO-DATE
> Task :sdks:java:extensions:protobuf:jar
> Task :runners:core-java:compileJava FROM-CACHE
> Task :runners:core-java:classes UP-TO-DATE
> Task :runners:core-java:jar
> Task :sdks:java:core:compileTestJava FROM-CACHE
> Task :sdks:java:core:testClasses
> Task :sdks:java:extensions:google-cloud-platform-core:compileJava FROM-CACHE
> Task :sdks:java:extensions:google-cloud-platform-core:classes UP-TO-DATE
> Task :sdks:java:harness:compileJava FROM-CACHE
> Task :sdks:java:core:shadowTestJar FROM-CACHE
> Task :sdks:java:harness:classes UP-TO-DATE
> Task :sdks:java:extensions:google-cloud-platform-core:jar
> Task :sdks:java:harness:jar
> Task :runners:java-fn-execution:compileJava FROM-CACHE
> Task :runners:java-fn-execution:classes UP-TO-DATE
> Task :runners:java-fn-execution:jar
> Task :sdks:java:expansion-service:compileJava FROM-CACHE
> Task :sdks:java:expansion-service:classes UP-TO-DATE
> Task :sdks:java:expansion-service:jar
> Task :runners:java-job-service:compileJava FROM-CACHE
> Task :runners:java-job-service:classes UP-TO-DATE
> Task :runners:java-job-service:jar
> Task :runners:core-java:compileTestJava FROM-CACHE
> Task :runners:core-java:testClasses UP-TO-DATE
> Task :runners:core-java:testJar
> Task :runners:flink:1.15:compileJava FROM-CACHE
> Task :runners:flink:1.15:classes
> Task :runners:flink:1.15:jar
> Task :sdks:java:io:google-cloud-platform:compileJava FROM-CACHE
> Task :sdks:java:io:google-cloud-platform:classes UP-TO-DATE
> Task :sdks:java:io:google-cloud-platform:jar
> Task :runners:flink:1.15:compileTestJava FROM-CACHE
> Task :runners:flink:1.15:testClasses
> Task :runners:flink:1.15:testJar
Deprecated Gradle features were used in this build, making it incompatible with Gradle 8.0.
You can use '--warning-mode all' to show the individual deprecation warnings and determine if they come from your own scripts or plugins.
See https://docs.gradle.org/7.5.1/userguide/command_line_interface.html#sec:command_line_warnings
BUILD SUCCESSFUL in 30s
94 actionable tasks: 58 executed, 34 from cache, 2 up-to-date
Build scan background action failed.
java.lang.IllegalArgumentException: com.gradle.enterprise.gradleplugin.internal.extension.a is not an interface
at java.lang.reflect.Proxy$ProxyClassFactory.apply(Proxy.java:590)
at java.lang.reflect.Proxy$ProxyClassFactory.apply(Proxy.java:557)
at java.lang.reflect.WeakCache$Factory.get(WeakCache.java:230)
at java.lang.reflect.WeakCache.get(WeakCache.java:127)
at java.lang.reflect.Proxy.getProxyClass0(Proxy.java:419)
at java.lang.reflect.Proxy.newProxyInstance(Proxy.java:719)
at com.gradle.ProxyFactory$ProxyingInvocationHandler.createLocalProxy(ProxyFactory.java:66)
at com.gradle.ProxyFactory$ProxyingInvocationHandler.lambda$adaptActionArg$1(ProxyFactory.java:61)
at com.gradle.enterprise.gradleplugin.internal.extension.b$3.run(SourceFile:100)
at java.util.concurrent.Executors$RunnableAdapter.call(Executors.java:511)
at java.util.concurrent.FutureTask.run(FutureTask.java:266)
at java.util.concurrent.ThreadPoolExecutor.runWorker(ThreadPoolExecutor.java:1149)
at java.util.concurrent.ThreadPoolExecutor$Worker.run(ThreadPoolExecutor.java:624)
at java.lang.Thread.run(Thread.java:750)
Publishing build scan...
https://ge.apache.org/s/4kaxxopcejhck
Build step 'Invoke Gradle script' changed build result to SUCCESS
[Gradle] - Launching build.
[src] $ <https://ci-beam.apache.org/job/beam_PostCommit_Java_ValidatesRunner_Flink_Java11/ws/src/gradlew> -x shadowJar -x shadowTestJar -x compileJava -x compileTestJava -x jar -x testJar -x classes -x testClasses -Dorg.gradle.java.home=/usr/lib/jvm/java-11-openjdk-amd64 --continue --max-workers=12 -Dorg.gradle.jvmargs=-Xms2g -Dorg.gradle.jvmargs=-Xmx6g -Dorg.gradle.vfs.watch=false -Pdocker-pull-licenses :runners:flink:1.15:validatesRunner
To honour the JVM settings for this build a single-use Daemon process will be forked. See https://docs.gradle.org/7.5.1/userguide/gradle_daemon.html#sec:disabling_the_daemon.
Daemon will be stopped at the end of the build
Configuration on demand is an incubating feature.
Gradle Enterprise plugins resolution: https://plugins.gradle.org/m2
Enforcing Gradle Enterprise: https://ge.apache.org, allowUntrustedServer: false
Applying com.gradle.CommonCustomUserDataGradlePlugin via init script
> Task :buildSrc:compileJava NO-SOURCE
> Task :buildSrc:compileGroovy
> Task :buildSrc:pluginDescriptors UP-TO-DATE
> Task :buildSrc:processResources UP-TO-DATE
> Task :buildSrc:classes
> Task :buildSrc:jar
> Task :buildSrc:assemble
> Task :buildSrc:spotlessGroovy UP-TO-DATE
> Task :buildSrc:spotlessGroovyCheck UP-TO-DATE
> Task :buildSrc:spotlessGroovyGradle UP-TO-DATE
> Task :buildSrc:spotlessGroovyGradleCheck UP-TO-DATE
> Task :buildSrc:spotlessCheck UP-TO-DATE
> Task :buildSrc:pluginUnderTestMetadata
> Task :buildSrc:compileTestJava NO-SOURCE
> Task :buildSrc:compileTestGroovy NO-SOURCE
> Task :buildSrc:processTestResources NO-SOURCE
> Task :buildSrc:testClasses UP-TO-DATE
> Task :buildSrc:test NO-SOURCE
> Task :buildSrc:validatePlugins
> Task :buildSrc:check
> Task :buildSrc:build
> Configure project :sdks:java:container:java8
docker-pull-licenses set, creating go-licenses
> Configure project :sdks:java:container:java11
docker-pull-licenses set, creating go-licenses
> Configure project :sdks:go:container
docker-pull-licenses set, running go-licenses
> Configure project :sdks:java:container:java17
docker-pull-licenses set, creating go-licenses
> Task :runners:flink:1.15:validatesRunnerBatch
WARNING: An illegal reflective access operation has occurred
WARNING: Illegal reflective access by org.apache.flink.api.java.ClosureCleaner (file:/home/jenkins/.gradle/caches/modules-2/files-2.1/org.apache.flink/flink-core/1.15.0/41836e7311354a678c72284a81fde0d0c48ed905/flink-core-1.15.0.jar) to field java.lang.String.value
WARNING: Please consider reporting this to the maintainers of org.apache.flink.api.java.ClosureCleaner
WARNING: Use --illegal-access=warn to enable warnings of further illegal reflective access operations
WARNING: All illegal access operations will be denied in a future release
org.apache.beam.sdk.transforms.ParDoLifecycleTest > testTeardownCalledAfterExceptionInStartBundleStateful FAILED
java.lang.RuntimeException at ParDoLifecycleTest.java:258
291 tests completed, 1 failed, 1 skipped
> Task :runners:flink:1.15:validatesRunnerBatch FAILED
> Task :runners:flink:1.15:validatesRunnerStreaming
WARNING: An illegal reflective access operation has occurred
WARNING: Illegal reflective access by org.apache.flink.api.java.ClosureCleaner (file:/home/jenkins/.gradle/caches/modules-2/files-2.1/org.apache.flink/flink-core/1.15.0/41836e7311354a678c72284a81fde0d0c48ed905/flink-core-1.15.0.jar) to field java.lang.String.value
WARNING: Please consider reporting this to the maintainers of org.apache.flink.api.java.ClosureCleaner
WARNING: Use --illegal-access=warn to enable warnings of further illegal reflective access operations
WARNING: All illegal access operations will be denied in a future release
WARNING: An illegal reflective access operation has occurred
WARNING: Illegal reflective access by org.apache.flink.api.java.ClosureCleaner (file:/home/jenkins/.gradle/caches/modules-2/files-2.1/org.apache.flink/flink-core/1.15.0/41836e7311354a678c72284a81fde0d0c48ed905/flink-core-1.15.0.jar) to field java.lang.String.value
WARNING: Please consider reporting this to the maintainers of org.apache.flink.api.java.ClosureCleaner
WARNING: Use --illegal-access=warn to enable warnings of further illegal reflective access operations
WARNING: All illegal access operations will be denied in a future release
> Task :runners:flink:1.15:validatesRunnerStreamingCheckpointing
WARNING: An illegal reflective access operation has occurred
WARNING: Illegal reflective access by org.apache.flink.api.java.ClosureCleaner (file:/home/jenkins/.gradle/caches/modules-2/files-2.1/org.apache.flink/flink-core/1.15.0/41836e7311354a678c72284a81fde0d0c48ed905/flink-core-1.15.0.jar) to field java.lang.String.value
WARNING: Please consider reporting this to the maintainers of org.apache.flink.api.java.ClosureCleaner
WARNING: Use --illegal-access=warn to enable warnings of further illegal reflective access operations
WARNING: All illegal access operations will be denied in a future release
FAILURE: Build failed with an exception.
* What went wrong:
Execution failed for task ':runners:flink:1.15:validatesRunnerBatch'.
> There were failing tests. See the report at: file://<https://ci-beam.apache.org/job/beam_PostCommit_Java_ValidatesRunner_Flink_Java11/ws/src/runners/flink/1.15/build/reports/tests/validatesRunnerBatch/index.html>
* Try:
> Run with --stacktrace option to get the stack trace.
> Run with --info or --debug option to get more log output.
* Get more help at https://help.gradle.org
Deprecated Gradle features were used in this build, making it incompatible with Gradle 8.0.
You can use '--warning-mode all' to show the individual deprecation warnings and determine if they come from your own scripts or plugins.
See https://docs.gradle.org/7.5.1/userguide/command_line_interface.html#sec:command_line_warnings
BUILD FAILED in 15m 52s
13 actionable tasks: 7 executed, 6 up-to-date
Build scan background action failed.
java.lang.IllegalArgumentException: com.gradle.enterprise.gradleplugin.internal.extension.a is not an interface
at java.lang.reflect.Proxy$ProxyBuilder.validateProxyInterfaces(Proxy.java:688)
at java.lang.reflect.Proxy$ProxyBuilder.<init>(Proxy.java:627)
at java.lang.reflect.Proxy.lambda$getProxyConstructor$1(Proxy.java:426)
at jdk.internal.loader.AbstractClassLoaderValue$Memoizer.get(AbstractClassLoaderValue.java:329)
at jdk.internal.loader.AbstractClassLoaderValue.computeIfAbsent(AbstractClassLoaderValue.java:205)
at java.lang.reflect.Proxy.getProxyConstructor(Proxy.java:424)
at java.lang.reflect.Proxy.newProxyInstance(Proxy.java:1006)
at com.gradle.ProxyFactory$ProxyingInvocationHandler.createLocalProxy(ProxyFactory.java:66)
at com.gradle.ProxyFactory$ProxyingInvocationHandler.lambda$adaptActionArg$1(ProxyFactory.java:61)
at com.gradle.enterprise.gradleplugin.internal.extension.b$3.run(SourceFile:100)
at java.util.concurrent.Executors$RunnableAdapter.call(Executors.java:515)
at java.util.concurrent.FutureTask.run(FutureTask.java:264)
at java.util.concurrent.ThreadPoolExecutor.runWorker(ThreadPoolExecutor.java:1128)
at java.util.concurrent.ThreadPoolExecutor$Worker.run(ThreadPoolExecutor.java:628)
at java.lang.Thread.run(Thread.java:829)
Publishing build scan...
https://ge.apache.org/s/nlwczkoten5tg
Build step 'Invoke Gradle script' changed build result to FAILURE
Build step 'Invoke Gradle script' marked build as failure
---------------------------------------------------------------------
To unsubscribe, e-mail: builds-unsubscribe@beam.apache.org
For additional commands, e-mail: builds-help@beam.apache.org
Build failed in Jenkins: beam_PostCommit_Java_ValidatesRunner_Flink_Java11 #4443
Posted by Apache Jenkins Server <je...@builds.apache.org>.
See <https://ci-beam.apache.org/job/beam_PostCommit_Java_ValidatesRunner_Flink_Java11/4443/display/redirect>
Changes:
------------------------------------------
[...truncated 5.62 KB...]
> Task :buildSrc:spotlessCheck UP-TO-DATE
> Task :buildSrc:pluginUnderTestMetadata
> Task :buildSrc:compileTestJava NO-SOURCE
> Task :buildSrc:compileTestGroovy NO-SOURCE
> Task :buildSrc:processTestResources NO-SOURCE
> Task :buildSrc:testClasses UP-TO-DATE
> Task :buildSrc:test NO-SOURCE
> Task :buildSrc:validatePlugins FROM-CACHE
> Task :buildSrc:check UP-TO-DATE
> Task :buildSrc:build
> Task :sdks:java:extensions:google-cloud-platform-core:createCheckerFrameworkManifest
> Task :runners:core-java:createCheckerFrameworkManifest
> Task :sdks:java:extensions:avro:createCheckerFrameworkManifest
> Task :sdks:java:expansion-service:createCheckerFrameworkManifest
> Task :sdks:java:core:createCheckerFrameworkManifest
> Task :model:job-management:createCheckerFrameworkManifest
> Task :runners:core-construction-java:createCheckerFrameworkManifest
> Task :sdks:java:fn-execution:createCheckerFrameworkManifest
> Task :sdks:java:build-tools:createCheckerFrameworkManifest
> Task :model:fn-execution:createCheckerFrameworkManifest
> Task :sdks:java:extensions:arrow:createCheckerFrameworkManifest
> Task :runners:java-fn-execution:createCheckerFrameworkManifest
> Task :runners:java-job-service:createCheckerFrameworkManifest
> Task :model:pipeline:createCheckerFrameworkManifest
> Task :sdks:java:harness:createCheckerFrameworkManifest
> Task :sdks:java:core:generateAvroProtocol NO-SOURCE
> Task :sdks:java:extensions:avro:generateAvroProtocol NO-SOURCE
> Task :sdks:java:extensions:google-cloud-platform-core:processResources NO-SOURCE
> Task :sdks:java:harness:processResources NO-SOURCE
> Task :sdks:java:extensions:arrow:processResources NO-SOURCE
> Task :runners:core-construction-java:processResources NO-SOURCE
> Task :runners:java-fn-execution:processResources NO-SOURCE
> Task :sdks:java:core:generateAvroJava NO-SOURCE
> Task :sdks:java:fn-execution:processResources NO-SOURCE
> Task :runners:java-job-service:processResources NO-SOURCE
> Task :sdks:java:extensions:avro:generateAvroJava NO-SOURCE
> Task :runners:core-java:processResources NO-SOURCE
> Task :runners:flink:1.15:copySourceOverrides
> Task :runners:core-java:processTestResources NO-SOURCE
> Task :sdks:java:extensions:avro:processResources NO-SOURCE
> Task :sdks:java:expansion-service:processResources NO-SOURCE
> Task :model:job-management:extractProto
> Task :model:fn-execution:extractProto
> Task :sdks:java:extensions:protobuf:createCheckerFrameworkManifest
> Task :sdks:java:extensions:protobuf:extractProto
> Task :sdks:java:io:google-cloud-platform:createCheckerFrameworkManifest
> Task :sdks:java:core:generateGrammarSource FROM-CACHE
> Task :sdks:java:extensions:protobuf:processResources NO-SOURCE
> Task :runners:flink:1.15:createCheckerFrameworkManifest
> Task :model:job-management:processResources
> Task :sdks:java:io:google-cloud-platform:processResources NO-SOURCE
> Task :runners:flink:1.15:copyResourcesOverrides NO-SOURCE
> Task :runners:flink:1.15:processResources
> Task :model:fn-execution:processResources
> Task :runners:flink:1.15:copyTestSourceOverrides
> Task :sdks:java:core:processResources
> Task :runners:flink:1.15:copyTestResourcesOverrides NO-SOURCE
> Task :sdks:java:core:generateTestAvroProtocol NO-SOURCE
> Task :runners:flink:1.15:processTestResources
> Task :sdks:java:build-tools:compileJava FROM-CACHE
> Task :sdks:java:build-tools:processResources
> Task :sdks:java:build-tools:classes
> Task :sdks:java:build-tools:jar
> Task :sdks:java:core:generateTestAvroJava
> Task :sdks:java:core:generateTestGrammarSource NO-SOURCE
> Task :sdks:java:core:processTestResources
> Task :model:pipeline:extractIncludeProto
> Task :model:pipeline:extractProto
> Task :model:pipeline:generateProto FROM-CACHE
> Task :model:pipeline:compileJava FROM-CACHE
> Task :model:pipeline:processResources
> Task :model:pipeline:classes
> Task :model:pipeline:jar
> Task :model:pipeline:shadowJar FROM-CACHE
> Task :model:fn-execution:extractIncludeProto
> Task :model:job-management:extractIncludeProto
> Task :model:fn-execution:generateProto FROM-CACHE
> Task :model:job-management:generateProto FROM-CACHE
> Task :model:job-management:compileJava FROM-CACHE
> Task :model:job-management:classes
> Task :model:fn-execution:compileJava FROM-CACHE
> Task :model:fn-execution:classes
> Task :model:job-management:shadowJar FROM-CACHE
> Task :model:fn-execution:shadowJar FROM-CACHE
> Task :sdks:java:core:compileJava FROM-CACHE
> Task :sdks:java:core:classes
> Task :sdks:java:core:shadowJar FROM-CACHE
> Task :sdks:java:extensions:arrow:compileJava FROM-CACHE
> Task :sdks:java:extensions:arrow:classes UP-TO-DATE
> Task :sdks:java:extensions:arrow:jar
> Task :sdks:java:extensions:avro:compileJava FROM-CACHE
> Task :sdks:java:extensions:avro:classes UP-TO-DATE
> Task :sdks:java:extensions:avro:jar
> Task :sdks:java:fn-execution:compileJava FROM-CACHE
> Task :sdks:java:fn-execution:classes UP-TO-DATE
> Task :sdks:java:fn-execution:jar
> Task :runners:core-construction-java:compileJava FROM-CACHE
> Task :runners:core-construction-java:classes UP-TO-DATE
> Task :runners:core-construction-java:jar
> Task :sdks:java:extensions:protobuf:extractIncludeProto
> Task :sdks:java:extensions:protobuf:generateProto NO-SOURCE
> Task :sdks:java:extensions:protobuf:compileJava FROM-CACHE
> Task :sdks:java:extensions:protobuf:classes UP-TO-DATE
> Task :sdks:java:extensions:protobuf:jar
> Task :runners:core-java:compileJava FROM-CACHE
> Task :runners:core-java:classes UP-TO-DATE
> Task :sdks:java:core:compileTestJava FROM-CACHE
> Task :sdks:java:core:testClasses
> Task :runners:core-java:jar
> Task :sdks:java:extensions:google-cloud-platform-core:compileJava FROM-CACHE
> Task :sdks:java:extensions:google-cloud-platform-core:classes UP-TO-DATE
> Task :sdks:java:core:shadowTestJar FROM-CACHE
> Task :sdks:java:harness:compileJava FROM-CACHE
> Task :sdks:java:harness:classes UP-TO-DATE
> Task :sdks:java:extensions:google-cloud-platform-core:jar
> Task :sdks:java:harness:jar
> Task :runners:java-fn-execution:compileJava FROM-CACHE
> Task :runners:java-fn-execution:classes UP-TO-DATE
> Task :runners:java-fn-execution:jar
> Task :sdks:java:expansion-service:compileJava FROM-CACHE
> Task :sdks:java:expansion-service:classes UP-TO-DATE
> Task :sdks:java:expansion-service:jar
> Task :runners:java-job-service:compileJava FROM-CACHE
> Task :runners:java-job-service:classes UP-TO-DATE
> Task :runners:core-java:compileTestJava FROM-CACHE
> Task :runners:core-java:testClasses UP-TO-DATE
> Task :runners:java-job-service:jar
> Task :runners:core-java:testJar
> Task :sdks:java:io:google-cloud-platform:compileJava FROM-CACHE
> Task :sdks:java:io:google-cloud-platform:classes UP-TO-DATE
> Task :sdks:java:io:google-cloud-platform:jar
> Task :runners:flink:1.15:compileJava
Note: Some input files use or override a deprecated API.
Note: Recompile with -Xlint:deprecation for details.
Note: Some input files use unchecked or unsafe operations.
Note: Recompile with -Xlint:unchecked for details.
> Task :runners:flink:1.15:classes
> Task :runners:flink:1.15:jar
> Task :runners:flink:1.15:compileTestJava
Note: Some input files use or override a deprecated API.
Note: Recompile with -Xlint:deprecation for details.
Note: Some input files use unchecked or unsafe operations.
Note: Recompile with -Xlint:unchecked for details.
> Task :runners:flink:1.15:testClasses
> Task :runners:flink:1.15:testJar
Deprecated Gradle features were used in this build, making it incompatible with Gradle 8.0.
You can use '--warning-mode all' to show the individual deprecation warnings and determine if they come from your own scripts or plugins.
See https://docs.gradle.org/7.5.1/userguide/command_line_interface.html#sec:command_line_warnings
BUILD SUCCESSFUL in 7m 35s
94 actionable tasks: 60 executed, 32 from cache, 2 up-to-date
Build scan background action failed.
java.lang.IllegalArgumentException: com.gradle.enterprise.gradleplugin.internal.extension.a is not an interface
at java.lang.reflect.Proxy$ProxyClassFactory.apply(Proxy.java:590)
at java.lang.reflect.Proxy$ProxyClassFactory.apply(Proxy.java:557)
at java.lang.reflect.WeakCache$Factory.get(WeakCache.java:230)
at java.lang.reflect.WeakCache.get(WeakCache.java:127)
at java.lang.reflect.Proxy.getProxyClass0(Proxy.java:419)
at java.lang.reflect.Proxy.newProxyInstance(Proxy.java:719)
at com.gradle.ProxyFactory$ProxyingInvocationHandler.createLocalProxy(ProxyFactory.java:66)
at com.gradle.ProxyFactory$ProxyingInvocationHandler.lambda$adaptActionArg$1(ProxyFactory.java:61)
at com.gradle.enterprise.gradleplugin.internal.extension.b$3.run(SourceFile:100)
at java.util.concurrent.Executors$RunnableAdapter.call(Executors.java:511)
at java.util.concurrent.FutureTask.run(FutureTask.java:266)
at java.util.concurrent.ThreadPoolExecutor.runWorker(ThreadPoolExecutor.java:1149)
at java.util.concurrent.ThreadPoolExecutor$Worker.run(ThreadPoolExecutor.java:624)
at java.lang.Thread.run(Thread.java:750)
Publishing build scan...
https://ge.apache.org/s/yofn3a22ru4ym
Build step 'Invoke Gradle script' changed build result to SUCCESS
[Gradle] - Launching build.
[src] $ <https://ci-beam.apache.org/job/beam_PostCommit_Java_ValidatesRunner_Flink_Java11/ws/src/gradlew> -x shadowJar -x shadowTestJar -x compileJava -x compileTestJava -x jar -x testJar -x classes -x testClasses -Dorg.gradle.java.home=/usr/lib/jvm/java-11-openjdk-amd64 --continue --max-workers=12 -Dorg.gradle.jvmargs=-Xms2g -Dorg.gradle.jvmargs=-Xmx6g -Dorg.gradle.vfs.watch=false -Pdocker-pull-licenses :runners:flink:1.15:validatesRunner
To honour the JVM settings for this build a single-use Daemon process will be forked. See https://docs.gradle.org/7.5.1/userguide/gradle_daemon.html#sec:disabling_the_daemon.
Daemon will be stopped at the end of the build
Configuration on demand is an incubating feature.
Gradle Enterprise plugins resolution: https://plugins.gradle.org/m2
Enforcing Gradle Enterprise: https://ge.apache.org, allowUntrustedServer: false
Applying com.gradle.CommonCustomUserDataGradlePlugin via init script
> Task :buildSrc:compileJava NO-SOURCE
> Task :buildSrc:compileGroovy
> Task :buildSrc:pluginDescriptors UP-TO-DATE
> Task :buildSrc:processResources UP-TO-DATE
> Task :buildSrc:classes
> Task :buildSrc:jar
> Task :buildSrc:assemble
> Task :buildSrc:spotlessGroovy UP-TO-DATE
> Task :buildSrc:spotlessGroovyCheck UP-TO-DATE
> Task :buildSrc:spotlessGroovyGradle UP-TO-DATE
> Task :buildSrc:spotlessGroovyGradleCheck UP-TO-DATE
> Task :buildSrc:spotlessCheck UP-TO-DATE
> Task :buildSrc:pluginUnderTestMetadata
> Task :buildSrc:compileTestJava NO-SOURCE
> Task :buildSrc:compileTestGroovy NO-SOURCE
> Task :buildSrc:processTestResources NO-SOURCE
> Task :buildSrc:testClasses UP-TO-DATE
> Task :buildSrc:test NO-SOURCE
> Task :buildSrc:validatePlugins
> Task :buildSrc:check
> Task :buildSrc:build
FAILURE: Build failed with an exception.
* What went wrong:
A problem occurred configuring root project 'beam'.
> Failed to store cache entry 0035f539b4ac91522cb926abf11c5a6b for Kotlin DSL plugin accessors for classpath 'e73f33679b85aedcab05ba0aed8f0a36': Timeout waiting to lock Build cache (/home/jenkins/.gradle/caches/build-cache-1). It is currently in use by another Gradle instance.
Owner PID: 3665832
Our PID: 3724517
Owner Operation:
Our operation:
Lock file: /home/jenkins/.gradle/caches/build-cache-1/build-cache-1.lock
* Try:
> Run with --stacktrace option to get the stack trace.
> Run with --info or --debug option to get more log output.
* Get more help at https://help.gradle.org
BUILD FAILED in 3m 51s
10 actionable tasks: 4 executed, 6 up-to-date
Build scan background action failed.
java.lang.IllegalArgumentException: com.gradle.enterprise.gradleplugin.internal.extension.a is not an interface
at java.lang.reflect.Proxy$ProxyBuilder.validateProxyInterfaces(Proxy.java:688)
at java.lang.reflect.Proxy$ProxyBuilder.<init>(Proxy.java:627)
at java.lang.reflect.Proxy.lambda$getProxyConstructor$1(Proxy.java:426)
at jdk.internal.loader.AbstractClassLoaderValue$Memoizer.get(AbstractClassLoaderValue.java:329)
at jdk.internal.loader.AbstractClassLoaderValue.computeIfAbsent(AbstractClassLoaderValue.java:205)
at java.lang.reflect.Proxy.getProxyConstructor(Proxy.java:424)
at java.lang.reflect.Proxy.newProxyInstance(Proxy.java:1006)
at com.gradle.ProxyFactory$ProxyingInvocationHandler.createLocalProxy(ProxyFactory.java:66)
at com.gradle.ProxyFactory$ProxyingInvocationHandler.lambda$adaptActionArg$1(ProxyFactory.java:61)
at com.gradle.enterprise.gradleplugin.internal.extension.b$3.run(SourceFile:100)
at java.util.concurrent.Executors$RunnableAdapter.call(Executors.java:515)
at java.util.concurrent.FutureTask.run(FutureTask.java:264)
at java.util.concurrent.ThreadPoolExecutor.runWorker(ThreadPoolExecutor.java:1128)
at java.util.concurrent.ThreadPoolExecutor$Worker.run(ThreadPoolExecutor.java:628)
at java.lang.Thread.run(Thread.java:829)
Publishing build scan...
https://ge.apache.org/s/x3w4z2vhblblc
Build step 'Invoke Gradle script' changed build result to FAILURE
Build step 'Invoke Gradle script' marked build as failure
---------------------------------------------------------------------
To unsubscribe, e-mail: builds-unsubscribe@beam.apache.org
For additional commands, e-mail: builds-help@beam.apache.org
Build failed in Jenkins: beam_PostCommit_Java_ValidatesRunner_Flink_Java11 #4442
Posted by Apache Jenkins Server <je...@builds.apache.org>.
See <https://ci-beam.apache.org/job/beam_PostCommit_Java_ValidatesRunner_Flink_Java11/4442/display/redirect>
Changes:
------------------------------------------
[...truncated 17.91 KB...]
> Task :runners:flink:1.15:createCheckerFrameworkManifest
> Task :model:fn-execution:processResources
> Task :runners:flink:1.15:copyResourcesOverrides NO-SOURCE
> Task :runners:flink:1.15:processResources
> Task :sdks:java:core:processResources
> Task :sdks:java:core:generateTestAvroProtocol NO-SOURCE
> Task :runners:flink:1.15:copyTestSourceOverrides
> Task :runners:flink:1.15:copyTestResourcesOverrides NO-SOURCE
> Task :runners:flink:1.15:processTestResources
> Task :sdks:java:build-tools:compileJava FROM-CACHE
> Task :sdks:java:build-tools:processResources
> Task :sdks:java:build-tools:classes
> Task :sdks:java:build-tools:jar
> Task :sdks:java:core:generateTestAvroJava
> Task :sdks:java:core:generateTestGrammarSource NO-SOURCE
> Task :sdks:java:core:processTestResources
> Task :model:pipeline:extractIncludeProto
> Task :model:pipeline:extractProto
> Task :model:pipeline:generateProto FROM-CACHE
> Task :model:pipeline:compileJava FROM-CACHE
> Task :model:pipeline:processResources
> Task :model:pipeline:classes
> Task :model:pipeline:jar
> Task :model:pipeline:shadowJar FROM-CACHE
> Task :model:job-management:extractIncludeProto
> Task :model:fn-execution:extractIncludeProto
> Task :model:job-management:generateProto FROM-CACHE
> Task :model:fn-execution:generateProto FROM-CACHE
> Task :model:job-management:compileJava FROM-CACHE
> Task :model:job-management:classes
> Task :model:fn-execution:compileJava FROM-CACHE
> Task :model:fn-execution:classes
> Task :model:job-management:shadowJar FROM-CACHE
> Task :model:fn-execution:shadowJar FROM-CACHE
> Task :sdks:java:core:compileJava FROM-CACHE
> Task :sdks:java:core:classes
> Task :sdks:java:core:shadowJar FROM-CACHE
> Task :sdks:java:extensions:avro:compileJava FROM-CACHE
> Task :sdks:java:extensions:avro:classes UP-TO-DATE
> Task :sdks:java:extensions:arrow:compileJava FROM-CACHE
> Task :sdks:java:extensions:arrow:classes UP-TO-DATE
> Task :sdks:java:extensions:arrow:jar
> Task :sdks:java:extensions:avro:jar
> Task :sdks:java:fn-execution:compileJava FROM-CACHE
> Task :sdks:java:fn-execution:classes UP-TO-DATE
> Task :sdks:java:fn-execution:jar
> Task :runners:core-construction-java:compileJava FROM-CACHE
> Task :runners:core-construction-java:classes UP-TO-DATE
> Task :sdks:java:extensions:protobuf:extractIncludeProto
> Task :sdks:java:extensions:protobuf:generateProto NO-SOURCE
> Task :sdks:java:extensions:protobuf:compileJava FROM-CACHE
> Task :sdks:java:extensions:protobuf:classes UP-TO-DATE
> Task :sdks:java:extensions:protobuf:jar
> Task :runners:core-construction-java:jar
> Task :runners:core-java:compileJava FROM-CACHE
> Task :runners:core-java:classes UP-TO-DATE
> Task :sdks:java:core:compileTestJava FROM-CACHE
> Task :sdks:java:core:testClasses
> Task :runners:core-java:jar
> Task :sdks:java:core:shadowTestJar FROM-CACHE
> Task :sdks:java:extensions:google-cloud-platform-core:compileJava FROM-CACHE
> Task :sdks:java:extensions:google-cloud-platform-core:classes UP-TO-DATE
> Task :sdks:java:harness:compileJava FROM-CACHE
> Task :sdks:java:harness:classes UP-TO-DATE
> Task :sdks:java:extensions:google-cloud-platform-core:jar
> Task :sdks:java:harness:jar
> Task :runners:java-fn-execution:compileJava FROM-CACHE
> Task :runners:java-fn-execution:classes UP-TO-DATE
> Task :runners:java-fn-execution:jar
> Task :sdks:java:expansion-service:compileJava FROM-CACHE
> Task :sdks:java:expansion-service:classes UP-TO-DATE
> Task :sdks:java:expansion-service:jar
> Task :runners:core-java:compileTestJava FROM-CACHE
> Task :runners:core-java:testClasses UP-TO-DATE
> Task :runners:core-java:testJar
> Task :runners:java-job-service:compileJava FROM-CACHE
> Task :runners:java-job-service:classes UP-TO-DATE
> Task :runners:java-job-service:jar
> Task :sdks:java:io:google-cloud-platform:compileJava FROM-CACHE
> Task :sdks:java:io:google-cloud-platform:classes UP-TO-DATE
> Task :sdks:java:io:google-cloud-platform:jar
> Task :runners:flink:1.15:compileJava
Note: Some input files use or override a deprecated API.
Note: Recompile with -Xlint:deprecation for details.
Note: Some input files use unchecked or unsafe operations.
Note: Recompile with -Xlint:unchecked for details.
> Task :runners:flink:1.15:classes
> Task :runners:flink:1.15:jar
> Task :runners:flink:1.15:compileTestJava
Note: Some input files use or override a deprecated API.
Note: Recompile with -Xlint:deprecation for details.
Note: Some input files use unchecked or unsafe operations.
Note: Recompile with -Xlint:unchecked for details.
> Task :runners:flink:1.15:testClasses
> Task :runners:flink:1.15:testJar
Deprecated Gradle features were used in this build, making it incompatible with Gradle 8.0.
You can use '--warning-mode all' to show the individual deprecation warnings and determine if they come from your own scripts or plugins.
See https://docs.gradle.org/7.5.1/userguide/command_line_interface.html#sec:command_line_warnings
BUILD SUCCESSFUL in 1m 35s
94 actionable tasks: 60 executed, 32 from cache, 2 up-to-date
Build scan background action failed.
java.lang.IllegalArgumentException: com.gradle.enterprise.gradleplugin.internal.extension.a is not an interface
at java.lang.reflect.Proxy$ProxyClassFactory.apply(Proxy.java:590)
at java.lang.reflect.Proxy$ProxyClassFactory.apply(Proxy.java:557)
at java.lang.reflect.WeakCache$Factory.get(WeakCache.java:230)
at java.lang.reflect.WeakCache.get(WeakCache.java:127)
at java.lang.reflect.Proxy.getProxyClass0(Proxy.java:419)
at java.lang.reflect.Proxy.newProxyInstance(Proxy.java:719)
at com.gradle.ProxyFactory$ProxyingInvocationHandler.createLocalProxy(ProxyFactory.java:66)
at com.gradle.ProxyFactory$ProxyingInvocationHandler.lambda$adaptActionArg$1(ProxyFactory.java:61)
at com.gradle.enterprise.gradleplugin.internal.extension.b$3.run(SourceFile:100)
at java.util.concurrent.Executors$RunnableAdapter.call(Executors.java:511)
at java.util.concurrent.FutureTask.run(FutureTask.java:266)
at java.util.concurrent.ThreadPoolExecutor.runWorker(ThreadPoolExecutor.java:1149)
at java.util.concurrent.ThreadPoolExecutor$Worker.run(ThreadPoolExecutor.java:624)
at java.lang.Thread.run(Thread.java:750)
Publishing build scan...
https://ge.apache.org/s/jtwhoyroiyafa
Build step 'Invoke Gradle script' changed build result to SUCCESS
[Gradle] - Launching build.
[src] $ <https://ci-beam.apache.org/job/beam_PostCommit_Java_ValidatesRunner_Flink_Java11/ws/src/gradlew> -x shadowJar -x shadowTestJar -x compileJava -x compileTestJava -x jar -x testJar -x classes -x testClasses -Dorg.gradle.java.home=/usr/lib/jvm/java-11-openjdk-amd64 --continue --max-workers=12 -Dorg.gradle.jvmargs=-Xms2g -Dorg.gradle.jvmargs=-Xmx6g -Dorg.gradle.vfs.watch=false -Pdocker-pull-licenses :runners:flink:1.15:validatesRunner
To honour the JVM settings for this build a single-use Daemon process will be forked. See https://docs.gradle.org/7.5.1/userguide/gradle_daemon.html#sec:disabling_the_daemon.
Daemon will be stopped at the end of the build
Configuration on demand is an incubating feature.
Gradle Enterprise plugins resolution: https://plugins.gradle.org/m2
Enforcing Gradle Enterprise: https://ge.apache.org, allowUntrustedServer: false
Applying com.gradle.CommonCustomUserDataGradlePlugin via init script
> Task :buildSrc:compileJava NO-SOURCE
> Task :buildSrc:compileGroovy FROM-CACHE
> Task :buildSrc:pluginDescriptors UP-TO-DATE
> Task :buildSrc:processResources UP-TO-DATE
> Task :buildSrc:classes UP-TO-DATE
> Task :buildSrc:jar
> Task :buildSrc:assemble
> Task :buildSrc:spotlessGroovy UP-TO-DATE
> Task :buildSrc:spotlessGroovyCheck UP-TO-DATE
> Task :buildSrc:spotlessGroovyGradle UP-TO-DATE
> Task :buildSrc:spotlessGroovyGradleCheck UP-TO-DATE
> Task :buildSrc:spotlessCheck UP-TO-DATE
> Task :buildSrc:pluginUnderTestMetadata
> Task :buildSrc:compileTestJava NO-SOURCE
> Task :buildSrc:compileTestGroovy NO-SOURCE
> Task :buildSrc:processTestResources NO-SOURCE
> Task :buildSrc:testClasses UP-TO-DATE
> Task :buildSrc:test NO-SOURCE
> Task :buildSrc:validatePlugins FROM-CACHE
> Task :buildSrc:check UP-TO-DATE
> Task :buildSrc:build
> Configure project :sdks:java:container:java8
docker-pull-licenses set, creating go-licenses
> Configure project :sdks:java:container:java11
docker-pull-licenses set, creating go-licenses
> Configure project :sdks:go:container
docker-pull-licenses set, running go-licenses
> Configure project :sdks:java:container:java17
docker-pull-licenses set, creating go-licenses
> Task :runners:flink:1.15:validatesRunnerBatch
WARNING: An illegal reflective access operation has occurred
WARNING: Illegal reflective access by org.apache.flink.api.java.ClosureCleaner (file:/home/jenkins/.gradle/caches/modules-2/files-2.1/org.apache.flink/flink-core/1.15.0/41836e7311354a678c72284a81fde0d0c48ed905/flink-core-1.15.0.jar) to field java.lang.String.value
WARNING: Please consider reporting this to the maintainers of org.apache.flink.api.java.ClosureCleaner
WARNING: Use --illegal-access=warn to enable warnings of further illegal reflective access operations
WARNING: All illegal access operations will be denied in a future release
> Task :runners:flink:1.15:validatesRunnerStreaming
WARNING: An illegal reflective access operation has occurred
WARNING: Illegal reflective access by org.apache.flink.api.java.ClosureCleaner (file:/home/jenkins/.gradle/caches/modules-2/files-2.1/org.apache.flink/flink-core/1.15.0/41836e7311354a678c72284a81fde0d0c48ed905/flink-core-1.15.0.jar) to field java.lang.String.value
WARNING: Please consider reporting this to the maintainers of org.apache.flink.api.java.ClosureCleaner
WARNING: Use --illegal-access=warn to enable warnings of further illegal reflective access operations
WARNING: All illegal access operations will be denied in a future release
WARNING: An illegal reflective access operation has occurred
WARNING: Illegal reflective access by org.apache.flink.api.java.ClosureCleaner (file:/home/jenkins/.gradle/caches/modules-2/files-2.1/org.apache.flink/flink-core/1.15.0/41836e7311354a678c72284a81fde0d0c48ed905/flink-core-1.15.0.jar) to field java.lang.String.value
WARNING: Please consider reporting this to the maintainers of org.apache.flink.api.java.ClosureCleaner
WARNING: Use --illegal-access=warn to enable warnings of further illegal reflective access operations
WARNING: All illegal access operations will be denied in a future release
org.apache.beam.sdk.transforms.ParDoLifecycleTest > testTeardownCalledAfterExceptionInProcessElementStateful FAILED
java.lang.AssertionError at Assert.java:89
org.apache.beam.sdk.transforms.ParDoLifecycleTest > testTeardownCalledAfterExceptionInStartBundleStateful FAILED
java.lang.AssertionError at Assert.java:89
322 tests completed, 2 failed, 2 skipped
> Task :runners:flink:1.15:validatesRunnerStreaming FAILED
> Task :runners:flink:1.15:validatesRunnerStreamingCheckpointing
WARNING: An illegal reflective access operation has occurred
WARNING: Illegal reflective access by org.apache.flink.api.java.ClosureCleaner (file:/home/jenkins/.gradle/caches/modules-2/files-2.1/org.apache.flink/flink-core/1.15.0/41836e7311354a678c72284a81fde0d0c48ed905/flink-core-1.15.0.jar) to field java.lang.String.value
WARNING: Please consider reporting this to the maintainers of org.apache.flink.api.java.ClosureCleaner
WARNING: Use --illegal-access=warn to enable warnings of further illegal reflective access operations
WARNING: All illegal access operations will be denied in a future release
FAILURE: Build failed with an exception.
* What went wrong:
Execution failed for task ':runners:flink:1.15:validatesRunnerStreaming'.
> There were failing tests. See the report at: file://<https://ci-beam.apache.org/job/beam_PostCommit_Java_ValidatesRunner_Flink_Java11/ws/src/runners/flink/1.15/build/reports/tests/validatesRunnerStreaming/index.html>
* Try:
> Run with --stacktrace option to get the stack trace.
> Run with --info or --debug option to get more log output.
* Get more help at https://help.gradle.org
Deprecated Gradle features were used in this build, making it incompatible with Gradle 8.0.
You can use '--warning-mode all' to show the individual deprecation warnings and determine if they come from your own scripts or plugins.
See https://docs.gradle.org/7.5.1/userguide/command_line_interface.html#sec:command_line_warnings
BUILD FAILED in 14m 26s
13 actionable tasks: 5 executed, 2 from cache, 6 up-to-date
Build scan background action failed.
java.lang.IllegalArgumentException: com.gradle.enterprise.gradleplugin.internal.extension.a is not an interface
at java.lang.reflect.Proxy$ProxyBuilder.validateProxyInterfaces(Proxy.java:688)
at java.lang.reflect.Proxy$ProxyBuilder.<init>(Proxy.java:627)
at java.lang.reflect.Proxy.lambda$getProxyConstructor$1(Proxy.java:426)
at jdk.internal.loader.AbstractClassLoaderValue$Memoizer.get(AbstractClassLoaderValue.java:329)
at jdk.internal.loader.AbstractClassLoaderValue.computeIfAbsent(AbstractClassLoaderValue.java:205)
at java.lang.reflect.Proxy.getProxyConstructor(Proxy.java:424)
at java.lang.reflect.Proxy.newProxyInstance(Proxy.java:1006)
at com.gradle.ProxyFactory$ProxyingInvocationHandler.createLocalProxy(ProxyFactory.java:66)
at com.gradle.ProxyFactory$ProxyingInvocationHandler.lambda$adaptActionArg$1(ProxyFactory.java:61)
at com.gradle.enterprise.gradleplugin.internal.extension.b$3.run(SourceFile:100)
at java.util.concurrent.Executors$RunnableAdapter.call(Executors.java:515)
at java.util.concurrent.FutureTask.run(FutureTask.java:264)
at java.util.concurrent.ThreadPoolExecutor.runWorker(ThreadPoolExecutor.java:1128)
at java.util.concurrent.ThreadPoolExecutor$Worker.run(ThreadPoolExecutor.java:628)
at java.lang.Thread.run(Thread.java:829)
Publishing build scan...
https://ge.apache.org/s/s5pv7tzxvseaa
Build step 'Invoke Gradle script' changed build result to FAILURE
Build step 'Invoke Gradle script' marked build as failure
---------------------------------------------------------------------
To unsubscribe, e-mail: builds-unsubscribe@beam.apache.org
For additional commands, e-mail: builds-help@beam.apache.org