You are viewing a plain text version of this content. The canonical link for it is here.
Posted to builds@cassandra.apache.org by Apache Jenkins Server <je...@builds.apache.org> on 2023/05/04 16:21:15 UTC

Build complete: Cassandra-4.0 #575 [UNSTABLE] 65c99bfc42015ccfbcbc8963b3fb3c2a761ea053

-------------------------------------------------------------------------------
Build Cassandra-4.0 #575 Still Unstable
URL: https://ci-cassandra.apache.org/job/Cassandra-4.0/575/
-------------------------------------------------------------------------------
Changes:
[Michael Semb Wever] Improve 'Not enough space for compaction' logging messages


-------------------------------------------------------------------------------
Failed Tests:
8 tests failed.
FAILED:  dtest-novnode.materialized_views_test.TestMaterializedViews.test_view_metadata_cleanup
FAILED:  dtest-novnode.repair_tests.incremental_repair_test.TestIncRepair.test_multiple_full_repairs_lcs
FAILED:  dtest.materialized_views_test.TestMaterializedViewsConsistency.test_multi_partition_consistent_reads_after_write
FAILED:  org.apache.cassandra.metrics.TableMetricsTest.testLoggedPartitionsPerBatch-cdc
FAILED:  org.apache.cassandra.tools.TopPartitionsTest.testServiceTopPartitionsSingleTable-compression
FAILED:  org.apache.cassandra.distributed.test.FailingRepairTest.testFailingMessage[VALIDATION_REQ/parallel/true]
FAILED:  org.apache.cassandra.distributed.test.FailingRepairTest.testFailingMessage[VALIDATION_REQ/parallel/true]
FAILED:  org.apache.cassandra.distributed.test.FailingRepairTest.testFailingMessage[VALIDATION_REQ/parallel/true]

-------------------------------------------------------------------------------
For complete test report and logs see https://nightlies.apache.org/cassandra/Cassandra-4.0/575/