You are viewing a plain text version of this content. The canonical link for it is here.
Posted to commits@myfaces.apache.org by Apache Jenkins Server <je...@builds.apache.org> on 2015/05/11 02:16:03 UTC

Build failed in Jenkins: myfaces-current-2.0 #3127

See <https://builds.apache.org/job/myfaces-current-2.0/3127/>

------------------------------------------
[...truncated 4637 lines...]
Tests run: 3, Failures: 0, Errors: 0, Skipped: 0, Time elapsed: 0.001 sec
Running org.apache.myfaces.shared.util.CachedStateUtilsAES_CBCTest
Tests run: 11, Failures: 0, Errors: 0, Skipped: 0, Time elapsed: 0.048 sec
Running org.apache.myfaces.shared.util.StateUtilsDefaultTest
Tests run: 11, Failures: 0, Errors: 0, Skipped: 0, Time elapsed: 0.01 sec
Running org.apache.myfaces.shared.util.StateUtilsAES_CBCTest
Tests run: 11, Failures: 0, Errors: 0, Skipped: 0, Time elapsed: 0.01 sec
Running org.apache.myfaces.shared.util.CachedStateUtilsBlowfish_ECBTest
Tests run: 11, Failures: 0, Errors: 0, Skipped: 0, Time elapsed: 0.017 sec
Running org.apache.myfaces.shared.util.SecretKeyConfigurationTest
Tests run: 4, Failures: 0, Errors: 0, Skipped: 0, Time elapsed: 0.002 sec
Running org.apache.myfaces.shared.util.InitVector_CBCTestCase
Tests run: 2, Failures: 0, Errors: 0, Skipped: 0, Time elapsed: 0.001 sec
Running org.apache.myfaces.shared.util.CachedStateUtilsTripleDES_ECBTest
Tests run: 11, Failures: 0, Errors: 0, Skipped: 0, Time elapsed: 0.01 sec
Running org.apache.myfaces.shared.util.CachedStateUtilsDefaultTest
Tests run: 11, Failures: 0, Errors: 0, Skipped: 0, Time elapsed: 0.01 sec
Running org.apache.myfaces.shared.renderkit.html.HtmlResponseWriterImplTest
Tests run: 13, Failures: 0, Errors: 0, Skipped: 0, Time elapsed: 0.031 sec
Running org.apache.myfaces.shared.renderkit.html.util.UnicodeEncoderTest
Tests run: 4, Failures: 0, Errors: 0, Skipped: 0, Time elapsed: 0.003 sec
Running org.apache.myfaces.shared.renderkit.html.util.HTMLEncoderTest
Tests run: 27, Failures: 0, Errors: 0, Skipped: 0, Time elapsed: 0.015 sec
Running org.apache.myfaces.shared.renderkit.html.util.HTMLEncoderWriterTest
Tests run: 26, Failures: 0, Errors: 0, Skipped: 0, Time elapsed: 0.014 sec
Running org.apache.myfaces.shared.renderkit.html.HtmlRendererUtilsTest
No Renderer found for component {Component-Path : [Class: javax.faces.component.html.HtmlInputText,Id: j_id__v_0]} (component-family=javax.faces.Input, renderer-type=javax.faces.Text)
May 11, 2015 12:14:20 AM javax.faces.component.UIComponentBase getRenderer
WARNING: No Renderer found for component {Component-Path : [Class: javax.faces.component.html.HtmlInputText,Id: j_id__v_0]} (component-family=javax.faces.Input, renderer-type=javax.faces.Text)
Tests run: 2, Failures: 0, Errors: 0, Skipped: 0, Time elapsed: 0.058 sec
Running org.apache.myfaces.shared.renderkit.RendererUtilsTest
No Renderer found for component {Component-Path : [Class: javax.faces.component.html.HtmlGraphicImage,Id: graphicImageId]} (component-family=javax.faces.Graphic, renderer-type=javax.faces.Image)
May 11, 2015 12:14:20 AM javax.faces.component.UIComponentBase getRenderer
WARNING: No Renderer found for component {Component-Path : [Class: javax.faces.component.html.HtmlGraphicImage,Id: graphicImageId]} (component-family=javax.faces.Graphic, renderer-type=javax.faces.Image)
Tests run: 7, Failures: 0, Errors: 0, Skipped: 0, Time elapsed: 0.235 sec
Running org.apache.myfaces.shared.renderkit.ContentTypeUtilsTest
Tests run: 2, Failures: 0, Errors: 0, Skipped: 0, Time elapsed: 0.003 sec
Running org.apache.myfaces.shared.application.DefaultViewHandlerSupportTest
Tests run: 8, Failures: 0, Errors: 0, Skipped: 0, Time elapsed: 0.013 sec
Running org.apache.myfaces.shared.webapp.webxml.ServletMappingTest
Tests run: 2, Failures: 0, Errors: 0, Skipped: 0, Time elapsed: 0.001 sec

Results :

Tests run: 209, Failures: 0, Errors: 0, Skipped: 0

[JENKINS] Recording test results
[INFO] [jar:jar {execution: default-jar}]
[INFO] Building jar: <https://builds.apache.org/job/myfaces-current-2.0/ws/current20/core/shared/target/myfaces-impl-shared-2.0.24-SNAPSHOT.jar>
[INFO] Preparing source:jar
[WARNING] Removing: jar from forked lifecycle, to prevent recursive invocation.
[INFO] [myfaces-builder:build-metadata {execution: makemyfacesmetadata}]
[INFO] model is up to date
ERROR: Could not find local repository for 2.2.1
[INFO] [source:jar {execution: attach-source}]
[INFO] Building jar: <https://builds.apache.org/job/myfaces-current-2.0/ws/current20/core/shared/target/myfaces-impl-shared-2.0.24-SNAPSHOT-sources.jar>
[INFO] [shade:shade {execution: default}]
[INFO] Excluding org.apache.myfaces.core:myfaces-api:jar:2.0.24-SNAPSHOT from the shaded jar.
[INFO] Including org.apache.myfaces.core.internal:myfaces-impl-shared-public:jar:2.0.24-SNAPSHOT in the shaded jar.
[INFO] snapshot org.apache.myfaces.core.internal:myfaces-impl-shared-public:2.0.24-SNAPSHOT: checking for updates from tomcat
[INFO] snapshot org.apache.myfaces.core.internal:myfaces-impl-shared-public:2.0.24-SNAPSHOT: checking for updates from apache.snapshots
[INFO] Excluding commons-codec:commons-codec:jar:1.3 from the shaded jar.
[WARNING] We have a duplicate org/apache/myfaces/shared/util/ClassUtils.class in <https://builds.apache.org/job/myfaces-current-2.0/ws/current20/core/shared-public/target/myfaces-impl-shared-public-2.0.24-SNAPSHOT.jar>
[INFO] Replacing original artifact with shaded artifact.
[INFO] Replacing <https://builds.apache.org/job/myfaces-current-2.0/ws/current20/core/shared/target/myfaces-impl-shared-2.0.24-SNAPSHOT.jar> with <https://builds.apache.org/job/myfaces-current-2.0/ws/current20/core/shared/target/myfaces-impl-shared-2.0.24-SNAPSHOT-shaded.jar>
[INFO] Replacing <https://builds.apache.org/job/myfaces-current-2.0/ws/current20/core/shared/target/myfaces-impl-shared-2.0.24-SNAPSHOT-sources.jar> with <https://builds.apache.org/job/myfaces-current-2.0/ws/current20/core/shared/target/myfaces-impl-shared-2.0.24-SNAPSHOT-shaded-sources.jar>
[INFO] [checkstyle:check {execution: verify-style}]
[INFO] Starting audit...
Audit done.

[INFO] [install:install {execution: default-install}]
[INFO] Installing <https://builds.apache.org/job/myfaces-current-2.0/ws/current20/core/shared/target/myfaces-impl-shared-2.0.24-SNAPSHOT.jar> to /home/jenkins/jenkins-slave/maven-repositories/0/org/apache/myfaces/core/internal/myfaces-impl-shared/2.0.24-SNAPSHOT/myfaces-impl-shared-2.0.24-SNAPSHOT.jar
[INFO] Installing <https://builds.apache.org/job/myfaces-current-2.0/ws/current20/core/shared/target/myfaces-impl-shared-2.0.24-SNAPSHOT-sources.jar> to /home/jenkins/jenkins-slave/maven-repositories/0/org/apache/myfaces/core/internal/myfaces-impl-shared/2.0.24-SNAPSHOT/myfaces-impl-shared-2.0.24-SNAPSHOT-sources.jar
[INFO] Installing <https://builds.apache.org/job/myfaces-current-2.0/ws/current20/core/shared/target/myfaces-impl-shared-2.0.24-SNAPSHOT-sources.jar> to /home/jenkins/jenkins-slave/maven-repositories/0/org/apache/myfaces/core/internal/myfaces-impl-shared/2.0.24-SNAPSHOT/myfaces-impl-shared-2.0.24-SNAPSHOT-sources.jar
[INFO] [deploy:deploy {execution: default-deploy}]
[INFO] Retrieving previous build number from apache.snapshots.https
[WARNING] *** CHECKSUM FAILED - Checksum failed on download: local = '6c326203011f2b94769fa887349b6f25d82e1d52'; remote = 'fda769d75c1ede1dfde18a83c1c626b66fdb3bfc' - RETRYING
[WARNING] *** CHECKSUM FAILED - Checksum failed on download: local = '6c326203011f2b94769fa887349b6f25d82e1d52'; remote = 'fda769d75c1ede1dfde18a83c1c626b66fdb3bfc' - IGNORING
Uploading: https://repository.apache.org/content/repositories/snapshots/org/apache/myfaces/core/internal/myfaces-impl-shared/2.0.24-SNAPSHOT/myfaces-impl-shared-2.0.24-20150511.001046-151.jar
455K uploaded  (myfaces-impl-shared-2.0.24-20150511.001046-151.jar)
[INFO] Retrieving previous metadata from apache.snapshots.https
[INFO] Uploading repository metadata for: 'artifact org.apache.myfaces.core.internal:myfaces-impl-shared'
[INFO] Retrieving previous metadata from apache.snapshots.https
[WARNING] *** CHECKSUM FAILED - Checksum failed on download: local = '6c326203011f2b94769fa887349b6f25d82e1d52'; remote = 'fda769d75c1ede1dfde18a83c1c626b66fdb3bfc' - RETRYING
[WARNING] *** CHECKSUM FAILED - Checksum failed on download: local = '6c326203011f2b94769fa887349b6f25d82e1d52'; remote = 'fda769d75c1ede1dfde18a83c1c626b66fdb3bfc' - IGNORING
[INFO] Uploading repository metadata for: 'snapshot org.apache.myfaces.core.internal:myfaces-impl-shared:2.0.24-SNAPSHOT'
[INFO] Uploading project information for myfaces-impl-shared 2.0.24-20150511.001046-151
[INFO] Retrieving previous build number from apache.snapshots.https
Uploading: https://repository.apache.org/content/repositories/snapshots/org/apache/myfaces/core/internal/myfaces-impl-shared/2.0.24-SNAPSHOT/myfaces-impl-shared-2.0.24-20150511.001046-151-sources.jar
414K uploaded  (myfaces-impl-shared-2.0.24-20150511.001046-151-sources.jar)
[INFO] Retrieving previous build number from apache.snapshots.https
Uploading: https://repository.apache.org/content/repositories/snapshots/org/apache/myfaces/core/internal/myfaces-impl-shared/2.0.24-SNAPSHOT/myfaces-impl-shared-2.0.24-20150511.001046-151-sources.jar
414K uploaded  (myfaces-impl-shared-2.0.24-20150511.001046-151-sources.jar)
[INFO] ------------------------------------------------------------------------
[INFO] Building Apache MyFaces JSF-2.0 Core Impl for Java EE 6
[INFO]    task-segment: [clean, deploy]
[INFO] ------------------------------------------------------------------------
[INFO] [clean:clean {execution: default-clean}]
[INFO] [remote-resources:process {execution: default}]
[debug] execute contextualize
[INFO] [resources:resources {execution: default-resources}]
[INFO] Using 'UTF-8' encoding to copy filtered resources.
[INFO] Copying 1 resource
[INFO] Copying 3 resources
[INFO] [compiler:compile {execution: default-compile}]
[INFO] Compiling 1 source file to <https://builds.apache.org/job/myfaces-current-2.0/ws/current20/core/implee6/target/classes>
[debug] execute contextualize
[INFO] [resources:testResources {execution: default-testResources}]
[INFO] Using 'UTF-8' encoding to copy filtered resources.
[INFO] Copying 0 resource
[INFO] Copying 3 resources
[INFO] [compiler:testCompile {execution: default-testCompile}]
[INFO] Nothing to compile - all classes are up to date
[INFO] [surefire:test {execution: default-test}]
[INFO] Surefire report directory: <https://builds.apache.org/job/myfaces-current-2.0/ws/current20/core/implee6/target/surefire-reports>

-------------------------------------------------------
 T E S T S
-------------------------------------------------------

Results :

Tests run: 0, Failures: 0, Errors: 0, Skipped: 0

[JENKINS] Recording test results
[INFO] [jar:jar {execution: default-jar}]
[INFO] Building jar: <https://builds.apache.org/job/myfaces-current-2.0/ws/current20/core/implee6/target/myfaces-impl-ee6-2.0.24-SNAPSHOT.jar>
[INFO] Preparing source:jar
[WARNING] Removing: jar from forked lifecycle, to prevent recursive invocation.
[INFO] No goals needed for project - skipping
[INFO] [source:jar {execution: attach-source}]
[INFO] Building jar: <https://builds.apache.org/job/myfaces-current-2.0/ws/current20/core/implee6/target/myfaces-impl-ee6-2.0.24-SNAPSHOT-sources.jar>
[INFO] [checkstyle:check {execution: verify-style}]
[INFO] Starting audit...
Audit done.

[INFO] [install:install {execution: default-install}]
[INFO] Installing <https://builds.apache.org/job/myfaces-current-2.0/ws/current20/core/implee6/target/myfaces-impl-ee6-2.0.24-SNAPSHOT.jar> to /home/jenkins/jenkins-slave/maven-repositories/0/org/apache/myfaces/core/internal/myfaces-impl-ee6/2.0.24-SNAPSHOT/myfaces-impl-ee6-2.0.24-SNAPSHOT.jar
[INFO] Installing <https://builds.apache.org/job/myfaces-current-2.0/ws/current20/core/implee6/target/myfaces-impl-ee6-2.0.24-SNAPSHOT-sources.jar> to /home/jenkins/jenkins-slave/maven-repositories/0/org/apache/myfaces/core/internal/myfaces-impl-ee6/2.0.24-SNAPSHOT/myfaces-impl-ee6-2.0.24-SNAPSHOT-sources.jar
[INFO] [deploy:deploy {execution: default-deploy}]
[INFO] Retrieving previous build number from apache.snapshots.https
[WARNING] *** CHECKSUM FAILED - Checksum failed on download: local = 'bd347cfe351b9459aca767d74f93bc93d80447b3'; remote = 'c10333af195d998a03d50e591381d3484b8f8048' - RETRYING
[WARNING] *** CHECKSUM FAILED - Checksum failed on download: local = 'bd347cfe351b9459aca767d74f93bc93d80447b3'; remote = 'c10333af195d998a03d50e591381d3484b8f8048' - IGNORING
Uploading: https://repository.apache.org/content/repositories/snapshots/org/apache/myfaces/core/internal/myfaces-impl-ee6/2.0.24-SNAPSHOT/myfaces-impl-ee6-2.0.24-20150511.001046-150.jar
12K uploaded  (myfaces-impl-ee6-2.0.24-20150511.001046-150.jar)
[INFO] ------------------------------------------------------------------------
[ERROR] BUILD ERROR
[INFO] ------------------------------------------------------------------------
[INFO] Error deploying artifact: Failed to transfer file: https://repository.apache.org/content/repositories/snapshots/org/apache/myfaces/core/internal/myfaces-impl-ee6/2.0.24-SNAPSHOT/myfaces-impl-ee6-2.0.24-20150511.001046-150.jar.md5. Return code is: 502

[INFO] ------------------------------------------------------------------------
[INFO] For more information, run Maven with the -e switch
[INFO] ------------------------------------------------------------------------
[INFO] Total time: 5 minutes 16 seconds
[INFO] Finished at: Mon May 11 00:15:52 UTC 2015
[INFO] Final Memory: 152M/697M
[INFO] ------------------------------------------------------------------------
[JENKINS] Archiving <https://builds.apache.org/job/myfaces-current-2.0/ws/current20/shared/shared-tomahawk/pom.xml> to org.apache.myfaces.shared/myfaces-shared-tomahawk/4.0.23-SNAPSHOT/myfaces-shared-tomahawk-4.0.23-SNAPSHOT.pom
[JENKINS] Archiving <https://builds.apache.org/job/myfaces-current-2.0/ws/current20/shared/shared-tomahawk/target/myfaces-shared-tomahawk-4.0.23-SNAPSHOT.jar> to org.apache.myfaces.shared/myfaces-shared-tomahawk/4.0.23-SNAPSHOT/myfaces-shared-tomahawk-4.0.23-SNAPSHOT.jar
[JENKINS] Archiving <https://builds.apache.org/job/myfaces-current-2.0/ws/current20/shared/shared-tomahawk/target/myfaces-shared-tomahawk-4.0.23-SNAPSHOT.jar> to org.apache.myfaces.shared/myfaces-shared-tomahawk/4.0.23-20150511.001046-152/myfaces-shared-tomahawk-4.0.23-20150511.001046-152.jar
[JENKINS] Archiving <https://builds.apache.org/job/myfaces-current-2.0/ws/current20/shared/shared-tomahawk/target/myfaces-shared-tomahawk-4.0.23-SNAPSHOT-sources.jar> to org.apache.myfaces.shared/myfaces-shared-tomahawk/4.0.23-20150511.001046-152/myfaces-shared-tomahawk-4.0.23-20150511.001046-152-sources.jar
Sending artifact delta relative to myfaces-current-2.0 » MyFaces Shared Tomahawk #3125
Archived 4 artifacts
Archive block size is 32768
Received 0 blocks and 1260799 bytes
Compression is 0.0%
Took 1.1 sec
[JENKINS] Archiving <https://builds.apache.org/job/myfaces-current-2.0/ws/current20/core/shared-public/pom.xml> to org.apache.myfaces.core.internal/myfaces-impl-shared-public/2.0.24-SNAPSHOT/myfaces-impl-shared-public-2.0.24-SNAPSHOT.pom
[JENKINS] Archiving <https://builds.apache.org/job/myfaces-current-2.0/ws/current20/core/shared-public/target/myfaces-impl-shared-public-2.0.24-SNAPSHOT.jar> to org.apache.myfaces.core.internal/myfaces-impl-shared-public/2.0.24-SNAPSHOT/myfaces-impl-shared-public-2.0.24-SNAPSHOT.jar
[JENKINS] Archiving <https://builds.apache.org/job/myfaces-current-2.0/ws/current20/core/shared-public/target/myfaces-impl-shared-public-2.0.24-SNAPSHOT.jar> to org.apache.myfaces.core.internal/myfaces-impl-shared-public/2.0.24-20150511.001046-152/myfaces-impl-shared-public-2.0.24-20150511.001046-152.jar
[JENKINS] Archiving <https://builds.apache.org/job/myfaces-current-2.0/ws/current20/core/shared-public/target/myfaces-impl-shared-public-2.0.24-SNAPSHOT-sources.jar> to org.apache.myfaces.core.internal/myfaces-impl-shared-public/2.0.24-20150511.001046-152/myfaces-impl-shared-public-2.0.24-20150511.001046-152-sources.jar
Sending artifact delta relative to myfaces-current-2.0 » Apache MyFaces Shared Public API For JSF 2.0 - Core #3125
Archived 4 artifacts
Archive block size is 32768
Received 0 blocks and 276285 bytes
Compression is 0.0%
Took 0.45 sec
[JENKINS] Archiving <https://builds.apache.org/job/myfaces-current-2.0/ws/current20/shared/core/pom.xml> to org.apache.myfaces.shared/myfaces-shared-core/4.0.23-SNAPSHOT/myfaces-shared-core-4.0.23-SNAPSHOT.pom
[JENKINS] Archiving <https://builds.apache.org/job/myfaces-current-2.0/ws/current20/shared/core/target/myfaces-shared-core-4.0.23-SNAPSHOT.jar> to org.apache.myfaces.shared/myfaces-shared-core/4.0.23-20150511.001046-152/myfaces-shared-core-4.0.23-20150511.001046-152.jar
[JENKINS] Archiving <https://builds.apache.org/job/myfaces-current-2.0/ws/current20/shared/core/target/myfaces-shared-core-4.0.23-SNAPSHOT-sources.jar> to org.apache.myfaces.shared/myfaces-shared-core/4.0.23-20150511.001046-152/myfaces-shared-core-4.0.23-20150511.001046-152-sources.jar
Sending artifact delta relative to myfaces-current-2.0 » Apache MyFaces Shared For JSF 2.0 - Core Mirror #3125
Archived 3 artifacts
Archive block size is 32768
Received 0 blocks and 896858 bytes
Compression is 0.0%
Took 0.71 sec
[JENKINS] Archiving <https://builds.apache.org/job/myfaces-current-2.0/ws/current20/core/api/pom.xml> to org.apache.myfaces.core/myfaces-api/2.0.24-SNAPSHOT/myfaces-api-2.0.24-SNAPSHOT.pom
[JENKINS] Archiving <https://builds.apache.org/job/myfaces-current-2.0/ws/current20/core/api/target/myfaces-api-2.0.24-SNAPSHOT.jar> to org.apache.myfaces.core/myfaces-api/2.0.24-SNAPSHOT/myfaces-api-2.0.24-SNAPSHOT.jar
[JENKINS] Archiving <https://builds.apache.org/job/myfaces-current-2.0/ws/current20/core/api/target/myfaces-api-2.0.24-SNAPSHOT.jar> to org.apache.myfaces.core/myfaces-api/2.0.24-20150511.001046-152/myfaces-api-2.0.24-20150511.001046-152.jar
[JENKINS] Archiving <https://builds.apache.org/job/myfaces-current-2.0/ws/current20/core/api/target/myfaces-api-2.0.24-SNAPSHOT-sources.jar> to org.apache.myfaces.core/myfaces-api/2.0.24-20150511.001046-152/myfaces-api-2.0.24-20150511.001046-152-sources.jar
[JENKINS] Archiving <https://builds.apache.org/job/myfaces-current-2.0/ws/current20/core/api/target/myfaces-api-2.0.24-SNAPSHOT-tests.jar> to org.apache.myfaces.core/myfaces-api/2.0.24-20150511.001046-152/myfaces-api-2.0.24-20150511.001046-152-tests.jar
Sending artifact delta relative to myfaces-current-2.0 » Apache MyFaces JSF-2.0 Core API #3125
Archived 5 artifacts
Archive block size is 32768
Received 3 blocks and 3310164 bytes
Compression is 2.9%
Took 2.2 sec
[JENKINS] Archiving <https://builds.apache.org/job/myfaces-current-2.0/ws/current20/shared/pom.xml> to org.apache.myfaces.shared/myfaces-shared-project/4.0.23-SNAPSHOT/myfaces-shared-project-4.0.23-SNAPSHOT.pom
[JENKINS] Archiving /home/jenkins/jenkins-slave/maven-repositories/0/org/apache/myfaces/shared/myfaces-shared-project/4.0.23-SNAPSHOT/myfaces-shared-project-4.0.23-SNAPSHOT.pom to org.apache.myfaces.shared/myfaces-shared-project/4.0.23-20150511.001046-152/myfaces-shared-project-4.0.23-20150511.001046-152.pom
[JENKINS] Archiving <https://builds.apache.org/job/myfaces-current-2.0/ws/current20/shared/target/myfaces-shared-project-4.0.23-SNAPSHOT-site.xml> to org.apache.myfaces.shared/myfaces-shared-project/4.0.23-20150511.001046-152/myfaces-shared-project-4.0.23-20150511.001046-152-site.xml
/home/jenkins/jenkins-slave/maven-repositories/0/org/apache/myfaces/shared/myfaces-shared-project/4.0.23-SNAPSHOT/myfaces-shared-project-4.0.23-SNAPSHOT.pom is not inside <https://builds.apache.org/job/myfaces-current-2.0/ws/current20/shared/;> will archive in a separate pass
Sending artifact delta relative to myfaces-current-2.0 » Apache MyFaces Shared For JSF 2.0 - Project #3125
Archived 2 artifacts
Archive block size is 32768
Received 0 blocks and 10554 bytes
Compression is 0.0%
Took 0.16 sec
Sending artifact delta relative to myfaces-current-2.0 » Apache MyFaces Shared For JSF 2.0 - Project #3125
Archived 1 artifacts
Archive block size is 32768
Received 0 blocks and 8008 bytes
Compression is 0.0%
Took 27 ms
[JENKINS] Archiving <https://builds.apache.org/job/myfaces-current-2.0/ws/current20/core/parent/pom.xml> to org.apache.myfaces.core/myfaces-core-project/2.0.24-SNAPSHOT/myfaces-core-project-2.0.24-SNAPSHOT.pom
[JENKINS] Archiving /home/jenkins/jenkins-slave/maven-repositories/0/org/apache/myfaces/core/myfaces-core-project/2.0.24-SNAPSHOT/myfaces-core-project-2.0.24-SNAPSHOT.pom to org.apache.myfaces.core/myfaces-core-project/2.0.24-20150511.001046-152/myfaces-core-project-2.0.24-20150511.001046-152.pom
[JENKINS] Archiving <https://builds.apache.org/job/myfaces-current-2.0/ws/current20/core/parent/target/myfaces-core-project-2.0.24-SNAPSHOT-site.xml> to org.apache.myfaces.core/myfaces-core-project/2.0.24-20150511.001046-152/myfaces-core-project-2.0.24-20150511.001046-152-site.xml
/home/jenkins/jenkins-slave/maven-repositories/0/org/apache/myfaces/core/myfaces-core-project/2.0.24-SNAPSHOT/myfaces-core-project-2.0.24-SNAPSHOT.pom is not inside <https://builds.apache.org/job/myfaces-current-2.0/ws/current20/core/parent/;> will archive in a separate pass
Sending artifact delta relative to myfaces-current-2.0 » Apache MyFaces JSF-2.0 Core Project #3125
Archived 2 artifacts
Archive block size is 32768
Received 0 blocks and 30372 bytes
Compression is 0.0%
Took 0.11 sec
Sending artifact delta relative to myfaces-current-2.0 » Apache MyFaces JSF-2.0 Core Project #3125
Archived 1 artifacts
Archive block size is 32768
Received 0 blocks and 24146 bytes
Compression is 0.0%
Took 29 ms
[JENKINS] Archiving <https://builds.apache.org/job/myfaces-current-2.0/ws/current20/core/implee6/pom.xml> to org.apache.myfaces.core.internal/myfaces-impl-ee6/2.0.24-SNAPSHOT/myfaces-impl-ee6-2.0.24-SNAPSHOT.pom
[JENKINS] Archiving <https://builds.apache.org/job/myfaces-current-2.0/ws/current20/core/implee6/target/myfaces-impl-ee6-2.0.24-SNAPSHOT.jar> to org.apache.myfaces.core.internal/myfaces-impl-ee6/2.0.24-20150511.001046-150/myfaces-impl-ee6-2.0.24-20150511.001046-150.jar
[JENKINS] Archiving <https://builds.apache.org/job/myfaces-current-2.0/ws/current20/core/implee6/target/myfaces-impl-ee6-2.0.24-SNAPSHOT-sources.jar> to org.apache.myfaces.core.internal/myfaces-impl-ee6/2.0.24-20150511.001046-150/myfaces-impl-ee6-2.0.24-20150511.001046-150-sources.jar
Sending artifact delta relative to myfaces-current-2.0 » Apache MyFaces JSF-2.0 Core Impl for Java EE 6 #3125
Archived 3 artifacts
Archive block size is 32768
Received 0 blocks and 26467 bytes
Compression is 0.0%
Took 0.2 sec
[JENKINS] Archiving <https://builds.apache.org/job/myfaces-current-2.0/ws/current20/core/shared/pom.xml> to org.apache.myfaces.core.internal/myfaces-impl-shared/2.0.24-SNAPSHOT/myfaces-impl-shared-2.0.24-SNAPSHOT.pom
[JENKINS] Archiving <https://builds.apache.org/job/myfaces-current-2.0/ws/current20/core/shared/target/myfaces-impl-shared-2.0.24-SNAPSHOT.jar> to org.apache.myfaces.core.internal/myfaces-impl-shared/2.0.24-SNAPSHOT/myfaces-impl-shared-2.0.24-SNAPSHOT.jar
[JENKINS] Archiving <https://builds.apache.org/job/myfaces-current-2.0/ws/current20/core/shared/target/myfaces-impl-shared-2.0.24-SNAPSHOT.jar> to org.apache.myfaces.core.internal/myfaces-impl-shared/2.0.24-20150511.001046-151/myfaces-impl-shared-2.0.24-20150511.001046-151.jar
[JENKINS] Archiving <https://builds.apache.org/job/myfaces-current-2.0/ws/current20/core/shared/target/myfaces-impl-shared-2.0.24-SNAPSHOT-sources.jar> to org.apache.myfaces.core.internal/myfaces-impl-shared/2.0.24-20150511.001046-151/myfaces-impl-shared-2.0.24-20150511.001046-151-sources.jar
Sending artifact delta relative to myfaces-current-2.0 » Apache MyFaces Shared For JSF 2.0 - Core #3125
Archived 4 artifacts
Archive block size is 32768
Received 0 blocks and 1370140 bytes
Compression is 0.0%
Took 0.82 sec
channel stopped

Jenkins build is back to normal : myfaces-current-2.0 #3128

Posted by Apache Jenkins Server <je...@builds.apache.org>.
See <https://builds.apache.org/job/myfaces-current-2.0/3128/>