You are viewing a plain text version of this content. The canonical link for it is here.
Posted to builds@solr.apache.org by Apache Jenkins Server <je...@builds.apache.org> on 2024/04/13 00:50:36 UTC
[JENKINS] Solr » Solr-check-9.4 - Build # 1656 - Unstable!
Build: https://ci-builds.apache.org/job/Solr/job/Solr-check-9.4/1656/
1 tests failed.
FAILED: org.apache.solr.util.tracing.BasicAuthIntegrationTracingTest.classMethod
Error Message:
java.lang.Exception: Suite timeout exceeded (>= 7200000 msec).
Stack Trace:
java.lang.Exception: Suite timeout exceeded (>= 7200000 msec).
at __randomizedtesting.SeedInfo.seed([102D8E36F692C31C]:0)
Build Log:
[...truncated 5117 lines...]
ERROR: The following test(s) have failed:
- org.apache.solr.util.tracing.BasicAuthIntegrationTracingTest.classMethod (:solr:core)
Test output: /home/jenkins/jenkins-slave/workspace/Solr/Solr-check-9.4/solr/core/build/test-results/test/outputs/OUTPUT-org.apache.solr.util.tracing.BasicAuthIntegrationTracingTest.txt
Reproduce with: gradlew :solr:core:test --tests "org.apache.solr.util.tracing.BasicAuthIntegrationTracingTest.classMethod" -Ptests.jvms=4 -Ptests.haltonfailure=false "-Ptests.jvmargs=-XX:TieredStopAtLevel=1 -XX:+UseParallelGC -XX:ActiveProcessorCount=1 -XX:ReservedCodeCacheSize=120m" -Ptests.seed=102D8E36F692C31C -Ptests.multiplier=2 -Ptests.badapples=false -Ptests.file.encoding=US-ASCII
Deprecated Gradle features were used in this build, making it incompatible with Gradle 8.0.
You can use '--warning-mode all' to show the individual deprecation warnings and determine if they come from your own scripts or plugins.
See https://docs.gradle.org/7.6/userguide/command_line_interface.html#sec:command_line_warnings
BUILD SUCCESSFUL in 2h 58m 54s
685 actionable tasks: 685 executed
Publishing build scan...
https://ge.apache.org/s/b3zw466q3fqwi
Build step 'Invoke Gradle script' changed build result to SUCCESS
Archiving artifacts
‘**/*.events’ doesn’t match anything: ‘**’ exists but not ‘**/*.events’
No artifacts found that match the file pattern "**/*.events,heapdumps/**,**/hs_err_pid*". Configuration error?
Recording test results
[Checks API] No suitable checks publisher found.
Build step 'Publish JUnit test result report' changed build result to UNSTABLE
Email was triggered for: Unstable (Test Failures)
Sending email for trigger: Unstable (Test Failures)