You are viewing a plain text version of this content. The canonical link for it is here.
Posted to builds@beam.apache.org by Apache Jenkins Server <je...@builds.apache.org> on 2020/02/18 19:13:57 UTC

Build failed in Jenkins: beam_PostCommit_Python2 #1740

See <https://builds.apache.org/job/beam_PostCommit_Python2/1740/display/redirect>

Changes:


------------------------------------------
[...truncated 3.56 MB...]
[flink-runner-job-invoker] INFO org.apache.beam.runners.flink.FlinkPipelineRunner - Execution finished in 8411 msecs
[flink-runner-job-invoker] INFO org.apache.beam.runners.flink.FlinkPipelineRunner - Final accumulator values:
[flink-runner-job-invoker] INFO org.apache.beam.runners.flink.FlinkPipelineRunner - __metricscontainers : MetricQueryResults(Counters(42read/Read/_SDFBoundedSourceWrapper/Impulse.None/SplitAndSize0/beam:env:external:v1:0:beam:metric:element_count:v1 {PCOLLECTION=ref_PCollection_PCollection_1/SplitAndSize0}: 1, 19group/GroupByWindow.None/beam:env:external:v1:0:beam:metric:pardo_execution_time:finish_bundle_msecs:v1 {PTRANSFORM=fn/read/ref_PCollection_PCollection_7:0}: 0, 40write/Write/WriteImpl/DoOnce/Map(decode).None/beam:env:external:v1:2:beam:metric:element_count:v1 {PCOLLECTION=ref_PCollection_PCollection_12}: 1, 19group/GroupByWindow.None/beam:env:external:v1:0:beam:metric:pardo_execution_time:process_bundle_msecs:v1 {PTRANSFORM=fn/read/ref_PCollection_PCollection_7:0}: 0, 42read/Read/_SDFBoundedSourceWrapper/Impulse.None/beam:env:external:v1:0:beam:metric:element_count:v1 {PCOLLECTION=ref_PCollection_PCollection_1}: 1, 42read/Read/_SDFBoundedSourceWrapper/Impulse.None/SplitAndSize0/beam:env:external:v1:0:beam:metric:pardo_execution_time:process_bundle_msecs:v1 {PTRANSFORM=ref_AppliedPTransform_read/Read/_SDFBoundedSourceWrapper/ParDo(SDFBoundedSourceDoFn)_6/ProcessSizedElementsAndRestrictions0}: 0, 40write/Write/WriteImpl/DoOnce/Map(decode).None/beam:env:external:v1:0:beam:metric:pardo_execution_time:process_bundle_msecs:v1 {PTRANSFORM=fn/write/ref_PCollection_PCollection_13:0}: 0, 42read/Read/_SDFBoundedSourceWrapper/Impulse.None/beam:env:external:v1:0:beam:metric:pardo_execution_time:finish_bundle_msecs:v1 {PTRANSFORM=ref_AppliedPTransform_read/Read/_SDFBoundedSourceWrapper/ParDo(SDFBoundedSourceDoFn)_6/PairWithRestriction0}: 0, 42read/Read/_SDFBoundedSourceWrapper/Impulse.None/SplitAndSize0/beam:env:external:v1:0:beam:metric:pardo_execution_time:process_bundle_msecs:v1 {PTRANSFORM=fn/read/ref_PCollection_PCollection_1/SplitAndSize0:0}: 0, 6format.None/beam:env:external:v1:0:beam:metric:pardo_execution_time:process_bundle_msecs:v1 {PTRANSFORM=ref_AppliedPTransform_write/Write/WriteImpl/WindowInto(WindowIntoFn)_26}: 0, 19group/GroupByWindow.None/beam:env:external:v1:0:beam:metric:pardo_execution_time:start_bundle_msecs:v1 {PTRANSFORM=fn/read/ref_PCollection_PCollection_7:0}: 0, 40write/Write/WriteImpl/DoOnce/Map(decode).None/beam:env:external:v1:2:beam:metric:pardo_execution_time:start_bundle_msecs:v1 {PTRANSFORM=fn/write/ref_PCollection_PCollection_21:0}: 0, 40write/Write/WriteImpl/DoOnce/Map(decode).None/beam:env:external:v1:2:beam:metric:pardo_execution_time:finish_bundle_msecs:v1 {PTRANSFORM=fn/write/ref_PCollection_PCollection_21:0}: 0, 42read/Read/_SDFBoundedSourceWrapper/Impulse.None/beam:env:external:v1:0:beam:metric:pardo_execution_time:process_bundle_msecs:v1 {PTRANSFORM=ref_AppliedPTransform_read/Read/_SDFBoundedSourceWrapper/ParDo(SDFBoundedSourceDoFn)_6/SplitAndSize0}: 0, 19group/GroupByWindow.None/beam:env:external:v1:0:beam:metric:pardo_execution_time:finish_bundle_msecs:v1 {PTRANSFORM=ref_AppliedPTransform_format_14}: 0, 19group/GroupByWindow.None/beam:env:external:v1:0:beam:metric:element_count:v1 {PCOLLECTION=ref_PCollection_PCollection_7}: 44, 36write/Write/WriteImpl/DoOnce/Impulse.None/beam:env:external:v1:0:beam:metric:pardo_execution_time:finish_bundle_msecs:v1 {PTRANSFORM=fn/read/ref_PCollection_PCollection_10:0}: 0, 40write/Write/WriteImpl/DoOnce/Map(decode).None/beam:env:external:v1:2:beam:metric:pardo_execution_time:start_bundle_msecs:v1 {PTRANSFORM=fn/read/ref_PCollection_PCollection_12:0}: 0, 40write/Write/WriteImpl/DoOnce/Map(decode).None/beam:env:external:v1:0:beam:metric:pardo_execution_time:finish_bundle_msecs:v1 {PTRANSFORM=ref_AppliedPTransform_write/Write/WriteImpl/InitializeWrite_23}: 0, 36write/Write/WriteImpl/DoOnce/Impulse.None/beam:env:external:v1:0:beam:metric:pardo_execution_time:start_bundle_msecs:v1 {PTRANSFORM=fn/read/ref_PCollection_PCollection_10:0}: 0, 6format.None/beam:env:external:v1:0:beam:metric:ptransform_execution_time:total_msecs:v1 {PTRANSFORM=ref_AppliedPTransform_write/Write/WriteImpl/WindowInto(WindowIntoFn)_26}: 0, 42read/Read/_SDFBoundedSourceWrapper/Impulse.None/SplitAndSize0/beam:env:external:v1:0:beam:metric:pardo_execution_time:finish_bundle_msecs:v1 {PTRANSFORM=ref_AppliedPTransform_read/Read/_SDFBoundedSourceWrapper/ParDo(SDFBoundedSourceDoFn)_6/ProcessSizedElementsAndRestrictions0}: 0, 46write/Write/WriteImpl/GroupByKey/GroupByWindow.None/beam:env:external:v1:0:beam:metric:ptransform_execution_time:total_msecs:v1 {PTRANSFORM=ref_AppliedPTransform_write/Write/WriteImpl/Extract_31}: 0, 42read/Read/_SDFBoundedSourceWrapper/Impulse.None/SplitAndSize0/beam:env:external:v1:0:beam:metric:pardo_execution_time:finish_bundle_msecs:v1 {PTRANSFORM=fn/read/ref_PCollection_PCollection_1/SplitAndSize0:0}: 0, 42read/Read/_SDFBoundedSourceWrapper/Impulse.None/SplitAndSize0/beam:env:external:v1:0:beam:metric:ptransform_execution_time:total_msecs:v1 {PTRANSFORM=fn/read/ref_PCollection_PCollection_1/SplitAndSize0:0}: 0, 40write/Write/WriteImpl/DoOnce/Map(decode).None/beam:env:external:v1:2:beam:metric:pardo_execution_time:finish_bundle_msecs:v1 {PTRANSFORM=fn/read/ref_PCollection_PCollection_12:0}: 0, 36write/Write/WriteImpl/DoOnce/Impulse.None/beam:env:external:v1:0:beam:metric:ptransform_execution_time:total_msecs:v1 {PTRANSFORM=ref_AppliedPTransform_write/Write/WriteImpl/DoOnce/Map(decode)_22}: 0, 42read/Read/_SDFBoundedSourceWrapper/Impulse.None/SplitAndSize0/beam:env:external:v1:0:beam:metric:ptransform_execution_time:total_msecs:v1 {PTRANSFORM=ref_AppliedPTransform_read/Read/_SDFBoundedSourceWrapper/ParDo(SDFBoundedSourceDoFn)_6/ProcessSizedElementsAndRestrictions0}: 0, 46write/Write/WriteImpl/GroupByKey/GroupByWindow.None/beam:env:external:v1:0:beam:metric:pardo_execution_time:start_bundle_msecs:v1 {PTRANSFORM=fn/write/ref_PCollection_PCollection_20:0}: 0, 46write/Write/WriteImpl/GroupByKey/GroupByWindow.None/beam:env:external:v1:0:beam:metric:pardo_execution_time:finish_bundle_msecs:v1 {PTRANSFORM=fn/write/ref_PCollection_PCollection_20:0}: 0, 42read/Read/_SDFBoundedSourceWrapper/Impulse.None/beam:env:external:v1:0:beam:metric:ptransform_execution_time:total_msecs:v1 {PTRANSFORM=fn/read/ref_PCollection_PCollection_1:0}: 0, 6format.None/beam:env:external:v1:0:beam:metric:pardo_execution_time:finish_bundle_msecs:v1 {PTRANSFORM=ref_AppliedPTransform_write/Write/WriteImpl/WindowInto(WindowIntoFn)_26}: 0, 19group/GroupByWindow.None/beam:env:external:v1:0:beam:metric:element_count:v1 {PCOLLECTION=ref_PCollection_PCollection_8}: 44, 19group/GroupByWindow.None/beam:env:external:v1:0:beam:metric:element_count:v1 {PCOLLECTION=ref_PCollection_PCollection_9}: 44, 46write/Write/WriteImpl/GroupByKey/GroupByWindow.None/beam:env:external:v1:0:beam:metric:pardo_execution_time:process_bundle_msecs:v1 {PTRANSFORM=fn/write/ref_PCollection_PCollection_20:0}: 0, 42read/Read/_SDFBoundedSourceWrapper/Impulse.None/beam:env:external:v1:0:beam:metric:pardo_execution_time:start_bundle_msecs:v1 {PTRANSFORM=ref_AppliedPTransform_read/Read/_SDFBoundedSourceWrapper/ParDo(SDFBoundedSourceDoFn)_6/PairWithRestriction0}: 0, 36write/Write/WriteImpl/DoOnce/Impulse.None/beam:env:external:v1:0:beam:metric:pardo_execution_time:process_bundle_msecs:v1 {PTRANSFORM=fn/read/ref_PCollection_PCollection_10:0}: 0, 42read/Read/_SDFBoundedSourceWrapper/Impulse.None/beam:env:external:v1:0:beam:metric:pardo_execution_time:process_bundle_msecs:v1 {PTRANSFORM=ref_AppliedPTransform_read/Read/_SDFBoundedSourceWrapper/ParDo(SDFBoundedSourceDoFn)_6/PairWithRestriction0}: 0, 40write/Write/WriteImpl/DoOnce/Map(decode).None/beam:env:external:v1:2:beam:metric:pardo_execution_time:process_bundle_msecs:v1 {PTRANSFORM=fn/read/ref_PCollection_PCollection_12:0}: 0, 6format.None/beam:env:external:v1:0:beam:metric:pardo_execution_time:start_bundle_msecs:v1 {PTRANSFORM=ref_AppliedPTransform_write/Write/WriteImpl/WindowInto(WindowIntoFn)_26}: 0, 46write/Write/WriteImpl/GroupByKey/GroupByWindow.None/beam:env:external:v1:0:beam:metric:pardo_execution_time:start_bundle_msecs:v1 {PTRANSFORM=ref_AppliedPTransform_write/Write/WriteImpl/Extract_31}: 0, 40write/Write/WriteImpl/DoOnce/Map(decode).None/beam:env:external:v1:0:beam:metric:ptransform_execution_time:total_msecs:v1 {PTRANSFORM=ref_AppliedPTransform_write/Write/WriteImpl/InitializeWrite_23}: 0, 42read/Read/_SDFBoundedSourceWrapper/Impulse.None/SplitAndSize0/beam:env:external:v1:0:beam:metric:pardo_execution_time:start_bundle_msecs:v1 {PTRANSFORM=ref_AppliedPTransform_split_7}: 0, 6format.None/beam:env:external:v1:0:beam:metric:pardo_execution_time:process_bundle_msecs:v1 {PTRANSFORM=ref_AppliedPTransform_write/Write/WriteImpl/Pair_25}: 0, 46write/Write/WriteImpl/GroupByKey/GroupByWindow.None/beam:env:external:v1:0:beam:metric:pardo_execution_time:finish_bundle_msecs:v1 {PTRANSFORM=ref_AppliedPTransform_write/Write/WriteImpl/Extract_31}: 0, 6format.None/beam:env:external:v1:0:beam:metric:pardo_execution_time:finish_bundle_msecs:v1 {PTRANSFORM=ref_AppliedPTransform_write/Write/WriteImpl/Pair_25}: 0, 40write/Write/WriteImpl/DoOnce/Map(decode).None/beam:env:external:v1:1:beam:metric:ptransform_execution_time:total_msecs:v1 {PTRANSFORM=ref_AppliedPTransform_write/Write/WriteImpl/FinalizeWrite_33}: 0, 40write/Write/WriteImpl/DoOnce/Map(decode).None/beam:env:external:v1:2:beam:metric:ptransform_execution_time:total_msecs:v1 {PTRANSFORM=fn/read/ref_PCollection_PCollection_12:0}: 0, 36write/Write/WriteImpl/DoOnce/Impulse.None/beam:env:external:v1:0:beam:metric:ptransform_execution_time:total_msecs:v1 {PTRANSFORM=fn/read/ref_PCollection_PCollection_10:0}: 0, 42read/Read/_SDFBoundedSourceWrapper/Impulse.None/beam:env:external:v1:0:beam:metric:pardo_execution_time:process_bundle_msecs:v1 {PTRANSFORM=fn/write/ref_PCollection_PCollection_1/SplitAndSize0:0}: 0, 6format.None/beam:env:external:v1:0:beam:metric:pardo_execution_time:start_bundle_msecs:v1 {PTRANSFORM=fn/write/ref_PCollection_PCollection_16:0}: 0, 6format.None/beam:env:external:v1:0:beam:metric:pardo_execution_time:start_bundle_msecs:v1 {PTRANSFORM=fn/read/ref_PCollection_PCollection_9:0}: 0, 42read/Read/_SDFBoundedSourceWrapper/Impulse.None/beam:env:external:v1:0:beam:metric:ptransform_execution_time:total_msecs:v1 {PTRANSFORM=fn/write/ref_PCollection_PCollection_1/SplitAndSize0:0}: 0, 6format.None/beam:env:external:v1:0:beam:metric:pardo_execution_time:finish_bundle_msecs:v1 {PTRANSFORM=fn/read/ref_PCollection_PCollection_9:0}: 0, 40write/Write/WriteImpl/DoOnce/Map(decode).None/beam:env:external:v1:2:beam:metric:pardo_execution_time:start_bundle_msecs:v1 {PTRANSFORM=ref_AppliedPTransform_write/Write/WriteImpl/PreFinalize_32}: 0, 40write/Write/WriteImpl/DoOnce/Map(decode).None/beam:env:external:v1:2:beam:metric:pardo_execution_time:finish_bundle_msecs:v1 {PTRANSFORM=ref_AppliedPTransform_write/Write/WriteImpl/PreFinalize_32}: 0, 6format.None/beam:env:external:v1:0:beam:metric:pardo_execution_time:finish_bundle_msecs:v1 {PTRANSFORM=fn/write/ref_PCollection_PCollection_16:0}: 0, 6format.None/beam:env:external:v1:0:beam:metric:pardo_execution_time:process_bundle_msecs:v1 {PTRANSFORM=fn/read/ref_PCollection_PCollection_9:0}: 0, 42read/Read/_SDFBoundedSourceWrapper/Impulse.None/SplitAndSize0/beam:env:external:v1:0:beam:metric:pardo_execution_time:process_bundle_msecs:v1 {PTRANSFORM=ref_AppliedPTransform_split_7}: 0, 6format.None/beam:env:external:v1:0:beam:metric:pardo_execution_time:start_bundle_msecs:v1 {PTRANSFORM=ref_AppliedPTransform_write/Write/WriteImpl/Pair_25}: 0, 42read/Read/_SDFBoundedSourceWrapper/Impulse.None/SplitAndSize0/beam:env:external:v1:0:beam:metric:pardo_execution_time:finish_bundle_msecs:v1 {PTRANSFORM=ref_AppliedPTransform_split_7}: 0, 42read/Read/_SDFBoundedSourceWrapper/Impulse.None/beam:env:external:v1:0:beam:metric:pardo_execution_time:start_bundle_msecs:v1 {PTRANSFORM=ref_AppliedPTransform_read/Read/_SDFBoundedSourceWrapper/ParDo(SDFBoundedSourceDoFn)_6/SplitAndSize0}: 0, 40write/Write/WriteImpl/DoOnce/Map(decode).None/beam:env:external:v1:2:beam:metric:element_count:v1 {PCOLLECTION=ref_PCollection_PCollection_21}: 0, 42read/Read/_SDFBoundedSourceWrapper/Impulse.None/SplitAndSize0/beam:env:external:v1:0:beam:metric:pardo_execution_time:start_bundle_msecs:v1 {PTRANSFORM=ref_AppliedPTransform_pair_with_one_8}: 0, 19group/GroupByWindow.None/beam:env:external:v1:0:beam:metric:pardo_execution_time:start_bundle_msecs:v1 {PTRANSFORM=ref_AppliedPTransform_format_14}: 0, 36write/Write/WriteImpl/DoOnce/Impulse.None/beam:env:external:v1:0:beam:metric:pardo_execution_time:finish_bundle_msecs:v1 {PTRANSFORM=fn/write/ref_PCollection_PCollection_12:0}: 0, 19group/GroupByWindow.None/beam:env:external:v1:0:beam:metric:pardo_execution_time:start_bundle_msecs:v1 {PTRANSFORM=ref_AppliedPTransform_count_13}: 0, 19group/GroupByWindow.None/beam:env:external:v1:0:beam:metric:pardo_execution_time:process_bundle_msecs:v1 {PTRANSFORM=ref_AppliedPTransform_count_13}: 0, 42read/Read/_SDFBoundedSourceWrapper/Impulse.None/SplitAndSize0/beam:env:external:v1:0:beam:metric:pardo_execution_time:start_bundle_msecs:v1 {PTRANSFORM=fn/read/ref_PCollection_PCollection_1/SplitAndSize0:0}: 0, 42read/Read/_SDFBoundedSourceWrapper/Impulse.None/beam:env:external:v1:0:beam:metric:pardo_execution_time:finish_bundle_msecs:v1 {PTRANSFORM=ref_AppliedPTransform_read/Read/_SDFBoundedSourceWrapper/ParDo(SDFBoundedSourceDoFn)_6/SplitAndSize0}: 0, 40write/Write/WriteImpl/DoOnce/Map(decode).None/beam:env:external:v1:2:beam:metric:pardo_execution_time:process_bundle_msecs:v1 {PTRANSFORM=ref_AppliedPTransform_write/Write/WriteImpl/PreFinalize_32}: 0, 40write/Write/WriteImpl/DoOnce/Map(decode).None/beam:env:external:v1:0:beam:metric:pardo_execution_time:process_bundle_msecs:v1 {PTRANSFORM=ref_AppliedPTransform_write/Write/WriteImpl/InitializeWrite_23}: 0, 19group/GroupByWindow.None/beam:env:external:v1:0:beam:metric:pardo_execution_time:finish_bundle_msecs:v1 {PTRANSFORM=ref_AppliedPTransform_count_13}: 0, 36write/Write/WriteImpl/DoOnce/Impulse.None/beam:env:external:v1:0:beam:metric:pardo_execution_time:start_bundle_msecs:v1 {PTRANSFORM=fn/write/ref_PCollection_PCollection_12:0}: 0, 6format.None/beam:env:external:v1:0:beam:metric:ptransform_execution_time:total_msecs:v1 {PTRANSFORM=ref_AppliedPTransform_write/Write/WriteImpl/WriteBundles_24}: 0, 42read/Read/_SDFBoundedSourceWrapper/Impulse.None/SplitAndSize0/beam:env:external:v1:0:beam:metric:pardo_execution_time:finish_bundle_msecs:v1 {PTRANSFORM=ref_AppliedPTransform_pair_with_one_8}: 0, 46write/Write/WriteImpl/GroupByKey/GroupByWindow.None/beam:env:external:v1:0:beam:metric:pardo_execution_time:process_bundle_msecs:v1 {PTRANSFORM=ref_AppliedPTransform_write/Write/WriteImpl/Extract_31}: 0, 42read/Read/_SDFBoundedSourceWrapper/Impulse.None/beam:env:external:v1:0:beam:metric:pardo_execution_time:finish_bundle_msecs:v1 {PTRANSFORM=fn/read/ref_PCollection_PCollection_1:0}: 0, 42read/Read/_SDFBoundedSourceWrapper/Impulse.None/SplitAndSize0/beam:env:external:v1:0:beam:metric:user {NAMESPACE=__main__.WordExtractingDoFn, PTRANSFORM=ref_AppliedPTransform_split_7, NAME=words}: 96, 36write/Write/WriteImpl/DoOnce/Impulse.None/beam:env:external:v1:0:beam:metric:element_count:v1 {PCOLLECTION=ref_PCollection_PCollection_10}: 1, 6format.None/beam:env:external:v1:0:beam:metric:ptransform_execution_time:total_msecs:v1 {PTRANSFORM=fn/write/ref_PCollection_PCollection_16:0}: 0, 40write/Write/WriteImpl/DoOnce/Map(decode).None/beam:env:external:v1:2:beam:metric:pardo_execution_time:process_bundle_msecs:v1 {PTRANSFORM=fn/write/ref_PCollection_PCollection_21:0}: 0, 40write/Write/WriteImpl/DoOnce/Map(decode).None/beam:env:external:v1:1:beam:metric:pardo_execution_time:start_bundle_msecs:v1 {PTRANSFORM=ref_AppliedPTransform_write/Write/WriteImpl/FinalizeWrite_33}: 0, 36write/Write/WriteImpl/DoOnce/Impulse.None/beam:env:external:v1:0:beam:metric:element_count:v1 {PCOLLECTION=ref_PCollection_PCollection_11}: 1, 40write/Write/WriteImpl/DoOnce/Map(decode).None/beam:env:external:v1:1:beam:metric:pardo_execution_time:process_bundle_msecs:v1 {PTRANSFORM=fn/read/ref_PCollection_PCollection_12:0}: 0, 46write/Write/WriteImpl/GroupByKey/GroupByWindow.None/beam:env:external:v1:0:beam:metric:element_count:v1 {PCOLLECTION=ref_PCollection_PCollection_20}: 2, 19group/GroupByWindow.None/beam:env:external:v1:0:beam:metric:ptransform_execution_time:total_msecs:v1 {PTRANSFORM=ref_AppliedPTransform_count_13}: 0, 36write/Write/WriteImpl/DoOnce/Impulse.None/beam:env:external:v1:0:beam:metric:element_count:v1 {PCOLLECTION=ref_PCollection_PCollection_12}: 1, 6format.None/beam:env:external:v1:0:beam:metric:element_count:v1 {PCOLLECTION=ref_PCollection_PCollection_16}: 2, 6format.None/beam:env:external:v1:0:beam:metric:element_count:v1 {PCOLLECTION=ref_PCollection_PCollection_15}: 2, 40write/Write/WriteImpl/DoOnce/Map(decode).None/beam:env:external:v1:0:beam:metric:ptransform_execution_time:total_msecs:v1 {PTRANSFORM=fn/write/ref_PCollection_PCollection_13:0}: 0, 19group/GroupByWindow.None/beam:env:external:v1:0:beam:metric:pardo_execution_time:start_bundle_msecs:v1 {PTRANSFORM=fn/write/ref_PCollection_PCollection_9:0}: 0, 42read/Read/_SDFBoundedSourceWrapper/Impulse.None/beam:env:external:v1:0:beam:metric:pardo_execution_time:start_bundle_msecs:v1 {PTRANSFORM=fn/read/ref_PCollection_PCollection_1:0}: 0, 40write/Write/WriteImpl/DoOnce/Map(decode).None/beam:env:external:v1:1:beam:metric:pardo_execution_time:finish_bundle_msecs:v1 {PTRANSFORM=fn/read/ref_PCollection_PCollection_12:0}: 0, 42read/Read/_SDFBoundedSourceWrapper/Impulse.None/beam:env:external:v1:0:beam:metric:element_count:v1 {PCOLLECTION=ref_PCollection_PCollection_1/PairWithRestriction0}: 1, 42read/Read/_SDFBoundedSourceWrapper/Impulse.None/beam:env:external:v1:0:beam:metric:pardo_execution_time:process_bundle_msecs:v1 {PTRANSFORM=fn/read/ref_PCollection_PCollection_1:0}: 0, 42read/Read/_SDFBoundedSourceWrapper/Impulse.None/SplitAndSize0/beam:env:external:v1:0:beam:metric:pardo_execution_time:process_bundle_msecs:v1 {PTRANSFORM=fn/write/ref_PCollection_PCollection_4:0}: 0, 42read/Read/_SDFBoundedSourceWrapper/Impulse.None/SplitAndSize0/beam:env:external:v1:0:beam:metric:pardo_execution_time:finish_bundle_msecs:v1 {PTRANSFORM=fn/write/ref_PCollection_PCollection_4:0}: 0, 40write/Write/WriteImpl/DoOnce/Map(decode).None/beam:env:external:v1:2:beam:metric:ptransform_execution_time:total_msecs:v1 {PTRANSFORM=ref_AppliedPTransform_write/Write/WriteImpl/PreFinalize_32}: 0, 46write/Write/WriteImpl/GroupByKey/GroupByWindow.None/beam:env:external:v1:0:beam:metric:pardo_execution_time:process_bundle_msecs:v1 {PTRANSFORM=fn/read/ref_PCollection_PCollection_19:0}: 0, 6format.None/beam:env:external:v1:0:beam:metric:element_count:v1 {PCOLLECTION=ref_PCollection_PCollection_14}: 2, 40write/Write/WriteImpl/DoOnce/Map(decode).None/beam:env:external:v1:1:beam:metric:pardo_execution_time:start_bundle_msecs:v1 {PTRANSFORM=fn/read/ref_PCollection_PCollection_12:0}: 0, 19group/GroupByWindow.None/beam:env:external:v1:0:beam:metric:pardo_execution_time:process_bundle_msecs:v1 {PTRANSFORM=fn/write/ref_PCollection_PCollection_9:0}: 0, 19group/GroupByWindow.None/beam:env:external:v1:0:beam:metric:pardo_execution_time:finish_bundle_msecs:v1 {PTRANSFORM=fn/write/ref_PCollection_PCollection_9:0}: 0, 42read/Read/_SDFBoundedSourceWrapper/Impulse.None/SplitAndSize0/beam:env:external:v1:0:beam:metric:pardo_execution_time:start_bundle_msecs:v1 {PTRANSFORM=fn/write/ref_PCollection_PCollection_4:0}: 0, 42read/Read/_SDFBoundedSourceWrapper/Impulse.None/beam:env:external:v1:0:beam:metric:pardo_execution_time:start_bundle_msecs:v1 {PTRANSFORM=fn/write/ref_PCollection_PCollection_1/SplitAndSize0:0}: 0, 6format.None/beam:env:external:v1:0:beam:metric:pardo_execution_time:process_bundle_msecs:v1 {PTRANSFORM=fn/write/ref_PCollection_PCollection_16:0}: 0, 36write/Write/WriteImpl/DoOnce/Impulse.None/beam:env:external:v1:0:beam:metric:pardo_execution_time:process_bundle_msecs:v1 {PTRANSFORM=fn/write/ref_PCollection_PCollection_12:0}: 0, 42read/Read/_SDFBoundedSourceWrapper/Impulse.None/SplitAndSize0/beam:env:external:v1:0:beam:metric:ptransform_execution_time:total_msecs:v1 {PTRANSFORM=ref_AppliedPTransform_pair_with_one_8}: 0, 42read/Read/_SDFBoundedSourceWrapper/Impulse.None/beam:env:external:v1:0:beam:metric:element_count:v1 {PTRANSFORM=ref_AppliedPTransform_read/Read/_SDFBoundedSourceWrapper/ParDo(SDFBoundedSourceDoFn)_6/PairWithRestriction0, TAG=None}: 1, 40write/Write/WriteImpl/DoOnce/Map(decode).None/beam:env:external:v1:0:beam:metric:ptransform_execution_time:total_msecs:v1 {PTRANSFORM=fn/read/ref_PCollection_PCollection_12:0}: 0, 19group/GroupByWindow.None/beam:env:external:v1:0:beam:metric:ptransform_execution_time:total_msecs:v1 {PTRANSFORM=fn/read/ref_PCollection_PCollection_7:0}: 0, 42read/Read/_SDFBoundedSourceWrapper/Impulse.None/beam:env:external:v1:0:beam:metric:element_count:v1 {PTRANSFORM=ref_AppliedPTransform_read/Read/_SDFBoundedSourceWrapper/ParDo(SDFBoundedSourceDoFn)_6/SplitAndSize0, TAG=None}: 1, 42read/Read/_SDFBoundedSourceWrapper/Impulse.None/beam:env:external:v1:0:beam:metric:pardo_execution_time:finish_bundle_msecs:v1 {PTRANSFORM=fn/write/ref_PCollection_PCollection_1/SplitAndSize0:0}: 0, 36write/Write/WriteImpl/DoOnce/Impulse.None/beam:env:external:v1:0:beam:metric:ptransform_execution_time:total_msecs:v1 {PTRANSFORM=ref_AppliedPTransform_write/Write/WriteImpl/DoOnce/FlatMap(<lambda at core.py:2646>)_20}: 0, 46write/Write/WriteImpl/GroupByKey/GroupByWindow.None/beam:env:external:v1:0:beam:metric:pardo_execution_time:start_bundle_msecs:v1 {PTRANSFORM=fn/read/ref_PCollection_PCollection_19:0}: 0, 46write/Write/WriteImpl/GroupByKey/GroupByWindow.None/beam:env:external:v1:0:beam:metric:pardo_execution_time:finish_bundle_msecs:v1 {PTRANSFORM=fn/read/ref_PCollection_PCollection_19:0}: 0, 42read/Read/_SDFBoundedSourceWrapper/Impulse.None/SplitAndSize0/beam:env:external:v1:0:beam:metric:pardo_execution_time:process_bundle_msecs:v1 {PTRANSFORM=ref_AppliedPTransform_pair_with_one_8}: 0, 40write/Write/WriteImpl/DoOnce/Map(decode).None/beam:env:external:v1:1:beam:metric:element_count:v1 {PCOLLECTION=ref_PCollection_PCollection_12}: 1, 36write/Write/WriteImpl/DoOnce/Impulse.None/beam:env:external:v1:0:beam:metric:ptransform_execution_time:total_msecs:v1 {PTRANSFORM=fn/write/ref_PCollection_PCollection_12:0}: 0, 40write/Write/WriteImpl/DoOnce/Map(decode).None/beam:env:external:v1:0:beam:metric:pardo_execution_time:finish_bundle_msecs:v1 {PTRANSFORM=fn/read/ref_PCollection_PCollection_12:0}: 0, 40write/Write/WriteImpl/DoOnce/Map(decode).None/beam:env:external:v1:0:beam:metric:pardo_execution_time:finish_bundle_msecs:v1 {PTRANSFORM=fn/write/ref_PCollection_PCollection_13:0}: 0, 42read/Read/_SDFBoundedSourceWrapper/Impulse.None/SplitAndSize0/beam:env:external:v1:0:beam:metric:user {NAMESPACE=__main__.WordExtractingDoFn, PTRANSFORM=ref_AppliedPTransform_split_7, NAME=empty_lines}: 2, 46write/Write/WriteImpl/GroupByKey/GroupByWindow.None/beam:env:external:v1:0:beam:metric:element_count:v1 {PCOLLECTION=ref_PCollection_PCollection_19}: 1, 40write/Write/WriteImpl/DoOnce/Map(decode).None/beam:env:external:v1:0:beam:metric:pardo_execution_time:start_bundle_msecs:v1 {PTRANSFORM=fn/write/ref_PCollection_PCollection_13:0}: 0, 36write/Write/WriteImpl/DoOnce/Impulse.None/beam:env:external:v1:0:beam:metric:pardo_execution_time:process_bundle_msecs:v1 {PTRANSFORM=ref_AppliedPTransform_write/Write/WriteImpl/DoOnce/FlatMap(<lambda at core.py:2646>)_20}: 0, 19group/GroupByWindow.None/beam:env:external:v1:0:beam:metric:ptransform_execution_time:total_msecs:v1 {PTRANSFORM=ref_AppliedPTransform_format_14}: 0, 40write/Write/WriteImpl/DoOnce/Map(decode).None/beam:env:external:v1:0:beam:metric:element_count:v1 {PCOLLECTION=ref_PCollection_PCollection_13}: 1, 6format.None/beam:env:external:v1:0:beam:metric:pardo_execution_time:process_bundle_msecs:v1 {PTRANSFORM=ref_AppliedPTransform_write/Write/WriteImpl/WriteBundles_24}: 0, 36write/Write/WriteImpl/DoOnce/Impulse.None/beam:env:external:v1:0:beam:metric:pardo_execution_time:finish_bundle_msecs:v1 {PTRANSFORM=ref_AppliedPTransform_write/Write/WriteImpl/DoOnce/Map(decode)_22}: 0, 42read/Read/_SDFBoundedSourceWrapper/Impulse.None/SplitAndSize0/beam:env:external:v1:0:beam:metric:ptransform_execution_time:total_msecs:v1 {PTRANSFORM=ref_AppliedPTransform_split_7}: 0, 6format.None/beam:env:external:v1:0:beam:metric:pardo_execution_time:finish_bundle_msecs:v1 {PTRANSFORM=ref_AppliedPTransform_write/Write/WriteImpl/WriteBundles_24}: 0, 40write/Write/WriteImpl/DoOnce/Map(decode).None/beam:env:external:v1:1:beam:metric:element_count:v1 {PCOLLECTION=ref_PCollection_PCollection_22}: 2, 40write/Write/WriteImpl/DoOnce/Map(decode).None/beam:env:external:v1:2:beam:metric:ptransform_execution_time:total_msecs:v1 {PTRANSFORM=fn/write/ref_PCollection_PCollection_21:0}: 0, 40write/Write/WriteImpl/DoOnce/Map(decode).None/beam:env:external:v1:0:beam:metric:pardo_execution_time:process_bundle_msecs:v1 {PTRANSFORM=fn/read/ref_PCollection_PCollection_12:0}: 0, 36write/Write/WriteImpl/DoOnce/Impulse.None/beam:env:external:v1:0:beam:metric:pardo_execution_time:finish_bundle_msecs:v1 {PTRANSFORM=ref_AppliedPTransform_write/Write/WriteImpl/DoOnce/FlatMap(<lambda at core.py:2646>)_20}: 0, 19group/GroupByWindow.None/beam:env:external:v1:0:beam:metric:ptransform_execution_time:total_msecs:v1 {PTRANSFORM=fn/write/ref_PCollection_PCollection_9:0}: 0, 36write/Write/WriteImpl/DoOnce/Impulse.None/beam:env:external:v1:0:beam:metric:pardo_execution_time:process_bundle_msecs:v1 {PTRANSFORM=ref_AppliedPTransform_write/Write/WriteImpl/DoOnce/Map(decode)_22}: 0, 42read/Read/_SDFBoundedSourceWrapper/Impulse.None/SplitAndSize0/beam:env:external:v1:0:beam:metric:ptransform_execution_time:total_msecs:v1 {PTRANSFORM=fn/write/ref_PCollection_PCollection_4:0}: 0, 40write/Write/WriteImpl/DoOnce/Map(decode).None/beam:env:external:v1:0:beam:metric:element_count:v1 {PCOLLECTION=ref_PCollection_PCollection_12}: 1, 19group/GroupByWindow.None/beam:env:external:v1:0:beam:metric:pardo_execution_time:process_bundle_msecs:v1 {PTRANSFORM=ref_AppliedPTransform_format_14}: 0, 42read/Read/_SDFBoundedSourceWrapper/Impulse.None/SplitAndSize0/beam:env:external:v1:0:beam:metric:pardo_execution_time:start_bundle_msecs:v1 {PTRANSFORM=ref_AppliedPTransform_read/Read/_SDFBoundedSourceWrapper/ParDo(SDFBoundedSourceDoFn)_6/ProcessSizedElementsAndRestrictions0}: 0, 40write/Write/WriteImpl/DoOnce/Map(decode).None/beam:env:external:v1:1:beam:metric:pardo_execution_time:finish_bundle_msecs:v1 {PTRANSFORM=ref_AppliedPTransform_write/Write/WriteImpl/FinalizeWrite_33}: 0, 42read/Read/_SDFBoundedSourceWrapper/Impulse.None/SplitAndSize0/beam:env:external:v1:0:beam:metric:user {NAMESPACE=__main__.WordExtractingDoFn, PTRANSFORM=ref_AppliedPTransform_split_7, NAME=word_lengths}: 298, 40write/Write/WriteImpl/DoOnce/Map(decode).None/beam:env:external:v1:0:beam:metric:pardo_execution_time:start_bundle_msecs:v1 {PTRANSFORM=ref_AppliedPTransform_write/Write/WriteImpl/InitializeWrite_23}: 0, 42read/Read/_SDFBoundedSourceWrapper/Impulse.None/SplitAndSize0/beam:env:external:v1:0:beam:metric:element_count:v1 {PCOLLECTION=ref_PCollection_PCollection_2}: 27, 42read/Read/_SDFBoundedSourceWrapper/Impulse.None/beam:env:external:v1:0:beam:metric:ptransform_execution_time:total_msecs:v1 {PTRANSFORM=ref_AppliedPTransform_read/Read/_SDFBoundedSourceWrapper/ParDo(SDFBoundedSourceDoFn)_6/SplitAndSize0}: 0, 6format.None/beam:env:external:v1:0:beam:metric:pardo_execution_time:start_bundle_msecs:v1 {PTRANSFORM=ref_AppliedPTransform_write/Write/WriteImpl/WriteBundles_24}: 0, 42read/Read/_SDFBoundedSourceWrapper/Impulse.None/SplitAndSize0/beam:env:external:v1:0:beam:metric:element_count:v1 {PCOLLECTION=ref_PCollection_PCollection_4}: 96, 42read/Read/_SDFBoundedSourceWrapper/Impulse.None/beam:env:external:v1:0:beam:metric:element_count:v1 {PCOLLECTION=ref_PCollection_PCollection_1/SplitAndSize0}: 1, 6format.None/beam:env:external:v1:0:beam:metric:ptransform_execution_time:total_msecs:v1 {PTRANSFORM=ref_AppliedPTransform_write/Write/WriteImpl/Pair_25}: 0, 42read/Read/_SDFBoundedSourceWrapper/Impulse.None/SplitAndSize0/beam:env:external:v1:0:beam:metric:element_count:v1 {PCOLLECTION=ref_PCollection_PCollection_3}: 96, 6format.None/beam:env:external:v1:0:beam:metric:ptransform_execution_time:total_msecs:v1 {PTRANSFORM=fn/read/ref_PCollection_PCollection_9:0}: 0, 42read/Read/_SDFBoundedSourceWrapper/Impulse.None/beam:env:external:v1:0:beam:metric:ptransform_execution_time:total_msecs:v1 {PTRANSFORM=ref_AppliedPTransform_read/Read/_SDFBoundedSourceWrapper/ParDo(SDFBoundedSourceDoFn)_6/PairWithRestriction0}: 0, 46write/Write/WriteImpl/GroupByKey/GroupByWindow.None/beam:env:external:v1:0:beam:metric:ptransform_execution_time:total_msecs:v1 {PTRANSFORM=fn/read/ref_PCollection_PCollection_19:0}: 0, 40write/Write/WriteImpl/DoOnce/Map(decode).None/beam:env:external:v1:1:beam:metric:pardo_execution_time:process_bundle_msecs:v1 {PTRANSFORM=ref_AppliedPTransform_write/Write/WriteImpl/FinalizeWrite_33}: 0, 40write/Write/WriteImpl/DoOnce/Map(decode).None/beam:env:external:v1:0:beam:metric:pardo_execution_time:start_bundle_msecs:v1 {PTRANSFORM=fn/read/ref_PCollection_PCollection_12:0}: 0, 6format.None/beam:env:external:v1:0:beam:metric:element_count:v1 {PCOLLECTION=ref_PCollection_PCollection_9}: 44, 36write/Write/WriteImpl/DoOnce/Impulse.None/beam:env:external:v1:0:beam:metric:pardo_execution_time:start_bundle_msecs:v1 {PTRANSFORM=ref_AppliedPTransform_write/Write/WriteImpl/DoOnce/FlatMap(<lambda at core.py:2646>)_20}: 0, 36write/Write/WriteImpl/DoOnce/Impulse.None/beam:env:external:v1:0:beam:metric:pardo_execution_time:start_bundle_msecs:v1 {PTRANSFORM=ref_AppliedPTransform_write/Write/WriteImpl/DoOnce/Map(decode)_22}: 0, 46write/Write/WriteImpl/GroupByKey/GroupByWindow.None/beam:env:external:v1:0:beam:metric:ptransform_execution_time:total_msecs:v1 {PTRANSFORM=fn/write/ref_PCollection_PCollection_20:0}: 0, 40write/Write/WriteImpl/DoOnce/Map(decode).None/beam:env:external:v1:1:beam:metric:ptransform_execution_time:total_msecs:v1 {PTRANSFORM=fn/read/ref_PCollection_PCollection_12:0}: 0)Distributions(40write/Write/WriteImpl/DoOnce/Map(decode).None/beam:env:external:v1:0:beam:metric:sampled_byte_size:v1 {PCOLLECTION=ref_PCollection_PCollection_13}: DistributionResult{sum=81, count=1, min=81, max=81}, 42read/Read/_SDFBoundedSourceWrapper/Impulse.None/beam:env:external:v1:0:beam:metric:sampled_byte_size:v1 {PCOLLECTION=ref_PCollection_PCollection_1}: DistributionResult{sum=13, count=1, min=13, max=13}, 6format.None/beam:env:external:v1:0:beam:metric:sampled_byte_size:v1 {PCOLLECTION=ref_PCollection_PCollection_9}: DistributionResult{sum=767, count=36, min=19, max=28}, 42read/Read/_SDFBoundedSourceWrapper/Impulse.None/beam:env:external:v1:0:beam:metric:sampled_byte_size:v1 {PCOLLECTION=ref_PCollection_PCollection_1/PairWithRestriction0}: DistributionResult{sum=1112, count=1, min=1112, max=1112}, 40write/Write/WriteImpl/DoOnce/Map(decode).None/beam:env:external:v1:1:beam:metric:sampled_byte_size:v1 {PCOLLECTION=ref_PCollection_PCollection_12}: DistributionResult{sum=15, count=1, min=15, max=15}, 46write/Write/WriteImpl/GroupByKey/GroupByWindow.None/beam:env:external:v1:0:beam:metric:sampled_byte_size:v1 {PCOLLECTION=ref_PCollection_PCollection_19}: DistributionResult{sum=271, count=1, min=271, max=271}, 42read/Read/_SDFBoundedSourceWrapper/Impulse.None/SplitAndSize0/beam:env:external:v1:0:beam:metric:sampled_byte_size:v1 {PCOLLECTION=ref_PCollection_PCollection_1/SplitAndSize0}: DistributionResult{sum=945, count=1, min=945, max=945}, 42read/Read/_SDFBoundedSourceWrapper/Impulse.None/beam:env:external:v1:0:beam:metric:sampled_byte_size:v1 {PTRANSFORM=ref_AppliedPTransform_read/Read/_SDFBoundedSourceWrapper/ParDo(SDFBoundedSourceDoFn)_6/SplitAndSize0, TAG=None}: DistributionResult{sum=945, count=1, min=945, max=945}, 19group/GroupByWindow.None/beam:env:external:v1:0:beam:metric:sampled_byte_size:v1 {PCOLLECTION=ref_PCollection_PCollection_9}: DistributionResult{sum=806, count=40, min=18, max=24}, 6format.None/beam:env:external:v1:0:beam:metric:sampled_byte_size:v1 {PCOLLECTION=ref_PCollection_PCollection_15}: DistributionResult{sum=278, count=2, min=139, max=139}, 40write/Write/WriteImpl/DoOnce/Map(decode).None/beam:env:external:v1:0:beam:metric:sampled_byte_size:v1 {PCOLLECTION=ref_PCollection_PCollection_12}: DistributionResult{sum=15, count=1, min=15, max=15}, 19group/GroupByWindow.None/beam:env:external:v1:0:beam:metric:sampled_byte_size:v1 {PCOLLECTION=ref_PCollection_PCollection_8}: DistributionResult{sum=626, count=32, min=17, max=26}, 6format.None/beam:env:external:v1:0:beam:metric:sampled_byte_size:v1 {PCOLLECTION=ref_PCollection_PCollection_16}: DistributionResult{sum=278, count=2, min=139, max=139}, 19group/GroupByWindow.None/beam:env:external:v1:0:beam:metric:sampled_byte_size:v1 {PCOLLECTION=ref_PCollection_PCollection_7}: DistributionResult{sum=848, count=36, min=20, max=29}, 40write/Write/WriteImpl/DoOnce/Map(decode).None/beam:env:external:v1:2:beam:metric:sampled_byte_size:v1 {PCOLLECTION=ref_PCollection_PCollection_21}: DistributionResult{sum=0, count=0, min=9223372036854775807, max=-9223372036854775808}, 6format.None/beam:env:external:v1:0:beam:metric:sampled_byte_size:v1 {PCOLLECTION=ref_PCollection_PCollection_14}: DistributionResult{sum=276, count=2, min=138, max=138}, 42read/Read/_SDFBoundedSourceWrapper/Impulse.None/SplitAndSize0/beam:env:external:v1:0:beam:metric:sampled_byte_size:v1 {PCOLLECTION=ref_PCollection_PCollection_3}: DistributionResult{sum=547, count=34, min=14, max=20}, 40write/Write/WriteImpl/DoOnce/Map(decode).None/beam:env:external:v1:1:beam:metric:sampled_byte_size:v1 {PCOLLECTION=ref_PCollection_PCollection_22}: DistributionResult{sum=106, count=2, min=53, max=53}, 42read/Read/_SDFBoundedSourceWrapper/Impulse.None/SplitAndSize0/beam:env:external:v1:0:beam:metric:sampled_byte_size:v1 {PCOLLECTION=ref_PCollection_PCollection_2}: DistributionResult{sum=785, count=21, min=14, max=84}, 42read/Read/_SDFBoundedSourceWrapper/Impulse.None/beam:env:external:v1:0:beam:metric:sampled_byte_size:v1 {PTRANSFORM=ref_AppliedPTransform_read/Read/_SDFBoundedSourceWrapper/ParDo(SDFBoundedSourceDoFn)_6/PairWithRestriction0, TAG=None}: DistributionResult{sum=1112, count=1, min=1112, max=1112}, 42read/Read/_SDFBoundedSourceWrapper/Impulse.None/SplitAndSize0/beam:env:external:v1:0:beam:metric:sampled_byte_size:v1 {PCOLLECTION=ref_PCollection_PCollection_4}: DistributionResult{sum=650, count=36, min=16, max=22}, 36write/Write/WriteImpl/DoOnce/Impulse.None/beam:env:external:v1:0:beam:metric:sampled_byte_size:v1 {PCOLLECTION=ref_PCollection_PCollection_10}: DistributionResult{sum=13, count=1, min=13, max=13}, 36write/Write/WriteImpl/DoOnce/Impulse.None/beam:env:external:v1:0:beam:metric:sampled_byte_size:v1 {PCOLLECTION=ref_PCollection_PCollection_11}: DistributionResult{sum=14, count=1, min=14, max=14}, 36write/Write/WriteImpl/DoOnce/Impulse.None/beam:env:external:v1:0:beam:metric:sampled_byte_size:v1 {PCOLLECTION=ref_PCollection_PCollection_12}: DistributionResult{sum=14, count=1, min=14, max=14}, 46write/Write/WriteImpl/GroupByKey/GroupByWindow.None/beam:env:external:v1:0:beam:metric:sampled_byte_size:v1 {PCOLLECTION=ref_PCollection_PCollection_20}: DistributionResult{sum=276, count=2, min=138, max=138}, 42read/Read/_SDFBoundedSourceWrapper/Impulse.None/SplitAndSize0/beam:env:external:v1:0:beam:metric:user_distribution {NAMESPACE=__main__.WordExtractingDoFn, PTRANSFORM=ref_AppliedPTransform_split_7, NAME=word_len_dist}: DistributionResult{sum=298, count=96, min=1, max=10}, 40write/Write/WriteImpl/DoOnce/Map(decode).None/beam:env:external:v1:2:beam:metric:sampled_byte_size:v1 {PCOLLECTION=ref_PCollection_PCollection_12}: DistributionResult{sum=15, count=1, min=15, max=15}, 42read/Read/_SDFBoundedSourceWrapper/Impulse.None/beam:env:external:v1:0:beam:metric:sampled_byte_size:v1 {PCOLLECTION=ref_PCollection_PCollection_1/SplitAndSize0}: DistributionResult{sum=945, count=1, min=945, max=945}))
[flink-runner-job-invoker] INFO org.apache.beam.runners.fnexecution.artifact.AbstractArtifactRetrievalService - Manifest at /tmp/beam-tempxaeifX/artifactsN8LrpY/job_ef2212ab-ada6-4979-bf9b-e070f5b083fc/MANIFEST has 1 artifact locations
[flink-runner-job-invoker] INFO org.apache.beam.runners.fnexecution.artifact.BeamFileSystemArtifactStagingService - Removed dir /tmp/beam-tempxaeifX/artifactsN8LrpY/job_ef2212ab-ada6-4979-bf9b-e070f5b083fc/
INFO:apache_beam.runners.portability.portable_runner:Job state changed to DONE
[grpc-default-executor-0] INFO org.apache.beam.runners.fnexecution.jobsubmission.InMemoryJobService - Getting job metrics for BeamApp-jenkins-0218182322-b9ff2b92_81a5c1da-7172-4330-a96f-419feee74477
[grpc-default-executor-0] INFO org.apache.beam.runners.fnexecution.jobsubmission.InMemoryJobService - Finished getting job metrics for BeamApp-jenkins-0218182322-b9ff2b92_81a5c1da-7172-4330-a96f-419feee74477
INFO:root:number of empty lines: 2
INFO:root:average word length: 3

> Task :sdks:python:test-suites:portable:py2:portableWordCountSparkRunnerBatch
<https://builds.apache.org/job/beam_PostCommit_Python2/ws/src/sdks/python/apache_beam/__init__.py>:82: UserWarning: You are using Apache Beam with Python 2. New releases of Apache Beam will soon support Python 3 only.
  'You are using Apache Beam with Python 2. '
INFO:apache_beam.runners.portability.fn_api_runner_transforms:==================== <function lift_combiners at 0x7f3e7bf23c08> ====================
WARNING:apache_beam.utils.subprocess_server:Starting service with ['java' '-jar' '<https://builds.apache.org/job/beam_PostCommit_Python2/ws/src/runners/spark/job-server/build/libs/beam-runners-spark-job-server-2.20.0-SNAPSHOT.jar'> '--spark-master-url' 'local[4]' '--artifacts-dir' '/tmp/beam-tempNEfzNb/artifacts2Nkrom' '--job-port' '52535' '--artifact-port' '0' '--expansion-port' '0']
20/02/18 18:23:40 INFO org.apache.beam.runners.fnexecution.jobsubmission.JobServerDriver: ArtifactStagingService started on localhost:43157
20/02/18 18:23:40 INFO org.apache.beam.runners.fnexecution.jobsubmission.JobServerDriver: Java ExpansionService started on localhost:45373
20/02/18 18:23:40 INFO org.apache.beam.runners.fnexecution.jobsubmission.JobServerDriver: JobService started on localhost:52535
WARNING:apache_beam.options.pipeline_options:Discarding unparseable args: ['--parallelism=2', '--shutdown_sources_on_final_watermark']
20/02/18 18:23:42 INFO org.apache.beam.runners.spark.SparkJobInvoker: Invoking job BeamApp-jenkins-0218182342-144c7ae1_502399b8-b83b-4ebd-9ae5-c31498e5741f
20/02/18 18:23:42 INFO org.apache.beam.runners.fnexecution.jobsubmission.JobInvocation: Starting job invocation BeamApp-jenkins-0218182342-144c7ae1_502399b8-b83b-4ebd-9ae5-c31498e5741f
INFO:root:Waiting until the pipeline has finished because the environment "LOOPBACK" has started a component necessary for the execution.
INFO:apache_beam.runners.portability.portable_runner:Job state changed to STOPPED
INFO:apache_beam.runners.portability.portable_runner:Job state changed to STARTING
INFO:apache_beam.runners.portability.portable_runner:Job state changed to RUNNING
20/02/18 18:23:43 INFO org.apache.beam.runners.spark.SparkPipelineRunner: PipelineOptions.filesToStage was not specified. Defaulting to files from the classpath
20/02/18 18:23:43 INFO org.apache.beam.runners.spark.SparkPipelineRunner: Will stage 1 files. (Enable logging at DEBUG level to see which files will be staged.)
20/02/18 18:23:43 INFO org.apache.beam.runners.spark.translation.SparkContextFactory: Creating a brand new Spark Context.
20/02/18 18:23:43 WARN org.apache.hadoop.util.NativeCodeLoader: Unable to load native-hadoop library for your platform... using builtin-java classes where applicable
20/02/18 18:23:44 INFO org.apache.beam.runners.spark.SparkPipelineRunner: Running job BeamApp-jenkins-0218182342-144c7ae1_502399b8-b83b-4ebd-9ae5-c31498e5741f on Spark master local[4]
20/02/18 18:23:44 INFO org.apache.beam.runners.spark.aggregators.AggregatorsAccumulator: Instantiated aggregators accumulator: 
20/02/18 18:23:44 INFO org.apache.beam.runners.spark.metrics.MetricsAccumulator: Instantiated metrics accumulator: MetricQueryResults()
INFO:apache_beam.runners.worker.statecache:Creating state cache with size 0
INFO:apache_beam.runners.worker.sdk_worker:Creating insecure control channel for localhost:34403.
INFO:apache_beam.runners.worker.sdk_worker:Control channel established.
INFO:apache_beam.runners.worker.sdk_worker:Initializing SDKHarness with unbounded number of workers.
20/02/18 18:23:47 INFO org.apache.beam.runners.fnexecution.control.FnApiControlClientPoolService: Beam Fn Control client connected with id 1-1
INFO:apache_beam.runners.worker.sdk_worker:Creating insecure state channel for localhost:43581.
INFO:apache_beam.runners.worker.sdk_worker:State channel established.
INFO:apache_beam.runners.worker.data_plane:Creating client data channel for localhost:41687
20/02/18 18:23:47 INFO org.apache.beam.runners.fnexecution.data.GrpcDataService: Beam Fn Data client connected.
20/02/18 18:23:47 WARN org.apache.beam.runners.spark.translation.GroupNonMergingWindowsFunctions: Either coder LengthPrefixCoder(ByteArrayCoder) or GlobalWindow$Coder is not consistent with equals. That might cause issues on some runners.
WARNING:apache_beam.io.filebasedsink:Deleting 4 existing files in target path matching: -*-of-%(num_shards)05d
20/02/18 18:23:52 INFO org.apache.beam.runners.spark.SparkPipelineRunner: Job BeamApp-jenkins-0218182342-144c7ae1_502399b8-b83b-4ebd-9ae5-c31498e5741f: Pipeline translated successfully. Computing outputs
INFO:apache_beam.io.filebasedsink:Starting finalize_write threads with num_shards: 4 (skipped: 0), batches: 4, num_threads: 4
INFO:apache_beam.io.filebasedsink:Renamed 4 shards in 0.12 seconds.
20/02/18 18:23:56 INFO org.apache.beam.runners.spark.SparkPipelineRunner: Job BeamApp-jenkins-0218182342-144c7ae1_502399b8-b83b-4ebd-9ae5-c31498e5741f finished.
20/02/18 18:23:56 INFO org.apache.beam.runners.fnexecution.artifact.AbstractArtifactRetrievalService: Manifest at /tmp/beam-tempNEfzNb/artifacts2Nkrom/job_c10f335e-e3c5-4cb5-80cd-e476f60f0e04/MANIFEST has 1 artifact locations
20/02/18 18:23:56 INFO org.apache.beam.runners.fnexecution.artifact.BeamFileSystemArtifactStagingService: Removed dir /tmp/beam-tempNEfzNb/artifacts2Nkrom/job_c10f335e-e3c5-4cb5-80cd-e476f60f0e04/
INFO:apache_beam.runners.portability.portable_runner:Job state changed to DONE
20/02/18 18:23:56 INFO org.apache.beam.runners.fnexecution.jobsubmission.InMemoryJobService: Getting job metrics for BeamApp-jenkins-0218182342-144c7ae1_502399b8-b83b-4ebd-9ae5-c31498e5741f
20/02/18 18:23:56 INFO org.apache.beam.runners.fnexecution.jobsubmission.InMemoryJobService: Finished getting job metrics for BeamApp-jenkins-0218182342-144c7ae1_502399b8-b83b-4ebd-9ae5-c31498e5741f
INFO:root:number of empty lines: 2
INFO:root:average word length: 3
Exception in thread run_worker_1-1:
Traceback (most recent call last):
  File "/usr/lib/python2.7/threading.py", line 801, in __bootstrap_inner
    self.run()
  File "/usr/lib/python2.7/threading.py", line 754, in run
    self.__target(*self.__args, **self.__kwargs)
  File "<https://builds.apache.org/job/beam_PostCommit_Python2/ws/src/sdks/python/apache_beam/runners/worker/sdk_worker.py",> line 153, in run
    for work_request in control_stub.Control(get_responses()):
  File "<https://builds.apache.org/job/beam_PostCommit_Python2/ws/src/build/gradleenv/1866363813/local/lib/python2.7/site-packages/grpc/_channel.py",> line 413, in next
    return self._next()
  File "<https://builds.apache.org/job/beam_PostCommit_Python2/ws/src/build/gradleenv/1866363813/local/lib/python2.7/site-packages/grpc/_channel.py",> line 706, in _next
    raise self
_MultiThreadedRendezvous: <_MultiThreadedRendezvous of RPC that terminated with:
	status = StatusCode.UNAVAILABLE
	details = "Socket closed"
	debug_error_string = "{"created":"@1582050236.832077149","description":"Error received from peer ipv4:127.0.0.1:34403","file":"src/core/lib/surface/call.cc","file_line":1056,"grpc_message":"Socket closed","grpc_status":14}"
>

Exception in thread read_state:
Traceback (most recent call last):
  File "/usr/lib/python2.7/threading.py", line 801, in __bootstrap_inner
    self.run()
  File "/usr/lib/python2.7/threading.py", line 754, in run
    self.__target(*self.__args, **self.__kwargs)
  File "<https://builds.apache.org/job/beam_PostCommit_Python2/ws/src/sdks/python/apache_beam/runners/worker/sdk_worker.py",> line 675, in pull_responses
    for response in responses:
  File "<https://builds.apache.org/job/beam_PostCommit_Python2/ws/src/build/gradleenv/1866363813/local/lib/python2.7/site-packages/grpc/_channel.py",> line 413, in next
    return self._next()
  File "<https://builds.apache.org/job/beam_PostCommit_Python2/ws/src/build/gradleenv/1866363813/local/lib/python2.7/site-packages/grpc/_channel.py",> line 706, in _next
    raise self
_MultiThreadedRendezvous: <_MultiThreadedRendezvous of RPC that terminated with:
	status = StatusCode.UNAVAILABLE
	details = "Socket closed"
	debug_error_string = "{"created":"@1582050236.832037346","description":"Error received from peer ipv4:127.0.0.1:43581","file":"src/core/lib/surface/call.cc","file_line":1056,"grpc_message":"Socket closed","grpc_status":14}"
>

ERROR:apache_beam.runners.worker.data_plane:Failed to read inputs in the data plane.
Traceback (most recent call last):
  File "<https://builds.apache.org/job/beam_PostCommit_Python2/ws/src/sdks/python/apache_beam/runners/worker/data_plane.py",> line 419, in _read_inputs
    for elements in elements_iterator:
  File "<https://builds.apache.org/job/beam_PostCommit_Python2/ws/src/build/gradleenv/1866363813/local/lib/python2.7/site-packages/grpc/_channel.py",> line 413, in next
    return self._next()
  File "<https://builds.apache.org/job/beam_PostCommit_Python2/ws/src/build/gradleenv/1866363813/local/lib/python2.7/site-packages/grpc/_channel.py",> line 706, in _next
    raise self
_MultiThreadedRendezvous: <_MultiThreadedRendezvous of RPC that terminated with:
	status = StatusCode.UNAVAILABLE
	details = "Socket closed"
	debug_error_string = "{"created":"@1582050236.832000430","description":"Error received from peer ipv4:127.0.0.1:41687","file":"src/core/lib/surface/call.cc","file_line":1056,"grpc_message":"Socket closed","grpc_status":14}"
>
Exception in thread read_grpc_client_inputs:
Traceback (most recent call last):
  File "/usr/lib/python2.7/threading.py", line 801, in __bootstrap_inner
    self.run()
  File "/usr/lib/python2.7/threading.py", line 754, in run
    self.__target(*self.__args, **self.__kwargs)
  File "<https://builds.apache.org/job/beam_PostCommit_Python2/ws/src/sdks/python/apache_beam/runners/worker/data_plane.py",> line 434, in <lambda>
    target=lambda: self._read_inputs(elements_iterator),
  File "<https://builds.apache.org/job/beam_PostCommit_Python2/ws/src/sdks/python/apache_beam/runners/worker/data_plane.py",> line 419, in _read_inputs
    for elements in elements_iterator:
  File "<https://builds.apache.org/job/beam_PostCommit_Python2/ws/src/build/gradleenv/1866363813/local/lib/python2.7/site-packages/grpc/_channel.py",> line 413, in next
    return self._next()
  File "<https://builds.apache.org/job/beam_PostCommit_Python2/ws/src/build/gradleenv/1866363813/local/lib/python2.7/site-packages/grpc/_channel.py",> line 706, in _next
    raise self
_MultiThreadedRendezvous: <_MultiThreadedRendezvous of RPC that terminated with:
	status = StatusCode.UNAVAILABLE
	details = "Socket closed"
	debug_error_string = "{"created":"@1582050236.832000430","description":"Error received from peer ipv4:127.0.0.1:41687","file":"src/core/lib/surface/call.cc","file_line":1056,"grpc_message":"Socket closed","grpc_status":14}"
>


> Task :sdks:python:test-suites:portable:py2:postCommitPy2

> Task :sdks:python:test-suites:dataflow:py2:postCommitIT
test_leader_board_it (apache_beam.examples.complete.game.leader_board_it_test.LeaderBoardIT) ... ok
test_datastore_write_limit (apache_beam.io.gcp.datastore.v1new.datastore_write_it_test.DatastoreWriteIT) ... SKIP: GCP dependencies are not installed
<https://builds.apache.org/job/beam_PostCommit_Python2/ws/src/sdks/python/apache_beam/io/gcp/big_query_query_to_table_pipeline.py>:87: FutureWarning: _ReadFromBigQuery is experimental.
  kms_key=kms_key)
<https://builds.apache.org/job/beam_PostCommit_Python2/ws/src/sdks/python/apache_beam/runners/dataflow/dataflow_runner.py>:787: BeamDeprecationWarning: BigQuerySink is deprecated since 2.11.0. Use WriteToBigQuery instead.
  kms_key=transform.kms_key))
test_game_stats_it (apache_beam.examples.complete.game.game_stats_it_test.GameStatsIT) ... ok
<https://builds.apache.org/job/beam_PostCommit_Python2/ws/src/sdks/python/apache_beam/io/gcp/bigquery_file_loads.py>:818: BeamDeprecationWarning: options is deprecated since First stable release. References to <pipeline>.options will not be supported
  temp_location = p.options.view_as(GoogleCloudOptions).temp_location
test_wordcount_fnapi_it (apache_beam.examples.wordcount_it_test.WordCountIT) ... ok
<https://builds.apache.org/job/beam_PostCommit_Python2/ws/src/sdks/python/apache_beam/io/gcp/bigquery_io_read_pipeline.py>:84: FutureWarning: _ReadFromBigQuery is experimental.
  (options.view_as(GoogleCloudOptions).project, known_args.input_table))
<https://builds.apache.org/job/beam_PostCommit_Python2/ws/src/sdks/python/apache_beam/io/gcp/bigquery.py>:1655: BeamDeprecationWarning: options is deprecated since First stable release. References to <pipeline>.options will not be supported
  temp_location = pcoll.pipeline.options.view_as(
test_wordcount_it (apache_beam.examples.wordcount_it_test.WordCountIT) ... ok
<https://builds.apache.org/job/beam_PostCommit_Python2/ws/src/sdks/python/apache_beam/io/gcp/bigquery_read_it_test.py>:275: FutureWarning: _ReadFromBigQuery is experimental.
  query=self.query, use_standard_sql=True, project=self.project))
<https://builds.apache.org/job/beam_PostCommit_Python2/ws/src/sdks/python/apache_beam/io/gcp/bigquery.py>:1655: BeamDeprecationWarning: options is deprecated since First stable release. References to <pipeline>.options will not be supported
  temp_location = pcoll.pipeline.options.view_as(
test_streaming_wordcount_it (apache_beam.examples.streaming_wordcount_it_test.StreamingWordCountIT) ... ok
<https://builds.apache.org/job/beam_PostCommit_Python2/ws/src/sdks/python/apache_beam/io/gcp/bigquery_read_it_test.py>:162: FutureWarning: _ReadFromBigQuery is experimental.
  query=self.query, use_standard_sql=True, project=self.project))
<https://builds.apache.org/job/beam_PostCommit_Python2/ws/src/sdks/python/apache_beam/io/gcp/bigquery.py>:1655: BeamDeprecationWarning: options is deprecated since First stable release. References to <pipeline>.options will not be supported
  temp_location = pcoll.pipeline.options.view_as(
test_hourly_team_score_it (apache_beam.examples.complete.game.hourly_team_score_it_test.HourlyTeamScoreIT) ... ok
<https://builds.apache.org/job/beam_PostCommit_Python2/ws/src/sdks/python/apache_beam/io/gcp/bigquery_test.py>:823: BeamDeprecationWarning: options is deprecated since First stable release. References to <pipeline>.options will not be supported
  streaming = self.test_pipeline.options.view_as(StandardOptions).streaming
<https://builds.apache.org/job/beam_PostCommit_Python2/ws/src/sdks/python/apache_beam/io/gcp/bigquery.py>:1466: BeamDeprecationWarning: options is deprecated since First stable release. References to <pipeline>.options will not be supported
  experiments = p.options.view_as(DebugOptions).experiments or []
test_user_score_it (apache_beam.examples.complete.game.user_score_it_test.UserScoreIT) ... ok
<https://builds.apache.org/job/beam_PostCommit_Python2/ws/src/sdks/python/apache_beam/io/gcp/bigquery.py>:1466: BeamDeprecationWarning: options is deprecated since First stable release. References to <pipeline>.options will not be supported
  experiments = p.options.view_as(DebugOptions).experiments or []
<https://builds.apache.org/job/beam_PostCommit_Python2/ws/src/sdks/python/apache_beam/io/gcp/bigquery_file_loads.py>:818: BeamDeprecationWarning: options is deprecated since First stable release. References to <pipeline>.options will not be supported
  temp_location = p.options.view_as(GoogleCloudOptions).temp_location
test_avro_it (apache_beam.examples.fastavro_it_test.FastavroIT) ... ok
<https://builds.apache.org/job/beam_PostCommit_Python2/ws/src/sdks/python/apache_beam/io/gcp/bigquery.py>:1463: BeamDeprecationWarning: options is deprecated since First stable release. References to <pipeline>.options will not be supported
  self.table_reference.projectId = pcoll.pipeline.options.view_as(
test_multiple_destinations_transform (apache_beam.io.gcp.bigquery_test.BigQueryStreamingInsertTransformIntegrationTests) ... ok
test_value_provider_transform (apache_beam.io.gcp.bigquery_test.BigQueryStreamingInsertTransformIntegrationTests) ... ok
<https://builds.apache.org/job/beam_PostCommit_Python2/ws/src/sdks/python/apache_beam/io/gcp/big_query_query_to_table_pipeline.py>:95: BeamDeprecationWarning: BigQuerySink is deprecated since 2.11.0. Use WriteToBigQuery instead.
  kms_key=kms_key))
test_iobase_source (apache_beam.io.gcp.bigquery_read_it_test.ReadNewTypesTests) ... ok
test_native_source (apache_beam.io.gcp.bigquery_read_it_test.ReadNewTypesTests) ... ok
test_copy (apache_beam.io.gcp.gcsio_integration_test.GcsIOIntegrationTest) ... ok
test_copy_batch (apache_beam.io.gcp.gcsio_integration_test.GcsIOIntegrationTest) ... ok
test_copy_batch_kms (apache_beam.io.gcp.gcsio_integration_test.GcsIOIntegrationTest) ... ok
test_copy_batch_rewrite_token (apache_beam.io.gcp.gcsio_integration_test.GcsIOIntegrationTest) ... ok
test_copy_kms (apache_beam.io.gcp.gcsio_integration_test.GcsIOIntegrationTest) ... ok
test_copy_rewrite_token (apache_beam.io.gcp.gcsio_integration_test.GcsIOIntegrationTest) ... ok
test_iobase_source (apache_beam.io.gcp.bigquery_read_it_test.ReadTests) ... ok
test_native_source (apache_beam.io.gcp.bigquery_read_it_test.ReadTests) ... ok
<https://builds.apache.org/job/beam_PostCommit_Python2/ws/src/sdks/python/apache_beam/io/fileio_test.py>:303: FutureWarning: MatchAll is experimental.
  | 'GetPath' >> beam.Map(lambda metadata: metadata.path))
<https://builds.apache.org/job/beam_PostCommit_Python2/ws/src/sdks/python/apache_beam/io/fileio_test.py>:316: FutureWarning: MatchAll is experimental.
  | 'Checksums' >> beam.Map(compute_hash))
<https://builds.apache.org/job/beam_PostCommit_Python2/ws/src/sdks/python/apache_beam/io/fileio_test.py>:316: FutureWarning: ReadMatches is experimental.
  | 'Checksums' >> beam.Map(compute_hash))
test_bigquery_read_1M_python (apache_beam.io.gcp.bigquery_io_read_it_test.BigqueryIOReadIT) ... ok
test_bigquery_read_custom_1M_python (apache_beam.io.gcp.bigquery_io_read_it_test.BigqueryIOReadIT) ... ok
test_bqfl_streaming (apache_beam.io.gcp.bigquery_file_loads_test.BigQueryFileLoadsIT) ... SKIP: TestStream is not supported on TestDataflowRunner
test_multiple_destinations_transform (apache_beam.io.gcp.bigquery_file_loads_test.BigQueryFileLoadsIT) ... ok
test_one_job_fails_all_jobs_fail (apache_beam.io.gcp.bigquery_file_loads_test.BigQueryFileLoadsIT) ... ok
test_file_loads (apache_beam.io.gcp.bigquery_test.PubSubBigQueryIT) ... SKIP: https://issuetracker.google.com/issues/118375066
test_streaming_inserts (apache_beam.io.gcp.bigquery_test.PubSubBigQueryIT) ... ok
test_transform_on_gcs (apache_beam.io.fileio_test.MatchIntegrationTest) ... ok
test_parquetio_it (apache_beam.io.parquetio_it_test.TestParquetIT) ... ok
test_basic_execution (apache_beam.testing.test_stream_it_test.TestStreamIntegrationTests) ... SKIP: The "TestDataflowRunner", does not support the TestStream transform. Supported runners: ['DirectRunner', 'SwitchingDirectRunner']
Tests that the TestStream supports emitting to multiple PCollections. ... SKIP: The "TestDataflowRunner", does not support the TestStream transform. Supported runners: ['DirectRunner', 'SwitchingDirectRunner']
Tests that the TestStream can independently control output watermarks. ... SKIP: The "TestDataflowRunner", does not support the TestStream transform. Supported runners: ['DirectRunner', 'SwitchingDirectRunner']
Runs streaming Dataflow job and verifies that user metrics are reported ... ok
test_big_query_write (apache_beam.io.gcp.bigquery_write_it_test.BigQueryWriteIntegrationTests) ... ok
test_big_query_write_new_types (apache_beam.io.gcp.bigquery_write_it_test.BigQueryWriteIntegrationTests) ... ok
test_big_query_write_schema_autodetect (apache_beam.io.gcp.bigquery_write_it_test.BigQueryWriteIntegrationTests) ... SKIP: DataflowRunner does not support schema autodetection
test_big_query_write_without_schema (apache_beam.io.gcp.bigquery_write_it_test.BigQueryWriteIntegrationTests) ... ok
test_streaming_data_only (apache_beam.io.gcp.pubsub_integration_test.PubSubIntegrationTest) ... ok
test_streaming_with_attributes (apache_beam.io.gcp.pubsub_integration_test.PubSubIntegrationTest) ... ok
test_job_python_from_python_it (apache_beam.transforms.external_test_it.ExternalTransformIT) ... ok
test_metrics_fnapi_it (apache_beam.runners.dataflow.dataflow_exercise_metrics_pipeline_test.ExerciseMetricsPipelineTest) ... ok
test_metrics_it (apache_beam.runners.dataflow.dataflow_exercise_metrics_pipeline_test.ExerciseMetricsPipelineTest) ... ok
test_big_query_legacy_sql (apache_beam.io.gcp.big_query_query_to_table_it_test.BigQueryQueryToTableIT) ... ok
test_big_query_new_types (apache_beam.io.gcp.big_query_query_to_table_it_test.BigQueryQueryToTableIT) ... ok
test_big_query_new_types_native (apache_beam.io.gcp.big_query_query_to_table_it_test.BigQueryQueryToTableIT) ... ok
test_big_query_standard_sql (apache_beam.io.gcp.big_query_query_to_table_it_test.BigQueryQueryToTableIT) ... ok
test_big_query_standard_sql_kms_key_native (apache_beam.io.gcp.big_query_query_to_table_it_test.BigQueryQueryToTableIT) ... ok
test_datastore_write_limit (apache_beam.io.gcp.datastore_write_it_test.DatastoreWriteIT) ... ok

----------------------------------------------------------------------
XML: nosetests-postCommitIT-df.xml
----------------------------------------------------------------------
XML: <https://builds.apache.org/job/beam_PostCommit_Python2/ws/src/sdks/python/nosetests.xml>
----------------------------------------------------------------------
Ran 52 tests in 3591.625s

OK (SKIP=7)

FAILURE: Build failed with an exception.

* Where:
Build file '<https://builds.apache.org/job/beam_PostCommit_Python2/ws/src/sdks/python/test-suites/direct/py2/build.gradle'> line: 81

* What went wrong:
Execution failed for task ':sdks:python:test-suites:direct:py2:hdfsIntegrationTest'.
> Process 'command 'sh'' finished with non-zero exit value 255

* Try:
Run with --stacktrace option to get the stack trace. Run with --info or --debug option to get more log output. Run with --scan to get full insights.

* Get more help at https://help.gradle.org

Deprecated Gradle features were used in this build, making it incompatible with Gradle 6.0.
Use '--warning-mode all' to show the individual deprecation warnings.
See https://docs.gradle.org/5.2.1/userguide/command_line_interface.html#sec:command_line_warnings

BUILD FAILED in 1h 1m 12s
124 actionable tasks: 98 executed, 23 from cache, 3 up-to-date

Publishing build scan...
https://gradle.com/s/ihvakcqoe5qzk

Build step 'Invoke Gradle script' changed build result to FAILURE
Build step 'Invoke Gradle script' marked build as failure

---------------------------------------------------------------------
To unsubscribe, e-mail: builds-unsubscribe@beam.apache.org
For additional commands, e-mail: builds-help@beam.apache.org


Jenkins build is back to normal : beam_PostCommit_Python2 #1743

Posted by Apache Jenkins Server <je...@builds.apache.org>.
See <https://builds.apache.org/job/beam_PostCommit_Python2/1743/display/redirect?page=changes>


---------------------------------------------------------------------
To unsubscribe, e-mail: builds-unsubscribe@beam.apache.org
For additional commands, e-mail: builds-help@beam.apache.org


Build failed in Jenkins: beam_PostCommit_Python2 #1742

Posted by Apache Jenkins Server <je...@builds.apache.org>.
See <https://builds.apache.org/job/beam_PostCommit_Python2/1742/display/redirect?page=changes>

Changes:

[github] Exclude tests that are not passing under currect Avro IO requirements.


------------------------------------------
[...truncated 3.81 MB...]

> Task :sdks:python:test-suites:dataflow:py2:postCommitIT
test_leader_board_it (apache_beam.examples.complete.game.leader_board_it_test.LeaderBoardIT) ... ok
test_datastore_write_limit (apache_beam.io.gcp.datastore.v1new.datastore_write_it_test.DatastoreWriteIT) ... SKIP: GCP dependencies are not installed
<https://builds.apache.org/job/beam_PostCommit_Python2/ws/src/sdks/python/apache_beam/io/gcp/big_query_query_to_table_pipeline.py>:87: FutureWarning: _ReadFromBigQuery is experimental.
  kms_key=kms_key)
<https://builds.apache.org/job/beam_PostCommit_Python2/ws/src/sdks/python/apache_beam/runners/dataflow/dataflow_runner.py>:787: BeamDeprecationWarning: BigQuerySink is deprecated since 2.11.0. Use WriteToBigQuery instead.
  kms_key=transform.kms_key))
test_game_stats_it (apache_beam.examples.complete.game.game_stats_it_test.GameStatsIT) ... ok
<https://builds.apache.org/job/beam_PostCommit_Python2/ws/src/sdks/python/apache_beam/io/gcp/bigquery_file_loads.py>:818: BeamDeprecationWarning: options is deprecated since First stable release. References to <pipeline>.options will not be supported
  temp_location = p.options.view_as(GoogleCloudOptions).temp_location
test_wordcount_it (apache_beam.examples.wordcount_it_test.WordCountIT) ... ok
<https://builds.apache.org/job/beam_PostCommit_Python2/ws/src/sdks/python/apache_beam/io/gcp/bigquery_io_read_pipeline.py>:84: FutureWarning: _ReadFromBigQuery is experimental.
  (options.view_as(GoogleCloudOptions).project, known_args.input_table))
<https://builds.apache.org/job/beam_PostCommit_Python2/ws/src/sdks/python/apache_beam/io/gcp/bigquery.py>:1655: BeamDeprecationWarning: options is deprecated since First stable release. References to <pipeline>.options will not be supported
  temp_location = pcoll.pipeline.options.view_as(
test_wordcount_fnapi_it (apache_beam.examples.wordcount_it_test.WordCountIT) ... ok
<https://builds.apache.org/job/beam_PostCommit_Python2/ws/src/sdks/python/apache_beam/io/gcp/bigquery_read_it_test.py>:275: FutureWarning: _ReadFromBigQuery is experimental.
  query=self.query, use_standard_sql=True, project=self.project))
<https://builds.apache.org/job/beam_PostCommit_Python2/ws/src/sdks/python/apache_beam/io/gcp/bigquery.py>:1655: BeamDeprecationWarning: options is deprecated since First stable release. References to <pipeline>.options will not be supported
  temp_location = pcoll.pipeline.options.view_as(
test_streaming_wordcount_it (apache_beam.examples.streaming_wordcount_it_test.StreamingWordCountIT) ... ok
<https://builds.apache.org/job/beam_PostCommit_Python2/ws/src/sdks/python/apache_beam/io/gcp/bigquery_read_it_test.py>:162: FutureWarning: _ReadFromBigQuery is experimental.
  query=self.query, use_standard_sql=True, project=self.project))
<https://builds.apache.org/job/beam_PostCommit_Python2/ws/src/sdks/python/apache_beam/io/gcp/bigquery.py>:1655: BeamDeprecationWarning: options is deprecated since First stable release. References to <pipeline>.options will not be supported
  temp_location = pcoll.pipeline.options.view_as(
test_hourly_team_score_it (apache_beam.examples.complete.game.hourly_team_score_it_test.HourlyTeamScoreIT) ... ok
<https://builds.apache.org/job/beam_PostCommit_Python2/ws/src/sdks/python/apache_beam/io/gcp/bigquery_test.py>:823: BeamDeprecationWarning: options is deprecated since First stable release. References to <pipeline>.options will not be supported
  streaming = self.test_pipeline.options.view_as(StandardOptions).streaming
<https://builds.apache.org/job/beam_PostCommit_Python2/ws/src/sdks/python/apache_beam/io/gcp/bigquery.py>:1466: BeamDeprecationWarning: options is deprecated since First stable release. References to <pipeline>.options will not be supported
  experiments = p.options.view_as(DebugOptions).experiments or []
test_avro_it (apache_beam.examples.fastavro_it_test.FastavroIT) ... ok
<https://builds.apache.org/job/beam_PostCommit_Python2/ws/src/sdks/python/apache_beam/io/gcp/bigquery.py>:1466: BeamDeprecationWarning: options is deprecated since First stable release. References to <pipeline>.options will not be supported
  experiments = p.options.view_as(DebugOptions).experiments or []
<https://builds.apache.org/job/beam_PostCommit_Python2/ws/src/sdks/python/apache_beam/io/gcp/bigquery_file_loads.py>:818: BeamDeprecationWarning: options is deprecated since First stable release. References to <pipeline>.options will not be supported
  temp_location = p.options.view_as(GoogleCloudOptions).temp_location
test_user_score_it (apache_beam.examples.complete.game.user_score_it_test.UserScoreIT) ... ok
<https://builds.apache.org/job/beam_PostCommit_Python2/ws/src/sdks/python/apache_beam/io/gcp/bigquery.py>:1463: BeamDeprecationWarning: options is deprecated since First stable release. References to <pipeline>.options will not be supported
  self.table_reference.projectId = pcoll.pipeline.options.view_as(
test_multiple_destinations_transform (apache_beam.io.gcp.bigquery_test.BigQueryStreamingInsertTransformIntegrationTests) ... ok
test_value_provider_transform (apache_beam.io.gcp.bigquery_test.BigQueryStreamingInsertTransformIntegrationTests) ... ok
<https://builds.apache.org/job/beam_PostCommit_Python2/ws/src/sdks/python/apache_beam/io/gcp/big_query_query_to_table_pipeline.py>:95: BeamDeprecationWarning: BigQuerySink is deprecated since 2.11.0. Use WriteToBigQuery instead.
  kms_key=kms_key))
test_iobase_source (apache_beam.io.gcp.bigquery_read_it_test.ReadNewTypesTests) ... ok
test_native_source (apache_beam.io.gcp.bigquery_read_it_test.ReadNewTypesTests) ... ok
test_copy (apache_beam.io.gcp.gcsio_integration_test.GcsIOIntegrationTest) ... ERROR
test_copy_batch (apache_beam.io.gcp.gcsio_integration_test.GcsIOIntegrationTest) ... ok
test_copy_batch_kms (apache_beam.io.gcp.gcsio_integration_test.GcsIOIntegrationTest) ... ok
test_copy_batch_rewrite_token (apache_beam.io.gcp.gcsio_integration_test.GcsIOIntegrationTest) ... ok
test_copy_kms (apache_beam.io.gcp.gcsio_integration_test.GcsIOIntegrationTest) ... ERROR
test_copy_rewrite_token (apache_beam.io.gcp.gcsio_integration_test.GcsIOIntegrationTest) ... ERROR
test_iobase_source (apache_beam.io.gcp.bigquery_read_it_test.ReadTests) ... ok
test_native_source (apache_beam.io.gcp.bigquery_read_it_test.ReadTests) ... ok
<https://builds.apache.org/job/beam_PostCommit_Python2/ws/src/sdks/python/apache_beam/io/fileio_test.py>:303: FutureWarning: MatchAll is experimental.
  | 'GetPath' >> beam.Map(lambda metadata: metadata.path))
<https://builds.apache.org/job/beam_PostCommit_Python2/ws/src/sdks/python/apache_beam/io/fileio_test.py>:316: FutureWarning: MatchAll is experimental.
  | 'Checksums' >> beam.Map(compute_hash))
<https://builds.apache.org/job/beam_PostCommit_Python2/ws/src/sdks/python/apache_beam/io/fileio_test.py>:316: FutureWarning: ReadMatches is experimental.
  | 'Checksums' >> beam.Map(compute_hash))
test_bigquery_read_1M_python (apache_beam.io.gcp.bigquery_io_read_it_test.BigqueryIOReadIT) ... ok
test_bigquery_read_custom_1M_python (apache_beam.io.gcp.bigquery_io_read_it_test.BigqueryIOReadIT) ... ok
test_bqfl_streaming (apache_beam.io.gcp.bigquery_file_loads_test.BigQueryFileLoadsIT) ... SKIP: TestStream is not supported on TestDataflowRunner
test_multiple_destinations_transform (apache_beam.io.gcp.bigquery_file_loads_test.BigQueryFileLoadsIT) ... ok
test_one_job_fails_all_jobs_fail (apache_beam.io.gcp.bigquery_file_loads_test.BigQueryFileLoadsIT) ... ok
test_file_loads (apache_beam.io.gcp.bigquery_test.PubSubBigQueryIT) ... SKIP: https://issuetracker.google.com/issues/118375066
test_streaming_inserts (apache_beam.io.gcp.bigquery_test.PubSubBigQueryIT) ... ok
test_transform_on_gcs (apache_beam.io.fileio_test.MatchIntegrationTest) ... ok
test_parquetio_it (apache_beam.io.parquetio_it_test.TestParquetIT) ... ok
test_basic_execution (apache_beam.testing.test_stream_it_test.TestStreamIntegrationTests) ... SKIP: The "TestDataflowRunner", does not support the TestStream transform. Supported runners: ['DirectRunner', 'SwitchingDirectRunner']
Tests that the TestStream supports emitting to multiple PCollections. ... SKIP: The "TestDataflowRunner", does not support the TestStream transform. Supported runners: ['DirectRunner', 'SwitchingDirectRunner']
Tests that the TestStream can independently control output watermarks. ... SKIP: The "TestDataflowRunner", does not support the TestStream transform. Supported runners: ['DirectRunner', 'SwitchingDirectRunner']
test_streaming_data_only (apache_beam.io.gcp.pubsub_integration_test.PubSubIntegrationTest) ... ok
test_streaming_with_attributes (apache_beam.io.gcp.pubsub_integration_test.PubSubIntegrationTest) ... ok
test_job_python_from_python_it (apache_beam.transforms.external_test_it.ExternalTransformIT) ... ok
Runs streaming Dataflow job and verifies that user metrics are reported ... ok
test_big_query_write (apache_beam.io.gcp.bigquery_write_it_test.BigQueryWriteIntegrationTests) ... ok
test_big_query_write_new_types (apache_beam.io.gcp.bigquery_write_it_test.BigQueryWriteIntegrationTests) ... ok
test_big_query_write_schema_autodetect (apache_beam.io.gcp.bigquery_write_it_test.BigQueryWriteIntegrationTests) ... SKIP: DataflowRunner does not support schema autodetection
test_big_query_write_without_schema (apache_beam.io.gcp.bigquery_write_it_test.BigQueryWriteIntegrationTests) ... ok
test_metrics_fnapi_it (apache_beam.runners.dataflow.dataflow_exercise_metrics_pipeline_test.ExerciseMetricsPipelineTest) ... ok
test_metrics_it (apache_beam.runners.dataflow.dataflow_exercise_metrics_pipeline_test.ExerciseMetricsPipelineTest) ... ok
test_big_query_legacy_sql (apache_beam.io.gcp.big_query_query_to_table_it_test.BigQueryQueryToTableIT) ... ok
test_big_query_new_types (apache_beam.io.gcp.big_query_query_to_table_it_test.BigQueryQueryToTableIT) ... ok
test_big_query_new_types_native (apache_beam.io.gcp.big_query_query_to_table_it_test.BigQueryQueryToTableIT) ... ok
test_big_query_standard_sql (apache_beam.io.gcp.big_query_query_to_table_it_test.BigQueryQueryToTableIT) ... ok
test_big_query_standard_sql_kms_key_native (apache_beam.io.gcp.big_query_query_to_table_it_test.BigQueryQueryToTableIT) ... ok
test_datastore_write_limit (apache_beam.io.gcp.datastore_write_it_test.DatastoreWriteIT) ... ok

======================================================================
ERROR: test_copy (apache_beam.io.gcp.gcsio_integration_test.GcsIOIntegrationTest)
----------------------------------------------------------------------
Traceback (most recent call last):
  File "<https://builds.apache.org/job/beam_PostCommit_Python2/ws/src/sdks/python/apache_beam/io/gcp/gcsio_integration_test.py",> line 83, in tearDown
    FileSystems.delete([self.gcs_tempdir + '/'])
  File "<https://builds.apache.org/job/beam_PostCommit_Python2/ws/src/sdks/python/apache_beam/io/filesystems.py",> line 343, in delete
    return filesystem.delete(paths)
  File "<https://builds.apache.org/job/beam_PostCommit_Python2/ws/src/sdks/python/apache_beam/io/gcp/gcsfilesystem.py",> line 348, in delete
    raise BeamIOError("Delete operation failed", exceptions)
BeamIOError: Delete operation failed with exceptions {'gs://temp-storage-for-end-to-end-tests/temp-it/gcs_it-4bfa145d-23fa-4b0a-b0c8-13e2c00dd9b4/': HttpError(u'HttpError accessing <https://www.googleapis.com/batch/storage/v1>: response: <{\'status\': \'429\', \'Content-Length\': \'609\', \'Expires\': \'Tue, 18 Feb 2020 23:40:09 GMT\', \'Cache-Control\': \'private, max-age=0\', \'Date\': \'Tue, 18 Feb 2020 23:40:09 GMT\', \'Content-Type\': \'application/json; charset=UTF-8\'}>, content <{\n "error": {\n  "errors": [\n   {\n    "domain": "usageLimits",\n    "reason": "rateLimitExceeded",\n    "message": "The rate of change requests to the object temp-storage-for-end-to-end-tests/temp-it/gcs_it-4bfa145d-23fa-4b0a-b0c8-13e2c00dd9b4/test_copy exceeds the rate limit. Please reduce the rate of create, update, and delete requests."\n   }\n  ],\n  "code": 429,\n  "message": "The rate of change requests to the object temp-storage-for-end-to-end-tests/temp-it/gcs_it-4bfa145d-23fa-4b0a-b0c8-13e2c00dd9b4/test_copy exceeds the rate limit. Please reduce the rate of create, update, and delete requests."\n }\n}\n>',)}
-------------------- >> begin captured logging << --------------------
apache_beam.io.gcp.bigquery_read_it_test: INFO: Deleting dataset python_read_table_15820684818129 in project apache-beam-testing
apache_beam.options.pipeline_options: WARNING: --region not set; will default to us-central1. Future releases of Beam will require the user to set --region explicitly, or else have a default set via the gcloud tool. https://cloud.google.com/compute/docs/regions-zones
apache_beam.io.gcp.gcsio: DEBUG: Rewrite done: gs://dataflow-samples/shakespeare/kinglear.txt to gs://temp-storage-for-end-to-end-tests/temp-it/gcs_it-4bfa145d-23fa-4b0a-b0c8-13e2c00dd9b4/test_copy
apache_beam.io.filesystem: DEBUG: Listing files in 'gs://temp-storage-for-end-to-end-tests/temp-it/gcs_it-4bfa145d-23fa-4b0a-b0c8-13e2c00dd9b4/'
apache_beam.io.filesystem: DEBUG: translate_pattern: 'gs://temp-storage-for-end-to-end-tests/temp-it/gcs_it-4bfa145d-23fa-4b0a-b0c8-13e2c00dd9b4/*' -> 'gs\\:\\/\\/temp\\-storage\\-for\\-end\\-to\\-end\\-tests\\/temp\\-it\\/gcs\\_it\\-4bfa145d\\-23fa\\-4b0a\\-b0c8\\-13e2c00dd9b4\\/[^/\\\\]*'
apache_beam.io.gcp.gcsio: INFO: Starting the size estimation of the input
apache_beam.io.gcp.gcsio: INFO: Finished listing 1 files in 0.0325291156769 seconds.
--------------------- >> end captured logging << ---------------------

======================================================================
ERROR: test_copy_kms (apache_beam.io.gcp.gcsio_integration_test.GcsIOIntegrationTest)
----------------------------------------------------------------------
Traceback (most recent call last):
  File "<https://builds.apache.org/job/beam_PostCommit_Python2/ws/src/sdks/python/apache_beam/io/gcp/gcsio_integration_test.py",> line 83, in tearDown
    FileSystems.delete([self.gcs_tempdir + '/'])
  File "<https://builds.apache.org/job/beam_PostCommit_Python2/ws/src/sdks/python/apache_beam/io/filesystems.py",> line 343, in delete
    return filesystem.delete(paths)
  File "<https://builds.apache.org/job/beam_PostCommit_Python2/ws/src/sdks/python/apache_beam/io/gcp/gcsfilesystem.py",> line 348, in delete
    raise BeamIOError("Delete operation failed", exceptions)
BeamIOError: Delete operation failed with exceptions {'gs://temp-storage-for-end-to-end-tests/temp-it/gcs_it-7e6f4624-dfd8-4de2-ba1a-76686793c09c/': HttpError(u'HttpError accessing <https://www.googleapis.com/batch/storage/v1>: response: <{\'status\': \'429\', \'Content-Length\': \'617\', \'Expires\': \'Tue, 18 Feb 2020 23:40:27 GMT\', \'Cache-Control\': \'private, max-age=0\', \'Date\': \'Tue, 18 Feb 2020 23:40:27 GMT\', \'Content-Type\': \'application/json; charset=UTF-8\'}>, content <{\n "error": {\n  "errors": [\n   {\n    "domain": "usageLimits",\n    "reason": "rateLimitExceeded",\n    "message": "The rate of change requests to the object temp-storage-for-end-to-end-tests/temp-it/gcs_it-7e6f4624-dfd8-4de2-ba1a-76686793c09c/test_copy_kms exceeds the rate limit. Please reduce the rate of create, update, and delete requests."\n   }\n  ],\n  "code": 429,\n  "message": "The rate of change requests to the object temp-storage-for-end-to-end-tests/temp-it/gcs_it-7e6f4624-dfd8-4de2-ba1a-76686793c09c/test_copy_kms exceeds the rate limit. Please reduce the rate of create, update, and delete requests."\n }\n}\n>',)}
-------------------- >> begin captured logging << --------------------
apache_beam.options.pipeline_options: WARNING: --region not set; will default to us-central1. Future releases of Beam will require the user to set --region explicitly, or else have a default set via the gcloud tool. https://cloud.google.com/compute/docs/regions-zones
apache_beam.io.gcp.gcsio: DEBUG: Rewrite done: gs://dataflow-samples/shakespeare/kinglear.txt to gs://temp-storage-for-end-to-end-tests/temp-it/gcs_it-7e6f4624-dfd8-4de2-ba1a-76686793c09c/test_copy_kms
apache_beam.io.filesystem: DEBUG: Listing files in 'gs://temp-storage-for-end-to-end-tests/temp-it/gcs_it-7e6f4624-dfd8-4de2-ba1a-76686793c09c/'
apache_beam.io.filesystem: DEBUG: translate_pattern: 'gs://temp-storage-for-end-to-end-tests/temp-it/gcs_it-7e6f4624-dfd8-4de2-ba1a-76686793c09c/*' -> 'gs\\:\\/\\/temp\\-storage\\-for\\-end\\-to\\-end\\-tests\\/temp\\-it\\/gcs\\_it\\-7e6f4624\\-dfd8\\-4de2\\-ba1a\\-76686793c09c\\/[^/\\\\]*'
apache_beam.io.gcp.gcsio: INFO: Starting the size estimation of the input
apache_beam.io.gcp.gcsio: INFO: Finished listing 1 files in 0.0318579673767 seconds.
--------------------- >> end captured logging << ---------------------

======================================================================
ERROR: test_copy_rewrite_token (apache_beam.io.gcp.gcsio_integration_test.GcsIOIntegrationTest)
----------------------------------------------------------------------
Traceback (most recent call last):
  File "<https://builds.apache.org/job/beam_PostCommit_Python2/ws/src/sdks/python/apache_beam/io/gcp/gcsio_integration_test.py",> line 83, in tearDown
    FileSystems.delete([self.gcs_tempdir + '/'])
  File "<https://builds.apache.org/job/beam_PostCommit_Python2/ws/src/sdks/python/apache_beam/io/filesystems.py",> line 343, in delete
    return filesystem.delete(paths)
  File "<https://builds.apache.org/job/beam_PostCommit_Python2/ws/src/sdks/python/apache_beam/io/gcp/gcsfilesystem.py",> line 348, in delete
    raise BeamIOError("Delete operation failed", exceptions)
BeamIOError: Delete operation failed with exceptions {'gs://temp-storage-for-end-to-end-tests/temp-it/gcs_it-cc91d06c-f870-4192-81f8-a51b9144cd72/': HttpError(u'HttpError accessing <https://www.googleapis.com/batch/storage/v1>: response: <{\'status\': \'429\', \'Content-Length\': \'637\', \'Expires\': \'Tue, 18 Feb 2020 23:40:34 GMT\', \'Cache-Control\': \'private, max-age=0\', \'Date\': \'Tue, 18 Feb 2020 23:40:34 GMT\', \'Content-Type\': \'application/json; charset=UTF-8\'}>, content <{\n "error": {\n  "errors": [\n   {\n    "domain": "usageLimits",\n    "reason": "rateLimitExceeded",\n    "message": "The rate of change requests to the object temp-storage-for-end-to-end-tests/temp-it/gcs_it-cc91d06c-f870-4192-81f8-a51b9144cd72/test_copy_rewrite_token exceeds the rate limit. Please reduce the rate of create, update, and delete requests."\n   }\n  ],\n  "code": 429,\n  "message": "The rate of change requests to the object temp-storage-for-end-to-end-tests/temp-it/gcs_it-cc91d06c-f870-4192-81f8-a51b9144cd72/test_copy_rewrite_token exceeds the rate limit. Please reduce the rate of create, update, and delete requests."\n }\n}\n>',)}
-------------------- >> begin captured logging << --------------------
apache_beam.options.pipeline_options: WARNING: --region not set; will default to us-central1. Future releases of Beam will require the user to set --region explicitly, or else have a default set via the gcloud tool. https://cloud.google.com/compute/docs/regions-zones
apache_beam.io.gcp.gcsio: DEBUG: Rewrite progress: 52428800 of 161612163 bytes, gs://dataflow-samples/wikipedia_edits/wiki_data-000000000000.json to gs://temp-storage-for-end-to-end-tests/temp-it/gcs_it-cc91d06c-f870-4192-81f8-a51b9144cd72/test_copy_rewrite_token
apache_beam.io.gcp.gcsio: DEBUG: Rewrite progress: 104857600 of 161612163 bytes, gs://dataflow-samples/wikipedia_edits/wiki_data-000000000000.json to gs://temp-storage-for-end-to-end-tests/temp-it/gcs_it-cc91d06c-f870-4192-81f8-a51b9144cd72/test_copy_rewrite_token
apache_beam.io.gcp.gcsio: DEBUG: Rewrite progress: 157286400 of 161612163 bytes, gs://dataflow-samples/wikipedia_edits/wiki_data-000000000000.json to gs://temp-storage-for-end-to-end-tests/temp-it/gcs_it-cc91d06c-f870-4192-81f8-a51b9144cd72/test_copy_rewrite_token
apache_beam.io.gcp.gcsio: DEBUG: Rewrite done: gs://dataflow-samples/wikipedia_edits/wiki_data-000000000000.json to gs://temp-storage-for-end-to-end-tests/temp-it/gcs_it-cc91d06c-f870-4192-81f8-a51b9144cd72/test_copy_rewrite_token
apache_beam.io.filesystem: DEBUG: Listing files in 'gs://temp-storage-for-end-to-end-tests/temp-it/gcs_it-cc91d06c-f870-4192-81f8-a51b9144cd72/'
apache_beam.io.filesystem: DEBUG: translate_pattern: 'gs://temp-storage-for-end-to-end-tests/temp-it/gcs_it-cc91d06c-f870-4192-81f8-a51b9144cd72/*' -> 'gs\\:\\/\\/temp\\-storage\\-for\\-end\\-to\\-end\\-tests\\/temp\\-it\\/gcs\\_it\\-cc91d06c\\-f870\\-4192\\-81f8\\-a51b9144cd72\\/[^/\\\\]*'
apache_beam.io.gcp.gcsio: INFO: Starting the size estimation of the input
apache_beam.io.gcp.gcsio: INFO: Finished listing 1 files in 0.0334820747375 seconds.
--------------------- >> end captured logging << ---------------------

----------------------------------------------------------------------
XML: nosetests-postCommitIT-df.xml
----------------------------------------------------------------------
XML: <https://builds.apache.org/job/beam_PostCommit_Python2/ws/src/sdks/python/nosetests.xml>
----------------------------------------------------------------------
Ran 52 tests in 3418.468s

FAILED (SKIP=7, errors=3)
Worker logs: https://console.cloud.google.com/dataflow/jobsDetail/locations/us-central1/jobs/2020-02-18_15_14_06-15434965252949775262?project=apache-beam-testing
Worker logs: https://console.cloud.google.com/dataflow/jobsDetail/locations/us-central1/jobs/2020-02-18_15_28_15-326934439522121265?project=apache-beam-testing
Worker logs: https://console.cloud.google.com/dataflow/jobsDetail/locations/us-central1/jobs/2020-02-18_15_36_10-2569200640166164000?project=apache-beam-testing
Worker logs: https://console.cloud.google.com/dataflow/jobsDetail/locations/us-central1/jobs/2020-02-18_15_42_48-15495280816911575048?project=apache-beam-testing
Worker logs: https://console.cloud.google.com/dataflow/jobsDetail/locations/us-central1/jobs/2020-02-18_15_48_45-16475712450432739437?project=apache-beam-testing
Worker logs: https://console.cloud.google.com/dataflow/jobsDetail/locations/us-central1/jobs/2020-02-18_15_13_57-18446526589808097916?project=apache-beam-testing
Worker logs: https://console.cloud.google.com/dataflow/jobsDetail/locations/us-central1/jobs/2020-02-18_15_30_14-9749537107481133386?project=apache-beam-testing
Worker logs: https://console.cloud.google.com/dataflow/jobsDetail/locations/us-central1/jobs/2020-02-18_15_36_38-1366429630614082601?project=apache-beam-testing
Worker logs: https://console.cloud.google.com/dataflow/jobsDetail/locations/us-central1/jobs/2020-02-18_15_42_42-16123877955443314989?project=apache-beam-testing
Worker logs: https://console.cloud.google.com/dataflow/jobsDetail/locations/us-central1/jobs/2020-02-18_15_48_46-4996234731235500924?project=apache-beam-testing
Worker logs: https://console.cloud.google.com/dataflow/jobsDetail/locations/us-central1/jobs/2020-02-18_15_14_02-14799021196934419009?project=apache-beam-testing
Worker logs: https://console.cloud.google.com/dataflow/jobsDetail/locations/us-central1/jobs/2020-02-18_15_25_52-2334780490522038846?project=apache-beam-testing
Worker logs: https://console.cloud.google.com/dataflow/jobsDetail/locations/us-central1/jobs/2020-02-18_15_32_12-6715480425115970953?project=apache-beam-testing
Worker logs: https://console.cloud.google.com/dataflow/jobsDetail/locations/us-central1/jobs/2020-02-18_15_38_17-15966146373769083263?project=apache-beam-testing
Worker logs: https://console.cloud.google.com/dataflow/jobsDetail/locations/us-central1/jobs/2020-02-18_15_44_32-6776673848103829213?project=apache-beam-testing
Worker logs: https://console.cloud.google.com/dataflow/jobsDetail/locations/us-central1/jobs/2020-02-18_15_50_58-2024873608046504874?project=apache-beam-testing
Worker logs: https://console.cloud.google.com/dataflow/jobsDetail/locations/us-central1/jobs/2020-02-18_15_14_00-619113130003617768?project=apache-beam-testing
Worker logs: https://console.cloud.google.com/dataflow/jobsDetail/locations/us-central1/jobs/2020-02-18_15_30_59-9271561956449408735?project=apache-beam-testing
Worker logs: https://console.cloud.google.com/dataflow/jobsDetail/locations/us-central1/jobs/2020-02-18_15_47_52-2756622399710434041?project=apache-beam-testing
Worker logs: https://console.cloud.google.com/dataflow/jobsDetail/locations/us-central1/jobs/2020-02-18_15_14_00-1035518927477400349?project=apache-beam-testing
Worker logs: https://console.cloud.google.com/dataflow/jobsDetail/locations/us-central1/jobs/2020-02-18_15_21_08-3910118963511613763?project=apache-beam-testing
Worker logs: https://console.cloud.google.com/dataflow/jobsDetail/locations/us-central1/jobs/2020-02-18_15_28_17-4860677658392403766?project=apache-beam-testing
Worker logs: https://console.cloud.google.com/dataflow/jobsDetail/locations/us-central1/jobs/2020-02-18_15_34_45-17877545799888418200?project=apache-beam-testing
Worker logs: https://console.cloud.google.com/dataflow/jobsDetail/locations/us-central1/jobs/2020-02-18_15_41_36-15411883501025729158?project=apache-beam-testing
Worker logs: https://console.cloud.google.com/dataflow/jobsDetail/locations/us-central1/jobs/2020-02-18_15_13_57-1058896829382753847?project=apache-beam-testing
Worker logs: https://console.cloud.google.com/dataflow/jobsDetail/locations/us-central1/jobs/2020-02-18_15_20_07-5014281649199090084?project=apache-beam-testing
Worker logs: https://console.cloud.google.com/dataflow/jobsDetail/locations/us-central1/jobs/2020-02-18_15_28_51-10630174146535292402?project=apache-beam-testing
Worker logs: https://console.cloud.google.com/dataflow/jobsDetail/locations/us-central1/jobs/2020-02-18_15_35_24-15734859971957879119?project=apache-beam-testing
Worker logs: https://console.cloud.google.com/dataflow/jobsDetail/locations/us-central1/jobs/2020-02-18_15_41_30-11430036708332312403?project=apache-beam-testing
Worker logs: https://console.cloud.google.com/dataflow/jobsDetail/locations/us-central1/jobs/2020-02-18_15_47_54-5125573809392344033?project=apache-beam-testing
Worker logs: https://console.cloud.google.com/dataflow/jobsDetail/locations/us-central1/jobs/2020-02-18_15_14_01-7846012561110461194?project=apache-beam-testing
Worker logs: https://console.cloud.google.com/dataflow/jobsDetail/locations/us-central1/jobs/2020-02-18_15_21_44-1658283322071251538?project=apache-beam-testing
Worker logs: https://console.cloud.google.com/dataflow/jobsDetail/locations/us-central1/jobs/2020-02-18_15_30_45-12117873715680591011?project=apache-beam-testing
Worker logs: https://console.cloud.google.com/dataflow/jobsDetail/locations/us-central1/jobs/2020-02-18_15_38_00-14185543655098774104?project=apache-beam-testing
Worker logs: https://console.cloud.google.com/dataflow/jobsDetail/locations/us-central1/jobs/2020-02-18_15_44_02-6468534584526496829?project=apache-beam-testing
Worker logs: https://console.cloud.google.com/dataflow/jobsDetail/locations/us-central1/jobs/2020-02-18_15_50_42-6507311361969370529?project=apache-beam-testing
Worker logs: https://console.cloud.google.com/dataflow/jobsDetail/locations/us-central1/jobs/2020-02-18_15_57_38-16582314038919484629?project=apache-beam-testing
Worker logs: https://console.cloud.google.com/dataflow/jobsDetail/locations/us-central1/jobs/2020-02-18_16_04_11-5089515281889496543?project=apache-beam-testing
Worker logs: https://console.cloud.google.com/dataflow/jobsDetail/locations/us-central1/jobs/2020-02-18_15_14_01-6107890667417266987?project=apache-beam-testing
Worker logs: https://console.cloud.google.com/dataflow/jobsDetail/locations/us-central1/jobs/2020-02-18_15_21_02-2868149197926914438?project=apache-beam-testing
Worker logs: https://console.cloud.google.com/dataflow/jobsDetail/locations/us-central1/jobs/2020-02-18_15_28_18-1758806909402324707?project=apache-beam-testing
Worker logs: https://console.cloud.google.com/dataflow/jobsDetail/locations/us-central1/jobs/2020-02-18_15_34_26-972712595612638388?project=apache-beam-testing
Worker logs: https://console.cloud.google.com/dataflow/jobsDetail/locations/us-central1/jobs/2020-02-18_15_40_52-7274392544548712737?project=apache-beam-testing
Worker logs: https://console.cloud.google.com/dataflow/jobsDetail/locations/us-central1/jobs/2020-02-18_15_47_28-12572501343392016869?project=apache-beam-testing

> Task :sdks:python:test-suites:dataflow:py2:postCommitIT FAILED

FAILURE: Build completed with 2 failures.

1: Task failed with an exception.
-----------
* Where:
Build file '<https://builds.apache.org/job/beam_PostCommit_Python2/ws/src/sdks/python/test-suites/direct/py2/build.gradle'> line: 50

* What went wrong:
Execution failed for task ':sdks:python:test-suites:direct:py2:directRunnerIT'.
> Process 'command 'sh'' finished with non-zero exit value 1

* Try:
Run with --stacktrace option to get the stack trace. Run with --info or --debug option to get more log output. Run with --scan to get full insights.
==============================================================================

2: Task failed with an exception.
-----------
* Where:
Build file '<https://builds.apache.org/job/beam_PostCommit_Python2/ws/src/sdks/python/test-suites/dataflow/py2/build.gradle'> line: 85

* What went wrong:
Execution failed for task ':sdks:python:test-suites:dataflow:py2:postCommitIT'.
> Process 'command 'sh'' finished with non-zero exit value 1

* Try:
Run with --stacktrace option to get the stack trace. Run with --info or --debug option to get more log output. Run with --scan to get full insights.
==============================================================================

* Get more help at https://help.gradle.org

Deprecated Gradle features were used in this build, making it incompatible with Gradle 6.0.
Use '--warning-mode all' to show the individual deprecation warnings.
See https://docs.gradle.org/5.2.1/userguide/command_line_interface.html#sec:command_line_warnings

BUILD FAILED in 58m 31s
124 actionable tasks: 98 executed, 23 from cache, 3 up-to-date

Publishing build scan...
https://gradle.com/s/klls4xv2bgyug

Build step 'Invoke Gradle script' changed build result to FAILURE
Build step 'Invoke Gradle script' marked build as failure

---------------------------------------------------------------------
To unsubscribe, e-mail: builds-unsubscribe@beam.apache.org
For additional commands, e-mail: builds-help@beam.apache.org


Build failed in Jenkins: beam_PostCommit_Python2 #1741

Posted by Apache Jenkins Server <je...@builds.apache.org>.
See <https://builds.apache.org/job/beam_PostCommit_Python2/1741/display/redirect?page=changes>

Changes:

[chlarsen] Removed compile time generation of test Thrift class.


------------------------------------------
[...truncated 3.82 MB...]
	details = "Socket closed"
	debug_error_string = "{"created":"@1582064912.323969310","description":"Error received from peer ipv4:127.0.0.1:33307","file":"src/core/lib/surface/call.cc","file_line":1056,"grpc_message":"Socket closed","grpc_status":14}"
>

Exception in thread read_state:
Traceback (most recent call last):
  File "/usr/lib/python2.7/threading.py", line 801, in __bootstrap_inner
    self.run()
  File "/usr/lib/python2.7/threading.py", line 754, in run
    self.__target(*self.__args, **self.__kwargs)
  File "<https://builds.apache.org/job/beam_PostCommit_Python2/ws/src/sdks/python/apache_beam/runners/worker/sdk_worker.py",> line 675, in pull_responses
    for response in responses:
  File "<https://builds.apache.org/job/beam_PostCommit_Python2/ws/src/build/gradleenv/1866363813/local/lib/python2.7/site-packages/grpc/_channel.py",> line 413, in next
    return self._next()
  File "<https://builds.apache.org/job/beam_PostCommit_Python2/ws/src/build/gradleenv/1866363813/local/lib/python2.7/site-packages/grpc/_channel.py",> line 706, in _next
    raise self
_MultiThreadedRendezvous: <_MultiThreadedRendezvous of RPC that terminated with:
	status = StatusCode.UNAVAILABLE
	details = "Socket closed"
	debug_error_string = "{"created":"@1582064912.323795799","description":"Error received from peer ipv4:127.0.0.1:46197","file":"src/core/lib/surface/call.cc","file_line":1056,"grpc_message":"Socket closed","grpc_status":14}"
>


> Task :sdks:python:test-suites:portable:py2:postCommitPy2

> Task :sdks:python:test-suites:dataflow:py2:postCommitIT
test_game_stats_it (apache_beam.examples.complete.game.game_stats_it_test.GameStatsIT) ... ok
<https://builds.apache.org/job/beam_PostCommit_Python2/ws/src/sdks/python/apache_beam/io/gcp/bigquery_file_loads.py>:818: BeamDeprecationWarning: options is deprecated since First stable release. References to <pipeline>.options will not be supported
  temp_location = p.options.view_as(GoogleCloudOptions).temp_location
test_wordcount_it (apache_beam.examples.wordcount_it_test.WordCountIT) ... ok
test_wordcount_fnapi_it (apache_beam.examples.wordcount_it_test.WordCountIT) ... ok
<https://builds.apache.org/job/beam_PostCommit_Python2/ws/src/sdks/python/apache_beam/io/gcp/bigquery_io_read_pipeline.py>:84: FutureWarning: _ReadFromBigQuery is experimental.
  (options.view_as(GoogleCloudOptions).project, known_args.input_table))
<https://builds.apache.org/job/beam_PostCommit_Python2/ws/src/sdks/python/apache_beam/io/gcp/bigquery.py>:1655: BeamDeprecationWarning: options is deprecated since First stable release. References to <pipeline>.options will not be supported
  temp_location = pcoll.pipeline.options.view_as(
<https://builds.apache.org/job/beam_PostCommit_Python2/ws/src/sdks/python/apache_beam/io/gcp/bigquery_read_it_test.py>:275: FutureWarning: _ReadFromBigQuery is experimental.
  query=self.query, use_standard_sql=True, project=self.project))
<https://builds.apache.org/job/beam_PostCommit_Python2/ws/src/sdks/python/apache_beam/io/gcp/bigquery.py>:1655: BeamDeprecationWarning: options is deprecated since First stable release. References to <pipeline>.options will not be supported
  temp_location = pcoll.pipeline.options.view_as(
test_streaming_wordcount_it (apache_beam.examples.streaming_wordcount_it_test.StreamingWordCountIT) ... ok
<https://builds.apache.org/job/beam_PostCommit_Python2/ws/src/sdks/python/apache_beam/io/gcp/bigquery_read_it_test.py>:162: FutureWarning: _ReadFromBigQuery is experimental.
  query=self.query, use_standard_sql=True, project=self.project))
<https://builds.apache.org/job/beam_PostCommit_Python2/ws/src/sdks/python/apache_beam/io/gcp/bigquery.py>:1655: BeamDeprecationWarning: options is deprecated since First stable release. References to <pipeline>.options will not be supported
  temp_location = pcoll.pipeline.options.view_as(
test_user_score_it (apache_beam.examples.complete.game.user_score_it_test.UserScoreIT) ... ok
<https://builds.apache.org/job/beam_PostCommit_Python2/ws/src/sdks/python/apache_beam/io/gcp/bigquery_test.py>:823: BeamDeprecationWarning: options is deprecated since First stable release. References to <pipeline>.options will not be supported
  streaming = self.test_pipeline.options.view_as(StandardOptions).streaming
<https://builds.apache.org/job/beam_PostCommit_Python2/ws/src/sdks/python/apache_beam/io/gcp/bigquery.py>:1466: BeamDeprecationWarning: options is deprecated since First stable release. References to <pipeline>.options will not be supported
  experiments = p.options.view_as(DebugOptions).experiments or []
test_avro_it (apache_beam.examples.fastavro_it_test.FastavroIT) ... ok
<https://builds.apache.org/job/beam_PostCommit_Python2/ws/src/sdks/python/apache_beam/io/gcp/bigquery.py>:1466: BeamDeprecationWarning: options is deprecated since First stable release. References to <pipeline>.options will not be supported
  experiments = p.options.view_as(DebugOptions).experiments or []
<https://builds.apache.org/job/beam_PostCommit_Python2/ws/src/sdks/python/apache_beam/io/gcp/bigquery_file_loads.py>:818: BeamDeprecationWarning: options is deprecated since First stable release. References to <pipeline>.options will not be supported
  temp_location = p.options.view_as(GoogleCloudOptions).temp_location
test_hourly_team_score_it (apache_beam.examples.complete.game.hourly_team_score_it_test.HourlyTeamScoreIT) ... ok
<https://builds.apache.org/job/beam_PostCommit_Python2/ws/src/sdks/python/apache_beam/io/gcp/bigquery.py>:1463: BeamDeprecationWarning: options is deprecated since First stable release. References to <pipeline>.options will not be supported
  self.table_reference.projectId = pcoll.pipeline.options.view_as(
test_multiple_destinations_transform (apache_beam.io.gcp.bigquery_test.BigQueryStreamingInsertTransformIntegrationTests) ... ok
<https://builds.apache.org/job/beam_PostCommit_Python2/ws/src/sdks/python/apache_beam/runners/dataflow/dataflow_runner.py>:787: BeamDeprecationWarning: BigQuerySink is deprecated since 2.11.0. Use WriteToBigQuery instead.
  kms_key=transform.kms_key))
test_value_provider_transform (apache_beam.io.gcp.bigquery_test.BigQueryStreamingInsertTransformIntegrationTests) ... ok
<https://builds.apache.org/job/beam_PostCommit_Python2/ws/src/sdks/python/apache_beam/io/gcp/big_query_query_to_table_pipeline.py>:95: BeamDeprecationWarning: BigQuerySink is deprecated since 2.11.0. Use WriteToBigQuery instead.
  kms_key=kms_key))
test_iobase_source (apache_beam.io.gcp.bigquery_read_it_test.ReadNewTypesTests) ... ok
test_native_source (apache_beam.io.gcp.bigquery_read_it_test.ReadNewTypesTests) ... ok
test_copy (apache_beam.io.gcp.gcsio_integration_test.GcsIOIntegrationTest) ... ERROR
test_copy_batch (apache_beam.io.gcp.gcsio_integration_test.GcsIOIntegrationTest) ... ok
test_copy_batch_kms (apache_beam.io.gcp.gcsio_integration_test.GcsIOIntegrationTest) ... ok
test_copy_batch_rewrite_token (apache_beam.io.gcp.gcsio_integration_test.GcsIOIntegrationTest) ... ok
test_copy_kms (apache_beam.io.gcp.gcsio_integration_test.GcsIOIntegrationTest) ... ok
test_copy_rewrite_token (apache_beam.io.gcp.gcsio_integration_test.GcsIOIntegrationTest) ... ERROR
test_bigquery_read_1M_python (apache_beam.io.gcp.bigquery_io_read_it_test.BigqueryIOReadIT) ... ok
test_bigquery_read_custom_1M_python (apache_beam.io.gcp.bigquery_io_read_it_test.BigqueryIOReadIT) ... ok
<https://builds.apache.org/job/beam_PostCommit_Python2/ws/src/sdks/python/apache_beam/io/fileio_test.py>:303: FutureWarning: MatchAll is experimental.
  | 'GetPath' >> beam.Map(lambda metadata: metadata.path))
<https://builds.apache.org/job/beam_PostCommit_Python2/ws/src/sdks/python/apache_beam/io/fileio_test.py>:316: FutureWarning: MatchAll is experimental.
  | 'Checksums' >> beam.Map(compute_hash))
<https://builds.apache.org/job/beam_PostCommit_Python2/ws/src/sdks/python/apache_beam/io/fileio_test.py>:316: FutureWarning: ReadMatches is experimental.
  | 'Checksums' >> beam.Map(compute_hash))
test_iobase_source (apache_beam.io.gcp.bigquery_read_it_test.ReadTests) ... ok
test_native_source (apache_beam.io.gcp.bigquery_read_it_test.ReadTests) ... ok
test_bqfl_streaming (apache_beam.io.gcp.bigquery_file_loads_test.BigQueryFileLoadsIT) ... SKIP: TestStream is not supported on TestDataflowRunner
test_multiple_destinations_transform (apache_beam.io.gcp.bigquery_file_loads_test.BigQueryFileLoadsIT) ... ok
test_one_job_fails_all_jobs_fail (apache_beam.io.gcp.bigquery_file_loads_test.BigQueryFileLoadsIT) ... ok
test_transform_on_gcs (apache_beam.io.fileio_test.MatchIntegrationTest) ... ok
test_parquetio_it (apache_beam.io.parquetio_it_test.TestParquetIT) ... ok
test_file_loads (apache_beam.io.gcp.bigquery_test.PubSubBigQueryIT) ... SKIP: https://issuetracker.google.com/issues/118375066
test_streaming_inserts (apache_beam.io.gcp.bigquery_test.PubSubBigQueryIT) ... ok
test_basic_execution (apache_beam.testing.test_stream_it_test.TestStreamIntegrationTests) ... SKIP: The "TestDataflowRunner", does not support the TestStream transform. Supported runners: ['DirectRunner', 'SwitchingDirectRunner']
Tests that the TestStream supports emitting to multiple PCollections. ... SKIP: The "TestDataflowRunner", does not support the TestStream transform. Supported runners: ['DirectRunner', 'SwitchingDirectRunner']
Tests that the TestStream can independently control output watermarks. ... SKIP: The "TestDataflowRunner", does not support the TestStream transform. Supported runners: ['DirectRunner', 'SwitchingDirectRunner']
test_streaming_data_only (apache_beam.io.gcp.pubsub_integration_test.PubSubIntegrationTest) ... ok
test_streaming_with_attributes (apache_beam.io.gcp.pubsub_integration_test.PubSubIntegrationTest) ... ok
Runs streaming Dataflow job and verifies that user metrics are reported ... ok
test_job_python_from_python_it (apache_beam.transforms.external_test_it.ExternalTransformIT) ... ok
test_metrics_fnapi_it (apache_beam.runners.dataflow.dataflow_exercise_metrics_pipeline_test.ExerciseMetricsPipelineTest) ... ok
test_metrics_it (apache_beam.runners.dataflow.dataflow_exercise_metrics_pipeline_test.ExerciseMetricsPipelineTest) ... ok
test_big_query_write (apache_beam.io.gcp.bigquery_write_it_test.BigQueryWriteIntegrationTests) ... ok
test_big_query_write_new_types (apache_beam.io.gcp.bigquery_write_it_test.BigQueryWriteIntegrationTests) ... ok
test_big_query_write_schema_autodetect (apache_beam.io.gcp.bigquery_write_it_test.BigQueryWriteIntegrationTests) ... SKIP: DataflowRunner does not support schema autodetection
test_big_query_write_without_schema (apache_beam.io.gcp.bigquery_write_it_test.BigQueryWriteIntegrationTests) ... ok
test_big_query_legacy_sql (apache_beam.io.gcp.big_query_query_to_table_it_test.BigQueryQueryToTableIT) ... ok
test_big_query_new_types (apache_beam.io.gcp.big_query_query_to_table_it_test.BigQueryQueryToTableIT) ... ok
test_big_query_new_types_native (apache_beam.io.gcp.big_query_query_to_table_it_test.BigQueryQueryToTableIT) ... ok
test_big_query_standard_sql (apache_beam.io.gcp.big_query_query_to_table_it_test.BigQueryQueryToTableIT) ... ok
test_big_query_standard_sql_kms_key_native (apache_beam.io.gcp.big_query_query_to_table_it_test.BigQueryQueryToTableIT) ... ok
test_datastore_write_limit (apache_beam.io.gcp.datastore_write_it_test.DatastoreWriteIT) ... ok

======================================================================
ERROR: test_copy (apache_beam.io.gcp.gcsio_integration_test.GcsIOIntegrationTest)
----------------------------------------------------------------------
Traceback (most recent call last):
  File "<https://builds.apache.org/job/beam_PostCommit_Python2/ws/src/sdks/python/apache_beam/io/gcp/gcsio_integration_test.py",> line 83, in tearDown
    FileSystems.delete([self.gcs_tempdir + '/'])
  File "<https://builds.apache.org/job/beam_PostCommit_Python2/ws/src/sdks/python/apache_beam/io/filesystems.py",> line 343, in delete
    return filesystem.delete(paths)
  File "<https://builds.apache.org/job/beam_PostCommit_Python2/ws/src/sdks/python/apache_beam/io/gcp/gcsfilesystem.py",> line 348, in delete
    raise BeamIOError("Delete operation failed", exceptions)
BeamIOError: Delete operation failed with exceptions {'gs://temp-storage-for-end-to-end-tests/temp-it/gcs_it-0709909f-1ddf-4f6f-855c-fc849754b410/': HttpError(u'HttpError accessing <https://www.googleapis.com/batch/storage/v1>: response: <{\'status\': \'429\', \'Content-Length\': \'609\', \'Expires\': \'Tue, 18 Feb 2020 22:42:49 GMT\', \'Cache-Control\': \'private, max-age=0\', \'Date\': \'Tue, 18 Feb 2020 22:42:49 GMT\', \'Content-Type\': \'application/json; charset=UTF-8\'}>, content <{\n "error": {\n  "errors": [\n   {\n    "domain": "usageLimits",\n    "reason": "rateLimitExceeded",\n    "message": "The rate of change requests to the object temp-storage-for-end-to-end-tests/temp-it/gcs_it-0709909f-1ddf-4f6f-855c-fc849754b410/test_copy exceeds the rate limit. Please reduce the rate of create, update, and delete requests."\n   }\n  ],\n  "code": 429,\n  "message": "The rate of change requests to the object temp-storage-for-end-to-end-tests/temp-it/gcs_it-0709909f-1ddf-4f6f-855c-fc849754b410/test_copy exceeds the rate limit. Please reduce the rate of create, update, and delete requests."\n }\n}\n>',)}
-------------------- >> begin captured logging << --------------------
apache_beam.io.gcp.bigquery_read_it_test: INFO: Deleting dataset python_read_table_15820650254784 in project apache-beam-testing
apache_beam.options.pipeline_options: WARNING: --region not set; will default to us-central1. Future releases of Beam will require the user to set --region explicitly, or else have a default set via the gcloud tool. https://cloud.google.com/compute/docs/regions-zones
apache_beam.io.gcp.gcsio: DEBUG: Rewrite done: gs://dataflow-samples/shakespeare/kinglear.txt to gs://temp-storage-for-end-to-end-tests/temp-it/gcs_it-0709909f-1ddf-4f6f-855c-fc849754b410/test_copy
apache_beam.io.filesystem: DEBUG: Listing files in 'gs://temp-storage-for-end-to-end-tests/temp-it/gcs_it-0709909f-1ddf-4f6f-855c-fc849754b410/'
apache_beam.io.filesystem: DEBUG: translate_pattern: 'gs://temp-storage-for-end-to-end-tests/temp-it/gcs_it-0709909f-1ddf-4f6f-855c-fc849754b410/*' -> 'gs\\:\\/\\/temp\\-storage\\-for\\-end\\-to\\-end\\-tests\\/temp\\-it\\/gcs\\_it\\-0709909f\\-1ddf\\-4f6f\\-855c\\-fc849754b410\\/[^/\\\\]*'
apache_beam.io.gcp.gcsio: INFO: Starting the size estimation of the input
apache_beam.io.gcp.gcsio: INFO: Finished listing 1 files in 0.0343859195709 seconds.
--------------------- >> end captured logging << ---------------------

======================================================================
ERROR: test_copy_rewrite_token (apache_beam.io.gcp.gcsio_integration_test.GcsIOIntegrationTest)
----------------------------------------------------------------------
Traceback (most recent call last):
  File "<https://builds.apache.org/job/beam_PostCommit_Python2/ws/src/sdks/python/apache_beam/io/gcp/gcsio_integration_test.py",> line 83, in tearDown
    FileSystems.delete([self.gcs_tempdir + '/'])
  File "<https://builds.apache.org/job/beam_PostCommit_Python2/ws/src/sdks/python/apache_beam/io/filesystems.py",> line 343, in delete
    return filesystem.delete(paths)
  File "<https://builds.apache.org/job/beam_PostCommit_Python2/ws/src/sdks/python/apache_beam/io/gcp/gcsfilesystem.py",> line 348, in delete
    raise BeamIOError("Delete operation failed", exceptions)
BeamIOError: Delete operation failed with exceptions {'gs://temp-storage-for-end-to-end-tests/temp-it/gcs_it-efee67f5-ef88-4c57-a125-929d0ece0dfc/': HttpError(u'HttpError accessing <https://www.googleapis.com/batch/storage/v1>: response: <{\'status\': \'429\', \'Content-Length\': \'637\', \'Expires\': \'Tue, 18 Feb 2020 22:43:25 GMT\', \'Cache-Control\': \'private, max-age=0\', \'Date\': \'Tue, 18 Feb 2020 22:43:25 GMT\', \'Content-Type\': \'application/json; charset=UTF-8\'}>, content <{\n "error": {\n  "errors": [\n   {\n    "domain": "usageLimits",\n    "reason": "rateLimitExceeded",\n    "message": "The rate of change requests to the object temp-storage-for-end-to-end-tests/temp-it/gcs_it-efee67f5-ef88-4c57-a125-929d0ece0dfc/test_copy_rewrite_token exceeds the rate limit. Please reduce the rate of create, update, and delete requests."\n   }\n  ],\n  "code": 429,\n  "message": "The rate of change requests to the object temp-storage-for-end-to-end-tests/temp-it/gcs_it-efee67f5-ef88-4c57-a125-929d0ece0dfc/test_copy_rewrite_token exceeds the rate limit. Please reduce the rate of create, update, and delete requests."\n }\n}\n>',)}
-------------------- >> begin captured logging << --------------------
apache_beam.options.pipeline_options: WARNING: --region not set; will default to us-central1. Future releases of Beam will require the user to set --region explicitly, or else have a default set via the gcloud tool. https://cloud.google.com/compute/docs/regions-zones
apache_beam.io.gcp.gcsio: DEBUG: Rewrite progress: 52428800 of 161612163 bytes, gs://dataflow-samples/wikipedia_edits/wiki_data-000000000000.json to gs://temp-storage-for-end-to-end-tests/temp-it/gcs_it-efee67f5-ef88-4c57-a125-929d0ece0dfc/test_copy_rewrite_token
apache_beam.io.gcp.gcsio: DEBUG: Rewrite progress: 104857600 of 161612163 bytes, gs://dataflow-samples/wikipedia_edits/wiki_data-000000000000.json to gs://temp-storage-for-end-to-end-tests/temp-it/gcs_it-efee67f5-ef88-4c57-a125-929d0ece0dfc/test_copy_rewrite_token
apache_beam.io.gcp.gcsio: DEBUG: Rewrite progress: 157286400 of 161612163 bytes, gs://dataflow-samples/wikipedia_edits/wiki_data-000000000000.json to gs://temp-storage-for-end-to-end-tests/temp-it/gcs_it-efee67f5-ef88-4c57-a125-929d0ece0dfc/test_copy_rewrite_token
apache_beam.io.gcp.gcsio: DEBUG: Rewrite done: gs://dataflow-samples/wikipedia_edits/wiki_data-000000000000.json to gs://temp-storage-for-end-to-end-tests/temp-it/gcs_it-efee67f5-ef88-4c57-a125-929d0ece0dfc/test_copy_rewrite_token
apache_beam.io.filesystem: DEBUG: Listing files in 'gs://temp-storage-for-end-to-end-tests/temp-it/gcs_it-efee67f5-ef88-4c57-a125-929d0ece0dfc/'
apache_beam.io.filesystem: DEBUG: translate_pattern: 'gs://temp-storage-for-end-to-end-tests/temp-it/gcs_it-efee67f5-ef88-4c57-a125-929d0ece0dfc/*' -> 'gs\\:\\/\\/temp\\-storage\\-for\\-end\\-to\\-end\\-tests\\/temp\\-it\\/gcs\\_it\\-efee67f5\\-ef88\\-4c57\\-a125\\-929d0ece0dfc\\/[^/\\\\]*'
apache_beam.io.gcp.gcsio: INFO: Starting the size estimation of the input
apache_beam.io.gcp.gcsio: INFO: Finished listing 1 files in 0.0276679992676 seconds.
--------------------- >> end captured logging << ---------------------

----------------------------------------------------------------------
XML: nosetests-postCommitIT-df.xml
----------------------------------------------------------------------
XML: <https://builds.apache.org/job/beam_PostCommit_Python2/ws/src/sdks/python/nosetests.xml>
----------------------------------------------------------------------
Ran 52 tests in 3332.055s

FAILED (SKIP=7, errors=2)
Worker logs: https://console.cloud.google.com/dataflow/jobsDetail/locations/us-central1/jobs/2020-02-18_14_15_58-12762844705125412085?project=apache-beam-testing
Worker logs: https://console.cloud.google.com/dataflow/jobsDetail/locations/us-central1/jobs/2020-02-18_14_24_20-1477160575981643987?project=apache-beam-testing
Worker logs: https://console.cloud.google.com/dataflow/jobsDetail/locations/us-central1/jobs/2020-02-18_14_33_23-4729947896210077506?project=apache-beam-testing
Worker logs: https://console.cloud.google.com/dataflow/jobsDetail/locations/us-central1/jobs/2020-02-18_14_40_14-7539032373912797392?project=apache-beam-testing
Worker logs: https://console.cloud.google.com/dataflow/jobsDetail/locations/us-central1/jobs/2020-02-18_14_46_05-8507147493181588730?project=apache-beam-testing
Worker logs: https://console.cloud.google.com/dataflow/jobsDetail/locations/us-central1/jobs/2020-02-18_14_52_32-14558157895741772982?project=apache-beam-testing
Worker logs: https://console.cloud.google.com/dataflow/jobsDetail/locations/us-central1/jobs/2020-02-18_14_58_59-2834314109314283118?project=apache-beam-testing
Worker logs: https://console.cloud.google.com/dataflow/jobsDetail/locations/us-central1/jobs/2020-02-18_15_05_02-329850809251485680?project=apache-beam-testing
Worker logs: https://console.cloud.google.com/dataflow/jobsDetail/locations/us-central1/jobs/2020-02-18_14_16_01-6345322658264510088?project=apache-beam-testing
Worker logs: https://console.cloud.google.com/dataflow/jobsDetail/locations/us-central1/jobs/2020-02-18_14_30_03-16484121352779799651?project=apache-beam-testing
Worker logs: https://console.cloud.google.com/dataflow/jobsDetail/locations/us-central1/jobs/2020-02-18_14_38_16-13745602666014603858?project=apache-beam-testing
Worker logs: https://console.cloud.google.com/dataflow/jobsDetail/locations/us-central1/jobs/2020-02-18_14_45_05-6381208534346395402?project=apache-beam-testing
Worker logs: https://console.cloud.google.com/dataflow/jobsDetail/locations/us-central1/jobs/2020-02-18_14_51_13-12309470281038745015?project=apache-beam-testing
Worker logs: https://console.cloud.google.com/dataflow/jobsDetail/locations/us-central1/jobs/2020-02-18_14_15_59-12135923382273046418?project=apache-beam-testing
Worker logs: https://console.cloud.google.com/dataflow/jobsDetail/locations/us-central1/jobs/2020-02-18_14_36_56-5597808005738537987?project=apache-beam-testing
Worker logs: https://console.cloud.google.com/dataflow/jobsDetail/locations/us-central1/jobs/2020-02-18_14_16_01-1284962665636658157?project=apache-beam-testing
Worker logs: https://console.cloud.google.com/dataflow/jobsDetail/locations/us-central1/jobs/2020-02-18_14_27_52-12046955258095665736?project=apache-beam-testing
Worker logs: https://console.cloud.google.com/dataflow/jobsDetail/locations/us-central1/jobs/2020-02-18_14_34_11-9148773907490948854?project=apache-beam-testing
Worker logs: https://console.cloud.google.com/dataflow/jobsDetail/locations/us-central1/jobs/2020-02-18_14_40_45-4379022730927253532?project=apache-beam-testing
Worker logs: https://console.cloud.google.com/dataflow/jobsDetail/locations/us-central1/jobs/2020-02-18_14_46_34-536222403645023065?project=apache-beam-testing
Worker logs: https://console.cloud.google.com/dataflow/jobsDetail/locations/us-central1/jobs/2020-02-18_14_52_57-18097030355210088909?project=apache-beam-testing
Worker logs: https://console.cloud.google.com/dataflow/jobsDetail/locations/us-central1/jobs/2020-02-18_14_15_59-2800051056514540197?project=apache-beam-testing
Worker logs: https://console.cloud.google.com/dataflow/jobsDetail/locations/us-central1/jobs/2020-02-18_14_32_53-3805413038429464540?project=apache-beam-testing
Worker logs: https://console.cloud.google.com/dataflow/jobsDetail/locations/us-central1/jobs/2020-02-18_14_39_37-18360516259842231998?project=apache-beam-testing
Worker logs: https://console.cloud.google.com/dataflow/jobsDetail/locations/us-central1/jobs/2020-02-18_14_46_05-15041574893504664253?project=apache-beam-testing
Worker logs: https://console.cloud.google.com/dataflow/jobsDetail/locations/us-central1/jobs/2020-02-18_14_52_29-1523706058824397450?project=apache-beam-testing
Worker logs: https://console.cloud.google.com/dataflow/jobsDetail/locations/us-central1/jobs/2020-02-18_14_15_59-3041976817808391237?project=apache-beam-testing
Worker logs: https://console.cloud.google.com/dataflow/jobsDetail/locations/us-central1/jobs/2020-02-18_14_23_32-6237828950987070450?project=apache-beam-testing
Worker logs: https://console.cloud.google.com/dataflow/jobsDetail/locations/us-central1/jobs/2020-02-18_14_30_42-451991191571693438?project=apache-beam-testing
Worker logs: https://console.cloud.google.com/dataflow/jobsDetail/locations/us-central1/jobs/2020-02-18_14_37_16-7609738212805906833?project=apache-beam-testing
Worker logs: https://console.cloud.google.com/dataflow/jobsDetail/locations/us-central1/jobs/2020-02-18_14_43_44-5715650247850313238?project=apache-beam-testing
Worker logs: https://console.cloud.google.com/dataflow/jobsDetail/locations/us-central1/jobs/2020-02-18_14_50_02-8587897053311878179?project=apache-beam-testing
Worker logs: https://console.cloud.google.com/dataflow/jobsDetail/locations/us-central1/jobs/2020-02-18_14_15_57-10633362548741367779?project=apache-beam-testing
Worker logs: https://console.cloud.google.com/dataflow/jobsDetail/locations/us-central1/jobs/2020-02-18_14_22_52-10874426717181409432?project=apache-beam-testing
Worker logs: https://console.cloud.google.com/dataflow/jobsDetail/locations/us-central1/jobs/2020-02-18_14_31_43-17302581812014045181?project=apache-beam-testing
Worker logs: https://console.cloud.google.com/dataflow/jobsDetail/locations/us-central1/jobs/2020-02-18_14_38_15-16966058980248584623?project=apache-beam-testing
Worker logs: https://console.cloud.google.com/dataflow/jobsDetail/locations/us-central1/jobs/2020-02-18_14_44_19-10891811369372173777?project=apache-beam-testing
Worker logs: https://console.cloud.google.com/dataflow/jobsDetail/locations/us-central1/jobs/2020-02-18_14_51_17-7991004615453511711?project=apache-beam-testing
Worker logs: https://console.cloud.google.com/dataflow/jobsDetail/locations/us-central1/jobs/2020-02-18_14_15_59-557813722014881720?project=apache-beam-testing
Worker logs: https://console.cloud.google.com/dataflow/jobsDetail/locations/us-central1/jobs/2020-02-18_14_23_31-15318335505086667609?project=apache-beam-testing
Worker logs: https://console.cloud.google.com/dataflow/jobsDetail/locations/us-central1/jobs/2020-02-18_14_30_40-7851051015762501901?project=apache-beam-testing
Worker logs: https://console.cloud.google.com/dataflow/jobsDetail/locations/us-central1/jobs/2020-02-18_14_37_30-1757196403048762405?project=apache-beam-testing
Worker logs: https://console.cloud.google.com/dataflow/jobsDetail/locations/us-central1/jobs/2020-02-18_14_44_14-5512414339130458472?project=apache-beam-testing
Worker logs: https://console.cloud.google.com/dataflow/jobsDetail/locations/us-central1/jobs/2020-02-18_14_50_38-8264806119301049558?project=apache-beam-testing

> Task :sdks:python:test-suites:dataflow:py2:postCommitIT FAILED

FAILURE: Build completed with 2 failures.

1: Task failed with an exception.
-----------
* Where:
Build file '<https://builds.apache.org/job/beam_PostCommit_Python2/ws/src/sdks/python/test-suites/direct/py2/build.gradle'> line: 72

* What went wrong:
Execution failed for task ':sdks:python:test-suites:direct:py2:directRunnerIT'.
> Process 'command 'sh'' finished with non-zero exit value 1

* Try:
Run with --stacktrace option to get the stack trace. Run with --info or --debug option to get more log output. Run with --scan to get full insights.
==============================================================================

2: Task failed with an exception.
-----------
* Where:
Build file '<https://builds.apache.org/job/beam_PostCommit_Python2/ws/src/sdks/python/test-suites/dataflow/py2/build.gradle'> line: 85

* What went wrong:
Execution failed for task ':sdks:python:test-suites:dataflow:py2:postCommitIT'.
> Process 'command 'sh'' finished with non-zero exit value 1

* Try:
Run with --stacktrace option to get the stack trace. Run with --info or --debug option to get more log output. Run with --scan to get full insights.
==============================================================================

* Get more help at https://help.gradle.org

Deprecated Gradle features were used in this build, making it incompatible with Gradle 6.0.
Use '--warning-mode all' to show the individual deprecation warnings.
See https://docs.gradle.org/5.2.1/userguide/command_line_interface.html#sec:command_line_warnings

BUILD FAILED in 56m 55s
124 actionable tasks: 98 executed, 23 from cache, 3 up-to-date

Publishing build scan...
https://gradle.com/s/r3zm3aabov6sw

Build step 'Invoke Gradle script' changed build result to FAILURE
Build step 'Invoke Gradle script' marked build as failure

---------------------------------------------------------------------
To unsubscribe, e-mail: builds-unsubscribe@beam.apache.org
For additional commands, e-mail: builds-help@beam.apache.org