You are viewing a plain text version of this content. The canonical link for it is here.
Posted to mapreduce-dev@hadoop.apache.org by Apache Jenkins Server <je...@builds.apache.org> on 2015/11/12 17:39:33 UTC
Hadoop-Mapreduce-trunk - Build # 2601 - Failure
See https://builds.apache.org/job/Hadoop-Mapreduce-trunk/2601/
###################################################################################
########################## LAST 60 LINES OF THE CONSOLE ###########################
[...truncated 31981 lines...]
Running org.apache.hadoop.mapred.TestMapFileOutputFormat
Tests run: 1, Failures: 0, Errors: 0, Skipped: 0, Time elapsed: 0.953 sec - in org.apache.hadoop.mapred.TestMapFileOutputFormat
Running org.apache.hadoop.mapred.TestJobAclsManager
Tests run: 4, Failures: 0, Errors: 0, Skipped: 0, Time elapsed: 4.575 sec - in org.apache.hadoop.mapred.TestJobAclsManager
Running org.apache.hadoop.mapred.TestLineRecordReader
Tests run: 12, Failures: 0, Errors: 0, Skipped: 0, Time elapsed: 23.383 sec - in org.apache.hadoop.mapred.TestLineRecordReader
Running org.apache.hadoop.mapred.TestClock
Tests run: 1, Failures: 0, Errors: 0, Skipped: 0, Time elapsed: 0.342 sec - in org.apache.hadoop.mapred.TestClock
Running org.apache.hadoop.mapred.TestJobQueueClient
Tests run: 1, Failures: 0, Errors: 0, Skipped: 0, Time elapsed: 0.3 sec - in org.apache.hadoop.mapred.TestJobQueueClient
Results :
Failed tests:
TestJobEndNotifier.testNotificationTimeout:182 null
Tests run: 208, Failures: 1, Errors: 0, Skipped: 0
[INFO] ------------------------------------------------------------------------
[INFO] Reactor Summary:
[INFO]
[INFO] Apache Hadoop MapReduce Client .................... SUCCESS [ 9.288 s]
[INFO] Apache Hadoop MapReduce Core ...................... FAILURE [05:11 min]
[INFO] Apache Hadoop MapReduce Common .................... SKIPPED
[INFO] Apache Hadoop MapReduce Shuffle ................... SKIPPED
[INFO] Apache Hadoop MapReduce App ....................... SKIPPED
[INFO] Apache Hadoop MapReduce HistoryServer ............. SKIPPED
[INFO] Apache Hadoop MapReduce JobClient ................. SKIPPED
[INFO] Apache Hadoop MapReduce HistoryServer Plugins ..... SKIPPED
[INFO] Apache Hadoop MapReduce NativeTask ................ SKIPPED
[INFO] Apache Hadoop MapReduce Examples .................. SKIPPED
[INFO] Apache Hadoop MapReduce ........................... SKIPPED
[INFO] ------------------------------------------------------------------------
[INFO] BUILD FAILURE
[INFO] ------------------------------------------------------------------------
[INFO] Total time: 05:25 min
[INFO] Finished at: 2015-11-12T16:39:15+00:00
[INFO] Final Memory: 39M/1292M
[INFO] ------------------------------------------------------------------------
[ERROR] Failed to execute goal org.apache.maven.plugins:maven-surefire-plugin:2.17:test (default-test) on project hadoop-mapreduce-client-core: There are test failures.
[ERROR]
[ERROR] Please refer to /home/jenkins/jenkins-slave/workspace/Hadoop-Mapreduce-trunk/hadoop-mapreduce-project/hadoop-mapreduce-client/hadoop-mapreduce-client-core/target/surefire-reports for the individual test results.
[ERROR] -> [Help 1]
[ERROR]
[ERROR] To see the full stack trace of the errors, re-run Maven with the -e switch.
[ERROR] Re-run Maven using the -X switch to enable full debug logging.
[ERROR]
[ERROR] For more information about the errors and possible solutions, please read the following articles:
[ERROR] [Help 1] http://cwiki.apache.org/confluence/display/MAVEN/MojoFailureException
[ERROR]
[ERROR] After correcting the problems, you can resume the build with the command
[ERROR] mvn <goals> -rf :hadoop-mapreduce-client-core
Build step 'Execute shell' marked build as failure
[FINDBUGS] Skipping publisher since build result is FAILURE
Archiving artifacts
Recording test results
Updating YARN-4345
Email was triggered for: Failure - Any
Sending email for trigger: Failure - Any
###################################################################################
############################## FAILED TESTS (if any) ##############################
1 tests failed.
FAILED: org.apache.hadoop.mapred.TestJobEndNotifier.testNotificationTimeout
Error Message:
null
Stack Trace:
junit.framework.AssertionFailedError: null
at junit.framework.Assert.fail(Assert.java:55)
at junit.framework.Assert.assertTrue(Assert.java:22)
at junit.framework.Assert.assertTrue(Assert.java:31)
at junit.framework.TestCase.assertTrue(TestCase.java:201)
at org.apache.hadoop.mapred.TestJobEndNotifier.testNotificationTimeout(TestJobEndNotifier.java:182)
Hadoop-Mapreduce-trunk - Build # 2605 - Still Failing
Posted by Apache Jenkins Server <je...@builds.apache.org>.
See https://builds.apache.org/job/Hadoop-Mapreduce-trunk/2605/
###################################################################################
########################## LAST 60 LINES OF THE CONSOLE ###########################
[...truncated 32274 lines...]
Running org.apache.hadoop.mapreduce.v2.app.TestKill
Tests run: 6, Failures: 0, Errors: 0, Skipped: 0, Time elapsed: 14.665 sec - in org.apache.hadoop.mapreduce.v2.app.TestKill
Running org.apache.hadoop.mapreduce.TestMapreduceConfigFields
Tests run: 2, Failures: 0, Errors: 0, Skipped: 0, Time elapsed: 0.926 sec - in org.apache.hadoop.mapreduce.TestMapreduceConfigFields
Running org.apache.hadoop.mapred.TestTaskAttemptListenerImpl
Tests run: 6, Failures: 0, Errors: 0, Skipped: 0, Time elapsed: 1.497 sec - in org.apache.hadoop.mapred.TestTaskAttemptListenerImpl
Running org.apache.hadoop.mapred.TestLocalContainerLauncher
Tests run: 2, Failures: 0, Errors: 0, Skipped: 0, Time elapsed: 2.09 sec - in org.apache.hadoop.mapred.TestLocalContainerLauncher
Running org.apache.hadoop.mapred.TestTaskAttemptFinishingMonitor
Tests run: 1, Failures: 0, Errors: 0, Skipped: 0, Time elapsed: 1.928 sec - in org.apache.hadoop.mapred.TestTaskAttemptFinishingMonitor
Results :
Failed tests:
TestJobImpl.testUnusableNodeTransition:629->assertJobState:1012 expected:<SUCCEEDED> but was:<ERROR>
Tests run: 340, Failures: 1, Errors: 0, Skipped: 0
[INFO] ------------------------------------------------------------------------
[INFO] Reactor Summary:
[INFO]
[INFO] Apache Hadoop MapReduce Client .................... SUCCESS [ 4.417 s]
[INFO] Apache Hadoop MapReduce Core ...................... SUCCESS [02:18 min]
[INFO] Apache Hadoop MapReduce Common .................... SUCCESS [ 39.496 s]
[INFO] Apache Hadoop MapReduce Shuffle ................... SUCCESS [ 6.455 s]
[INFO] Apache Hadoop MapReduce App ....................... FAILURE [10:47 min]
[INFO] Apache Hadoop MapReduce HistoryServer ............. SKIPPED
[INFO] Apache Hadoop MapReduce JobClient ................. SKIPPED
[INFO] Apache Hadoop MapReduce HistoryServer Plugins ..... SKIPPED
[INFO] Apache Hadoop MapReduce NativeTask ................ SKIPPED
[INFO] Apache Hadoop MapReduce Examples .................. SKIPPED
[INFO] Apache Hadoop MapReduce ........................... SKIPPED
[INFO] ------------------------------------------------------------------------
[INFO] BUILD FAILURE
[INFO] ------------------------------------------------------------------------
[INFO] Total time: 13:58 min
[INFO] Finished at: 2015-11-13T08:21:27+00:00
[INFO] Final Memory: 39M/739M
[INFO] ------------------------------------------------------------------------
[ERROR] Failed to execute goal org.apache.maven.plugins:maven-surefire-plugin:2.17:test (default-test) on project hadoop-mapreduce-client-app: There are test failures.
[ERROR]
[ERROR] Please refer to /home/jenkins/jenkins-slave/workspace/Hadoop-Mapreduce-trunk/hadoop-mapreduce-project/hadoop-mapreduce-client/hadoop-mapreduce-client-app/target/surefire-reports for the individual test results.
[ERROR] -> [Help 1]
[ERROR]
[ERROR] To see the full stack trace of the errors, re-run Maven with the -e switch.
[ERROR] Re-run Maven using the -X switch to enable full debug logging.
[ERROR]
[ERROR] For more information about the errors and possible solutions, please read the following articles:
[ERROR] [Help 1] http://cwiki.apache.org/confluence/display/MAVEN/MojoFailureException
[ERROR]
[ERROR] After correcting the problems, you can resume the build with the command
[ERROR] mvn <goals> -rf :hadoop-mapreduce-client-app
Build step 'Execute shell' marked build as failure
[FINDBUGS] Skipping publisher since build result is FAILURE
Archiving artifacts
Recording test results
Updating HDFS-9410
Email was triggered for: Failure - Any
Sending email for trigger: Failure - Any
###################################################################################
############################## FAILED TESTS (if any) ##############################
1 tests failed.
FAILED: org.apache.hadoop.mapreduce.v2.app.job.impl.TestJobImpl.testUnusableNodeTransition
Error Message:
expected:<SUCCEEDED> but was:<ERROR>
Stack Trace:
java.lang.AssertionError: expected:<SUCCEEDED> but was:<ERROR>
at org.junit.Assert.fail(Assert.java:88)
at org.junit.Assert.failNotEquals(Assert.java:743)
at org.junit.Assert.assertEquals(Assert.java:118)
at org.junit.Assert.assertEquals(Assert.java:144)
at org.apache.hadoop.mapreduce.v2.app.job.impl.TestJobImpl.assertJobState(TestJobImpl.java:1012)
at org.apache.hadoop.mapreduce.v2.app.job.impl.TestJobImpl.testUnusableNodeTransition(TestJobImpl.java:629)
Hadoop-Mapreduce-trunk - Build # 2604 - Still Failing
Posted by Apache Jenkins Server <je...@builds.apache.org>.
See https://builds.apache.org/job/Hadoop-Mapreduce-trunk/2604/
###################################################################################
########################## LAST 60 LINES OF THE CONSOLE ###########################
[...truncated 35531 lines...]
Running org.apache.hadoop.mapred.TestReporter
Tests run: 3, Failures: 0, Errors: 0, Skipped: 0, Time elapsed: 14.467 sec - in org.apache.hadoop.mapred.TestReporter
Running org.apache.hadoop.mapred.TestClientRedirect
Tests run: 1, Failures: 0, Errors: 0, Skipped: 0, Time elapsed: 16.713 sec - in org.apache.hadoop.mapred.TestClientRedirect
Running org.apache.hadoop.mapred.TestReduceFetchFromPartialMem
Tests run: 1, Failures: 0, Errors: 0, Skipped: 0, Time elapsed: 90.073 sec - in org.apache.hadoop.mapred.TestReduceFetchFromPartialMem
Running org.apache.hadoop.mapred.TestSpecialCharactersInOutputPath
Tests run: 1, Failures: 0, Errors: 0, Skipped: 0, Time elapsed: 31.056 sec - in org.apache.hadoop.mapred.TestSpecialCharactersInOutputPath
Running org.apache.hadoop.mapred.TestSequenceFileAsBinaryOutputFormat
Tests run: 3, Failures: 0, Errors: 0, Skipped: 0, Time elapsed: 2.623 sec - in org.apache.hadoop.mapred.TestSequenceFileAsBinaryOutputFormat
Results :
Tests in error:
TestMRJobsWithProfiler.testDifferentProfilers:117->testProfilerInternal:155 »
Tests run: 523, Failures: 0, Errors: 1, Skipped: 11
[INFO] ------------------------------------------------------------------------
[INFO] Reactor Summary:
[INFO]
[INFO] Apache Hadoop MapReduce Client .................... SUCCESS [ 3.943 s]
[INFO] Apache Hadoop MapReduce Core ...................... SUCCESS [02:22 min]
[INFO] Apache Hadoop MapReduce Common .................... SUCCESS [ 37.182 s]
[INFO] Apache Hadoop MapReduce Shuffle ................... SUCCESS [ 7.279 s]
[INFO] Apache Hadoop MapReduce App ....................... SUCCESS [11:10 min]
[INFO] Apache Hadoop MapReduce HistoryServer ............. SUCCESS [06:31 min]
[INFO] Apache Hadoop MapReduce JobClient ................. FAILURE [ 02:09 h]
[INFO] Apache Hadoop MapReduce HistoryServer Plugins ..... SKIPPED
[INFO] Apache Hadoop MapReduce NativeTask ................ SKIPPED
[INFO] Apache Hadoop MapReduce Examples .................. SKIPPED
[INFO] Apache Hadoop MapReduce ........................... SKIPPED
[INFO] ------------------------------------------------------------------------
[INFO] BUILD FAILURE
[INFO] ------------------------------------------------------------------------
[INFO] Total time: 02:30 h
[INFO] Finished at: 2015-11-13T02:01:49+00:00
[INFO] Final Memory: 37M/1174M
[INFO] ------------------------------------------------------------------------
[ERROR] Failed to execute goal org.apache.maven.plugins:maven-surefire-plugin:2.17:test (default-test) on project hadoop-mapreduce-client-jobclient: There are test failures.
[ERROR]
[ERROR] Please refer to /home/jenkins/jenkins-slave/workspace/Hadoop-Mapreduce-trunk/hadoop-mapreduce-project/hadoop-mapreduce-client/hadoop-mapreduce-client-jobclient/target/surefire-reports for the individual test results.
[ERROR] -> [Help 1]
[ERROR]
[ERROR] To see the full stack trace of the errors, re-run Maven with the -e switch.
[ERROR] Re-run Maven using the -X switch to enable full debug logging.
[ERROR]
[ERROR] For more information about the errors and possible solutions, please read the following articles:
[ERROR] [Help 1] http://cwiki.apache.org/confluence/display/MAVEN/MojoFailureException
[ERROR]
[ERROR] After correcting the problems, you can resume the build with the command
[ERROR] mvn <goals> -rf :hadoop-mapreduce-client-jobclient
Build step 'Execute shell' marked build as failure
[FINDBUGS] Skipping publisher since build result is FAILURE
Archiving artifacts
Recording test results
Updating YARN-1509
Email was triggered for: Failure - Any
Sending email for trigger: Failure - Any
###################################################################################
############################## FAILED TESTS (if any) ##############################
1 tests failed.
FAILED: org.apache.hadoop.mapreduce.v2.TestMRJobsWithProfiler.testDifferentProfilers
Error Message:
test timed out after 150000 milliseconds
Stack Trace:
java.lang.Exception: test timed out after 150000 milliseconds
at java.lang.Thread.sleep(Native Method)
at org.apache.hadoop.mapreduce.v2.TestMRJobsWithProfiler.testProfilerInternal(TestMRJobsWithProfiler.java:155)
at org.apache.hadoop.mapreduce.v2.TestMRJobsWithProfiler.testDifferentProfilers(TestMRJobsWithProfiler.java:117)
Hadoop-Mapreduce-trunk - Build # 2603 - Still Failing
Posted by Apache Jenkins Server <je...@builds.apache.org>.
See https://builds.apache.org/job/Hadoop-Mapreduce-trunk/2603/
###################################################################################
########################## LAST 60 LINES OF THE CONSOLE ###########################
[...truncated 35608 lines...]
Running org.apache.hadoop.mapred.TestSpecialCharactersInOutputPath
Tests run: 1, Failures: 0, Errors: 0, Skipped: 0, Time elapsed: 32.239 sec - in org.apache.hadoop.mapred.TestSpecialCharactersInOutputPath
Running org.apache.hadoop.mapred.TestSequenceFileAsBinaryOutputFormat
Tests run: 3, Failures: 0, Errors: 0, Skipped: 0, Time elapsed: 2.608 sec - in org.apache.hadoop.mapred.TestSequenceFileAsBinaryOutputFormat
Results :
Failed tests:
TestRMNMInfo.testRMNMInfo:111 Unexpected number of live nodes: expected:<4> but was:<3>
Tests in error:
TestMRJobsWithProfiler.testDifferentProfilers:117->testProfilerInternal:150 »
TestJobSysDirWithDFS.testWithDFS:130 » NoClassDefFound org/apache/hadoop/yarn/...
TestMRTimelineEventHandling.testMapreduceJobTimelineServiceEnabled:169 » IO Jo...
Tests run: 520, Failures: 1, Errors: 3, Skipped: 11
[INFO] ------------------------------------------------------------------------
[INFO] Reactor Summary:
[INFO]
[INFO] Apache Hadoop MapReduce Client .................... SUCCESS [ 3.932 s]
[INFO] Apache Hadoop MapReduce Core ...................... SUCCESS [02:13 min]
[INFO] Apache Hadoop MapReduce Common .................... SUCCESS [ 38.356 s]
[INFO] Apache Hadoop MapReduce Shuffle ................... SUCCESS [ 7.187 s]
[INFO] Apache Hadoop MapReduce App ....................... SUCCESS [10:52 min]
[INFO] Apache Hadoop MapReduce HistoryServer ............. SUCCESS [07:00 min]
[INFO] Apache Hadoop MapReduce JobClient ................. FAILURE [ 02:11 h]
[INFO] Apache Hadoop MapReduce HistoryServer Plugins ..... SKIPPED
[INFO] Apache Hadoop MapReduce NativeTask ................ SKIPPED
[INFO] Apache Hadoop MapReduce Examples .................. SKIPPED
[INFO] Apache Hadoop MapReduce ........................... SKIPPED
[INFO] ------------------------------------------------------------------------
[INFO] BUILD FAILURE
[INFO] ------------------------------------------------------------------------
[INFO] Total time: 02:32 h
[INFO] Finished at: 2015-11-12T22:49:16+00:00
[INFO] Final Memory: 34M/999M
[INFO] ------------------------------------------------------------------------
[ERROR] Failed to execute goal org.apache.maven.plugins:maven-surefire-plugin:2.17:test (default-test) on project hadoop-mapreduce-client-jobclient: ExecutionException: java.lang.RuntimeException: The forked VM terminated without properly saying goodbye. VM crash or System.exit called?
[ERROR] Command was /bin/sh -c cd /home/jenkins/jenkins-slave/workspace/Hadoop-Mapreduce-trunk/hadoop-mapreduce-project/hadoop-mapreduce-client/hadoop-mapreduce-client-jobclient && /home/jenkins/tools/java/jdk1.7.0_55/jre/bin/java -Xmx2048m -XX:MaxPermSize=768m -XX:+HeapDumpOnOutOfMemoryError -jar /home/jenkins/jenkins-slave/workspace/Hadoop-Mapreduce-trunk/hadoop-mapreduce-project/hadoop-mapreduce-client/hadoop-mapreduce-client-jobclient/target/surefire/surefirebooter6366807016751015533.jar /home/jenkins/jenkins-slave/workspace/Hadoop-Mapreduce-trunk/hadoop-mapreduce-project/hadoop-mapreduce-client/hadoop-mapreduce-client-jobclient/target/surefire/surefire7612549017674739701tmp /home/jenkins/jenkins-slave/workspace/Hadoop-Mapreduce-trunk/hadoop-mapreduce-project/hadoop-mapreduce-client/hadoop-mapreduce-client-jobclient/target/surefire/surefire_2457873576185960319164tmp
[ERROR] -> [Help 1]
[ERROR]
[ERROR] To see the full stack trace of the errors, re-run Maven with the -e switch.
[ERROR] Re-run Maven using the -X switch to enable full debug logging.
[ERROR]
[ERROR] For more information about the errors and possible solutions, please read the following articles:
[ERROR] [Help 1] http://cwiki.apache.org/confluence/display/MAVEN/MojoFailureException
[ERROR]
[ERROR] After correcting the problems, you can resume the build with the command
[ERROR] mvn <goals> -rf :hadoop-mapreduce-client-jobclient
Build step 'Execute shell' marked build as failure
[FINDBUGS] Skipping publisher since build result is FAILURE
Archiving artifacts
Recording test results
Updating YARN-4287
Updating YARN-4347
Updating HDFS-8968
Email was triggered for: Failure - Any
Sending email for trigger: Failure - Any
###################################################################################
############################## FAILED TESTS (if any) ##############################
4 tests failed.
FAILED: org.apache.hadoop.mapred.TestJobSysDirWithDFS.testWithDFS
Error Message:
org/apache/hadoop/yarn/server/utils/BuilderUtils
Stack Trace:
java.lang.NoClassDefFoundError: org/apache/hadoop/yarn/server/utils/BuilderUtils
at java.net.URLClassLoader$1.run(URLClassLoader.java:366)
at java.net.URLClassLoader$1.run(URLClassLoader.java:355)
at java.security.AccessController.doPrivileged(Native Method)
at java.net.URLClassLoader.findClass(URLClassLoader.java:354)
at java.lang.ClassLoader.loadClass(ClassLoader.java:425)
at sun.misc.Launcher$AppClassLoader.loadClass(Launcher.java:308)
at java.lang.ClassLoader.loadClass(ClassLoader.java:358)
at org.apache.hadoop.yarn.server.resourcemanager.RMServerUtils.<clinit>(RMServerUtils.java:426)
at org.apache.hadoop.yarn.server.resourcemanager.ResourceManager.serviceInit(ResourceManager.java:213)
at org.apache.hadoop.service.AbstractService.init(AbstractService.java:163)
at org.apache.hadoop.yarn.server.MiniYARNCluster.initResourceManager(MiniYARNCluster.java:299)
at org.apache.hadoop.yarn.server.MiniYARNCluster.access$400(MiniYARNCluster.java:99)
at org.apache.hadoop.yarn.server.MiniYARNCluster$ResourceManagerWrapper.serviceInit(MiniYARNCluster.java:451)
at org.apache.hadoop.service.AbstractService.init(AbstractService.java:163)
at org.apache.hadoop.service.CompositeService.serviceInit(CompositeService.java:107)
at org.apache.hadoop.yarn.server.MiniYARNCluster.serviceInit(MiniYARNCluster.java:273)
at org.apache.hadoop.mapreduce.v2.MiniMRYarnCluster.serviceInit(MiniMRYarnCluster.java:186)
at org.apache.hadoop.service.AbstractService.init(AbstractService.java:163)
at org.apache.hadoop.mapred.MiniMRClientClusterFactory.create(MiniMRClientClusterFactory.java:79)
at org.apache.hadoop.mapred.MiniMRCluster.<init>(MiniMRCluster.java:187)
at org.apache.hadoop.mapred.MiniMRCluster.<init>(MiniMRCluster.java:175)
at org.apache.hadoop.mapred.MiniMRCluster.<init>(MiniMRCluster.java:167)
at org.apache.hadoop.mapred.MiniMRCluster.<init>(MiniMRCluster.java:128)
at org.apache.hadoop.mapred.TestJobSysDirWithDFS.testWithDFS(TestJobSysDirWithDFS.java:130)
FAILED: org.apache.hadoop.mapred.TestMRTimelineEventHandling.testMapreduceJobTimelineServiceEnabled
Error Message:
Job didn't finish in 30 seconds
Stack Trace:
java.io.IOException: Job didn't finish in 30 seconds
at org.apache.hadoop.mapred.UtilsForTests.runJobSucceed(UtilsForTests.java:622)
at org.apache.hadoop.mapred.TestMRTimelineEventHandling.testMapreduceJobTimelineServiceEnabled(TestMRTimelineEventHandling.java:169)
FAILED: org.apache.hadoop.mapreduce.v2.TestMRJobsWithProfiler.testDifferentProfilers
Error Message:
test timed out after 150000 milliseconds
Stack Trace:
java.lang.Exception: test timed out after 150000 milliseconds
at java.lang.Thread.sleep(Native Method)
at org.apache.hadoop.mapreduce.Job.monitorAndPrintJob(Job.java:1353)
at org.apache.hadoop.mapreduce.Job.waitForCompletion(Job.java:1311)
at org.apache.hadoop.mapreduce.v2.TestMRJobsWithProfiler.testProfilerInternal(TestMRJobsWithProfiler.java:150)
at org.apache.hadoop.mapreduce.v2.TestMRJobsWithProfiler.testDifferentProfilers(TestMRJobsWithProfiler.java:117)
FAILED: org.apache.hadoop.mapreduce.v2.TestRMNMInfo.testRMNMInfo
Error Message:
Unexpected number of live nodes: expected:<4> but was:<3>
Stack Trace:
java.lang.AssertionError: Unexpected number of live nodes: expected:<4> but was:<3>
at org.junit.Assert.fail(Assert.java:88)
at org.junit.Assert.failNotEquals(Assert.java:743)
at org.junit.Assert.assertEquals(Assert.java:118)
at org.junit.Assert.assertEquals(Assert.java:555)
at org.apache.hadoop.mapreduce.v2.TestRMNMInfo.testRMNMInfo(TestRMNMInfo.java:111)
Hadoop-Mapreduce-trunk - Build # 2602 - Still Failing
Posted by Apache Jenkins Server <je...@builds.apache.org>.
See https://builds.apache.org/job/Hadoop-Mapreduce-trunk/2602/
###################################################################################
########################## LAST 60 LINES OF THE CONSOLE ###########################
[...truncated 32340 lines...]
Running org.apache.hadoop.mapreduce.v2.app.TestMRApp
Tests run: 13, Failures: 0, Errors: 0, Skipped: 0, Time elapsed: 21.93 sec - in org.apache.hadoop.mapreduce.v2.app.TestMRApp
Running org.apache.hadoop.mapred.TestTaskAttemptFinishingMonitor
Tests run: 1, Failures: 0, Errors: 0, Skipped: 0, Time elapsed: 1.583 sec - in org.apache.hadoop.mapred.TestTaskAttemptFinishingMonitor
Running org.apache.hadoop.mapred.TestTaskAttemptListenerImpl
Tests run: 6, Failures: 0, Errors: 0, Skipped: 0, Time elapsed: 1.346 sec - in org.apache.hadoop.mapred.TestTaskAttemptListenerImpl
Running org.apache.hadoop.mapred.TestLocalContainerLauncher
Tests run: 2, Failures: 0, Errors: 0, Skipped: 0, Time elapsed: 1.889 sec - in org.apache.hadoop.mapred.TestLocalContainerLauncher
Results :
Tests in error:
TestJobEndNotifier.testNotificationOnLastRetryNormalShutdown:202->startHttpServer:286 NoClassDefFound
TestJobEndNotifier.testAbsentNotificationOnNotLastRetryUnregistrationFailure:226->startHttpServer:286 NoClassDefFound
TestJobEndNotifier.testNotificationOnLastRetryUnregistrationFailure:253->startHttpServer:286 NoClassDefFound
TestRMContainerAllocator.testHeartbeatHandler:2289 » NoClassDefFound org/apach...
Tests run: 314, Failures: 0, Errors: 3, Skipped: 0
[INFO] ------------------------------------------------------------------------
[INFO] Reactor Summary:
[INFO]
[INFO] Apache Hadoop MapReduce Client .................... SUCCESS [ 3.940 s]
[INFO] Apache Hadoop MapReduce Core ...................... SUCCESS [01:40 min]
[INFO] Apache Hadoop MapReduce Common .................... SUCCESS [ 28.868 s]
[INFO] Apache Hadoop MapReduce Shuffle ................... SUCCESS [ 4.962 s]
[INFO] Apache Hadoop MapReduce App ....................... FAILURE [08:52 min]
[INFO] Apache Hadoop MapReduce HistoryServer ............. SKIPPED
[INFO] Apache Hadoop MapReduce JobClient ................. SKIPPED
[INFO] Apache Hadoop MapReduce HistoryServer Plugins ..... SKIPPED
[INFO] Apache Hadoop MapReduce NativeTask ................ SKIPPED
[INFO] Apache Hadoop MapReduce Examples .................. SKIPPED
[INFO] Apache Hadoop MapReduce ........................... SKIPPED
[INFO] ------------------------------------------------------------------------
[INFO] BUILD FAILURE
[INFO] ------------------------------------------------------------------------
[INFO] Total time: 11:12 min
[INFO] Finished at: 2015-11-12T19:10:30+00:00
[INFO] Final Memory: 41M/825M
[INFO] ------------------------------------------------------------------------
[ERROR] Failed to execute goal org.apache.maven.plugins:maven-surefire-plugin:2.17:test (default-test) on project hadoop-mapreduce-client-app: ExecutionException: java.lang.RuntimeException: The forked VM terminated without properly saying goodbye. VM crash or System.exit called?
[ERROR] Command was /bin/sh -c cd /home/jenkins/jenkins-slave/workspace/Hadoop-Mapreduce-trunk/hadoop-mapreduce-project/hadoop-mapreduce-client/hadoop-mapreduce-client-app && /home/jenkins/tools/java/jdk1.7.0_55/jre/bin/java -Xmx2048m -XX:MaxPermSize=768m -XX:+HeapDumpOnOutOfMemoryError -jar /home/jenkins/jenkins-slave/workspace/Hadoop-Mapreduce-trunk/hadoop-mapreduce-project/hadoop-mapreduce-client/hadoop-mapreduce-client-app/target/surefire/surefirebooter2186156745142312019.jar /home/jenkins/jenkins-slave/workspace/Hadoop-Mapreduce-trunk/hadoop-mapreduce-project/hadoop-mapreduce-client/hadoop-mapreduce-client-app/target/surefire/surefire5572211717518329587tmp /home/jenkins/jenkins-slave/workspace/Hadoop-Mapreduce-trunk/hadoop-mapreduce-project/hadoop-mapreduce-client/hadoop-mapreduce-client-app/target/surefire/surefire_915238474444519607689tmp
[ERROR] -> [Help 1]
[ERROR]
[ERROR] To see the full stack trace of the errors, re-run Maven with the -e switch.
[ERROR] Re-run Maven using the -X switch to enable full debug logging.
[ERROR]
[ERROR] For more information about the errors and possible solutions, please read the following articles:
[ERROR] [Help 1] http://cwiki.apache.org/confluence/display/MAVEN/MojoFailureException
[ERROR]
[ERROR] After correcting the problems, you can resume the build with the command
[ERROR] mvn <goals> -rf :hadoop-mapreduce-client-app
Build step 'Execute shell' marked build as failure
[FINDBUGS] Skipping publisher since build result is FAILURE
Archiving artifacts
Recording test results
Updating HADOOP-12562
Email was triggered for: Failure - Any
Sending email for trigger: Failure - Any
###################################################################################
############################## FAILED TESTS (if any) ##############################
3 tests failed.
FAILED: org.apache.hadoop.mapreduce.v2.app.TestJobEndNotifier.testNotificationOnLastRetryNormalShutdown
Error Message:
org/apache/hadoop/http/HttpServer2$Builder
Stack Trace:
java.lang.NoClassDefFoundError: org/apache/hadoop/http/HttpServer2$Builder
at java.net.URLClassLoader$1.run(URLClassLoader.java:366)
at java.net.URLClassLoader$1.run(URLClassLoader.java:355)
at java.security.AccessController.doPrivileged(Native Method)
at java.net.URLClassLoader.findClass(URLClassLoader.java:354)
at java.lang.ClassLoader.loadClass(ClassLoader.java:425)
at sun.misc.Launcher$AppClassLoader.loadClass(Launcher.java:308)
at java.lang.ClassLoader.loadClass(ClassLoader.java:358)
at org.apache.hadoop.mapreduce.v2.app.TestJobEndNotifier.startHttpServer(TestJobEndNotifier.java:286)
at org.apache.hadoop.mapreduce.v2.app.TestJobEndNotifier.testNotificationOnLastRetryNormalShutdown(TestJobEndNotifier.java:202)
FAILED: org.apache.hadoop.mapreduce.v2.app.TestJobEndNotifier.testAbsentNotificationOnNotLastRetryUnregistrationFailure
Error Message:
org/apache/hadoop/http/HttpServer2$Builder
Stack Trace:
java.lang.NoClassDefFoundError: org/apache/hadoop/http/HttpServer2$Builder
at org.apache.hadoop.mapreduce.v2.app.TestJobEndNotifier.startHttpServer(TestJobEndNotifier.java:286)
at org.apache.hadoop.mapreduce.v2.app.TestJobEndNotifier.testAbsentNotificationOnNotLastRetryUnregistrationFailure(TestJobEndNotifier.java:226)
FAILED: org.apache.hadoop.mapreduce.v2.app.TestJobEndNotifier.testNotificationOnLastRetryUnregistrationFailure
Error Message:
org/apache/hadoop/http/HttpServer2$Builder
Stack Trace:
java.lang.NoClassDefFoundError: org/apache/hadoop/http/HttpServer2$Builder
at org.apache.hadoop.mapreduce.v2.app.TestJobEndNotifier.startHttpServer(TestJobEndNotifier.java:286)
at org.apache.hadoop.mapreduce.v2.app.TestJobEndNotifier.testNotificationOnLastRetryUnregistrationFailure(TestJobEndNotifier.java:253)