You are viewing a plain text version of this content. The canonical link for it is here.
Posted to notifications@directory.apache.org by Apache Jenkins Server <je...@builds.apache.org> on 2017/12/24 18:09:00 UTC

Build failed in Jenkins: dir-kerby #442

See <https://builds.apache.org/job/dir-kerby/442/display/redirect>

------------------------------------------
[...truncated 1.07 MB...]
[INFO] Uploading: https://repository.apache.org/content/repositories/snapshots/org/apache/kerby/benchmark/1.1.1-SNAPSHOT/benchmark-1.1.1-20171224.180734-17-sources.jar
[INFO] Uploaded: https://repository.apache.org/content/repositories/snapshots/org/apache/kerby/benchmark/1.1.1-SNAPSHOT/benchmark-1.1.1-20171224.180734-17-sources.jar (25 KB at 32.9 KB/sec)
[INFO] Uploading: https://repository.apache.org/content/repositories/snapshots/org/apache/kerby/benchmark/1.1.1-SNAPSHOT/maven-metadata.xml
[INFO] Uploaded: https://repository.apache.org/content/repositories/snapshots/org/apache/kerby/benchmark/1.1.1-SNAPSHOT/maven-metadata.xml (993 B at 1.4 KB/sec)
[JENKINS] Archiving disabled
[INFO]                                                                         
[INFO] ------------------------------------------------------------------------
[INFO] Building HAS project 1.1.1-SNAPSHOT
[INFO] ------------------------------------------------------------------------
[INFO] 
[INFO] --- maven-clean-plugin:3.0.0:clean (default-clean) @ has-project ---
[INFO] 
[INFO] >>> maven-pmd-plugin:3.7:check (validate) > :pmd @ has-project >>>
[INFO] 
[INFO] --- maven-pmd-plugin:3.7:pmd (pmd) @ has-project ---
[INFO] 
[INFO] <<< maven-pmd-plugin:3.7:check (validate) < :pmd @ has-project <<<
[INFO] 
[INFO] --- maven-pmd-plugin:3.7:check (validate) @ has-project ---
[INFO] 
[INFO] --- maven-checkstyle-plugin:2.17:check (validate) @ has-project ---
[INFO] 
[INFO] --- maven-remote-resources-plugin:1.5:process (process-resource-bundles) @ has-project ---
[INFO] 
[INFO] --- maven-site-plugin:3.5.1:attach-descriptor (attach-descriptor) @ has-project ---
[INFO] 
[INFO] >>> maven-source-plugin:3.0.0:jar (attach-sources) > generate-sources @ has-project >>>
[INFO] 
[INFO] >>> maven-pmd-plugin:3.7:check (validate) > :pmd @ has-project >>>
[INFO] 
[INFO] --- maven-pmd-plugin:3.7:pmd (pmd) @ has-project ---
[INFO] 
[INFO] <<< maven-pmd-plugin:3.7:check (validate) < :pmd @ has-project <<<
[INFO] 
[INFO] --- maven-pmd-plugin:3.7:check (validate) @ has-project ---
[INFO] 
[INFO] --- maven-checkstyle-plugin:2.17:check (validate) @ has-project ---
[WARNING] Failed to getClass for org.apache.maven.plugins.source.SourceJarMojo
[INFO] 
[INFO] <<< maven-source-plugin:3.0.0:jar (attach-sources) < generate-sources @ has-project <<<
[INFO] 
[INFO] --- maven-source-plugin:3.0.0:jar (attach-sources) @ has-project ---
[INFO] 
[INFO] --- modernizer-maven-plugin:1.5.0:modernizer (modernizer-check) @ has-project ---
[INFO] 
[INFO] --- maven-install-plugin:2.5.2:install (default-install) @ has-project ---
[INFO] Installing <https://builds.apache.org/job/dir-kerby/ws/has-project/pom.xml> to /home/jenkins/jenkins-slave/maven-repositories/1/org/apache/kerby/has-project/1.1.1-SNAPSHOT/has-project-1.1.1-SNAPSHOT.pom
[INFO] 
[INFO] --- maven-deploy-plugin:2.8.2:deploy (default-deploy) @ has-project ---
[INFO] Downloading: https://repository.apache.org/content/repositories/snapshots/org/apache/kerby/has-project/1.1.1-SNAPSHOT/maven-metadata.xml
[INFO] Downloaded: https://repository.apache.org/content/repositories/snapshots/org/apache/kerby/has-project/1.1.1-SNAPSHOT/maven-metadata.xml (604 B at 1.3 KB/sec)
[INFO] Uploading: https://repository.apache.org/content/repositories/snapshots/org/apache/kerby/has-project/1.1.1-SNAPSHOT/has-project-1.1.1-20171224.180746-3.pom
[INFO] Uploaded: https://repository.apache.org/content/repositories/snapshots/org/apache/kerby/has-project/1.1.1-SNAPSHOT/has-project-1.1.1-20171224.180746-3.pom (638 B at 0.9 KB/sec)
[INFO] Downloading: https://repository.apache.org/content/repositories/snapshots/org/apache/kerby/has-project/maven-metadata.xml
[INFO] Downloaded: https://repository.apache.org/content/repositories/snapshots/org/apache/kerby/has-project/maven-metadata.xml (287 B at 0.6 KB/sec)
[INFO] Uploading: https://repository.apache.org/content/repositories/snapshots/org/apache/kerby/has-project/1.1.1-SNAPSHOT/maven-metadata.xml
[INFO] Uploaded: https://repository.apache.org/content/repositories/snapshots/org/apache/kerby/has-project/1.1.1-SNAPSHOT/maven-metadata.xml (604 B at 0.9 KB/sec)
[INFO] Uploading: https://repository.apache.org/content/repositories/snapshots/org/apache/kerby/has-project/maven-metadata.xml
[INFO] Uploaded: https://repository.apache.org/content/repositories/snapshots/org/apache/kerby/has-project/maven-metadata.xml (287 B at 0.4 KB/sec)
[JENKINS] Archiving disabled
[INFO]                                                                         
[INFO] ------------------------------------------------------------------------
[INFO] Building has-common 1.1.1-SNAPSHOT
[INFO] ------------------------------------------------------------------------
[INFO] Downloading: https://repo.maven.apache.org/maven2/org/apache/hadoop/hadoop-annotations/3.0.0/hadoop-annotations-3.0.0.pom
[INFO] Downloaded: https://repo.maven.apache.org/maven2/org/apache/hadoop/hadoop-annotations/3.0.0/hadoop-annotations-3.0.0.pom (3 KB at 31.3 KB/sec)
[INFO] Downloading: https://repo.maven.apache.org/maven2/org/apache/hadoop/hadoop-project/3.0.0/hadoop-project-3.0.0.pom
[INFO] Downloaded: https://repo.maven.apache.org/maven2/org/apache/hadoop/hadoop-project/3.0.0/hadoop-project-3.0.0.pom (62 KB at 1237.3 KB/sec)
[INFO] Downloading: https://repo.maven.apache.org/maven2/org/apache/hadoop/hadoop-main/3.0.0/hadoop-main-3.0.0.pom
[INFO] Downloaded: https://repo.maven.apache.org/maven2/org/apache/hadoop/hadoop-main/3.0.0/hadoop-main-3.0.0.pom (26 KB at 1317.1 KB/sec)
[INFO] Downloading: https://repo.maven.apache.org/maven2/org/apache/hadoop/hadoop-annotations/3.0.0/hadoop-annotations-3.0.0.jar
[INFO] Downloaded: https://repo.maven.apache.org/maven2/org/apache/hadoop/hadoop-annotations/3.0.0/hadoop-annotations-3.0.0.jar (59 KB at 2233.1 KB/sec)
[INFO] 
[INFO] --- maven-clean-plugin:3.0.0:clean (default-clean) @ has-common ---
[INFO] 
[INFO] >>> maven-pmd-plugin:3.7:check (validate) > :pmd @ has-common >>>
[INFO] 
[INFO] --- maven-pmd-plugin:3.7:pmd (pmd) @ has-common ---
[INFO] 
[INFO] <<< maven-pmd-plugin:3.7:check (validate) < :pmd @ has-common <<<
[INFO] 
[INFO] --- maven-pmd-plugin:3.7:check (validate) @ has-common ---
[INFO] 
[INFO] 
[INFO] --- maven-checkstyle-plugin:2.17:check (validate) @ has-common ---
[INFO] 
[INFO] --- maven-remote-resources-plugin:1.5:process (process-resource-bundles) @ has-common ---
[INFO] 
[INFO] --- maven-resources-plugin:2.7:resources (default-resources) @ has-common ---
[INFO] Using 'UTF-8' encoding to copy filtered resources.
[INFO] skip non existing resourceDirectory <https://builds.apache.org/job/dir-kerby/ws/has-project/has-common/src/main/resources>
[INFO] Copying 3 resources
[INFO] 
[INFO] --- maven-compiler-plugin:3.6.2:compile (default-compile) @ has-common ---
[INFO] Changes detected - recompiling the module!
[INFO] Compiling 19 source files to <https://builds.apache.org/job/dir-kerby/ws/has-project/has-common/target/classes>
[INFO] 
[INFO] --- maven-resources-plugin:2.7:testResources (default-testResources) @ has-common ---
[INFO] Using 'UTF-8' encoding to copy filtered resources.
[INFO] skip non existing resourceDirectory <https://builds.apache.org/job/dir-kerby/ws/has-project/has-common/src/test/resources>
[INFO] Copying 3 resources
[INFO] 
[INFO] --- maven-compiler-plugin:3.6.2:testCompile (default-testCompile) @ has-common ---
[INFO] No sources to compile
[INFO] 
[INFO] --- maven-surefire-plugin:2.20.1:test (default-test) @ has-common ---
[JENKINS] Recording test results
[INFO] 
[INFO] --- maven-surefire-plugin:2.20.1:test (default) @ has-common ---
[INFO] Skipping execution of surefire because it has already been run for this configuration
[JENKINS] Recording test results
[INFO] 
[INFO] --- maven-jar-plugin:3.0.0:jar (default-jar) @ has-common ---
[INFO] Building jar: <https://builds.apache.org/job/dir-kerby/ws/has-project/has-common/target/has-common-1.1.1-SNAPSHOT.jar>
[INFO] 
[INFO] --- maven-site-plugin:3.5.1:attach-descriptor (attach-descriptor) @ has-common ---
[INFO] 
[INFO] >>> maven-source-plugin:3.0.0:jar (attach-sources) > generate-sources @ has-common >>>
[INFO] 
[INFO] >>> maven-pmd-plugin:3.7:check (validate) > :pmd @ has-common >>>
[INFO] 
[INFO] --- maven-pmd-plugin:3.7:pmd (pmd) @ has-common ---
[INFO] 
[INFO] <<< maven-pmd-plugin:3.7:check (validate) < :pmd @ has-common <<<
[INFO] 
[INFO] --- maven-pmd-plugin:3.7:check (validate) @ has-common ---
[INFO] 
[INFO] 
[INFO] --- maven-checkstyle-plugin:2.17:check (validate) @ has-common ---
[WARNING] Failed to getClass for org.apache.maven.plugins.source.SourceJarMojo
[INFO] 
[INFO] <<< maven-source-plugin:3.0.0:jar (attach-sources) < generate-sources @ has-common <<<
[INFO] 
[INFO] --- maven-source-plugin:3.0.0:jar (attach-sources) @ has-common ---
[INFO] Building jar: <https://builds.apache.org/job/dir-kerby/ws/has-project/has-common/target/has-common-1.1.1-SNAPSHOT-sources.jar>
[INFO] 
[INFO] --- modernizer-maven-plugin:1.5.0:modernizer (modernizer-check) @ has-common ---
[ERROR] <https://builds.apache.org/job/dir-kerby/ws/has-project/has-common/src/main/java/org/apache/kerby/has/common/spnego/AuthToken.java>:114: Prefer java.lang.StringBuilder
[ERROR] <https://builds.apache.org/job/dir-kerby/ws/has-project/has-common/src/main/java/org/apache/kerby/has/common/ssl/SSLHostnameVerifier$AbstractVerifier.java>:379: Prefer java.lang.StringBuilder
[ERROR] <https://builds.apache.org/job/dir-kerby/ws/has-project/has-common/src/main/java/org/apache/kerby/has/common/ssl/SSLHostnameVerifier$AbstractVerifier.java>:418: Prefer java.lang.StringBuilder
[JENKINS] Archiving disabled
[JENKINS] Archiving disabled
[JENKINS] Archiving disabled
[JENKINS] Archiving disabled
[JENKINS] Archiving disabled
[JENKINS] Archiving disabled
[JENKINS] Archiving disabled
[JENKINS] Archiving disabled
[JENKINS] Archiving disabled
[JENKINS] Archiving disabled
[JENKINS] Archiving disabled
[JENKINS] Archiving disabled
[JENKINS] Archiving disabled
[JENKINS] Archiving disabled
[JENKINS] Archiving disabled
[JENKINS] Archiving disabled
[JENKINS] Archiving disabled
[JENKINS] Archiving disabled
[JENKINS] Archiving disabled
[JENKINS] Archiving disabled
[JENKINS] Archiving disabled
[JENKINS] Archiving disabled
[JENKINS] Archiving disabled
[JENKINS] Archiving disabled
[JENKINS] Archiving disabled
[JENKINS] Archiving disabled
[JENKINS] Archiving disabled
[JENKINS] Archiving disabled
[JENKINS] Archiving disabled
[JENKINS] Archiving disabled
[JENKINS] Archiving disabled
[JENKINS] Archiving disabled
[JENKINS] Archiving disabled
[JENKINS] Archiving disabled
[JENKINS] Archiving disabled
[JENKINS] Archiving disabled
[JENKINS] Archiving disabled
[JENKINS] Archiving disabled
[JENKINS] Archiving disabled
[JENKINS] Archiving disabled
[JENKINS] Archiving disabled
[JENKINS] Archiving disabled
[JENKINS] Archiving disabled
[JENKINS] Archiving disabled
[INFO] ------------------------------------------------------------------------
[INFO] Reactor Summary:
[INFO] 
[INFO] Apache Kerby Project ............................... SUCCESS [ 14.762 s]
[INFO] Kerby-common Project ............................... SUCCESS [  7.985 s]
[INFO] Kerby ASN1 Project ................................. SUCCESS [01:44 min]
[INFO] Kerby Config ....................................... SUCCESS [ 18.720 s]
[INFO] Kerby Util ......................................... SUCCESS [ 19.226 s]
[INFO] Kerby XDR Project .................................. SUCCESS [ 21.779 s]
[INFO] Kerby PKIX Project ................................. SUCCESS [ 23.961 s]
[INFO] Kerby-kerb Project ................................. SUCCESS [  8.404 s]
[INFO] Kerby-kerb core .................................... SUCCESS [ 30.789 s]
[INFO] Kerby-kerb Crypto .................................. SUCCESS [ 32.662 s]
[INFO] Kerby-kerb Common .................................. SUCCESS [ 19.337 s]
[INFO] Kerby-kerb Util .................................... SUCCESS [ 24.940 s]
[INFO] Kerby-kerb Identity ................................ SUCCESS [ 13.826 s]
[INFO] Kerby-kerb Identity Test ........................... SUCCESS [ 15.088 s]
[INFO] Kerby providers .................................... SUCCESS [  7.772 s]
[INFO] Token provider ..................................... SUCCESS [ 18.483 s]
[INFO] Kerby-kerb Client .................................. SUCCESS [ 23.160 s]
[INFO] Kerby-kerb Server .................................. SUCCESS [ 19.944 s]
[INFO] Kerby-kerb Admin ................................... SUCCESS [ 16.010 s]
[INFO] Kerb Simple Kdc .................................... SUCCESS [ 16.292 s]
[INFO] Kerby-kerb server all .............................. SUCCESS [ 11.664 s]
[INFO] Kerby KDC Server ................................... SUCCESS [ 14.928 s]
[INFO] Kerb Kdc Test ...................................... SUCCESS [ 54.908 s]
[INFO] Kerby-kerb GssAPI .................................. SUCCESS [ 16.476 s]
[INFO] Kerb Integration Test .............................. SUCCESS [ 53.633 s]
[INFO] Kerby-kerb Admin Server ............................ SUCCESS [ 15.857 s]
[INFO] Kerby-kerb client api all .......................... SUCCESS [ 11.627 s]
[INFO] Kdc Tool Project ................................... SUCCESS [  7.899 s]
[INFO] Client Tool ........................................ SUCCESS [ 22.670 s]
[INFO] KDC Tool ........................................... SUCCESS [ 15.415 s]
[INFO] Kerby Backend ...................................... SUCCESS [  8.442 s]
[INFO] Json identity backend .............................. SUCCESS [ 19.871 s]
[INFO] Kerby Kdc Test ..................................... SUCCESS [ 55.915 s]
[INFO] Ldap identity backend .............................. SUCCESS [02:39 min]
[INFO] Mavibot based backend .............................. SUCCESS [ 20.469 s]
[INFO] Zookeeper identity backend ......................... SUCCESS [ 32.103 s]
[INFO] Kerby Distribution ................................. SUCCESS [  6.834 s]
[INFO] KDC Dist ........................................... SUCCESS [  7.534 s]
[INFO] Tool Dist .......................................... SUCCESS [  8.859 s]
[INFO] Kerby benchmark .................................... SUCCESS [ 14.321 s]
[INFO] HAS project ........................................ SUCCESS [  7.016 s]
[INFO] has-common ......................................... FAILURE [ 11.568 s]
[INFO] has-server ......................................... SKIPPED
[INFO] ------------------------------------------------------------------------
[INFO] BUILD FAILURE
[INFO] ------------------------------------------------------------------------
[INFO] Total time: 19:27 min
[INFO] Finished at: 2017-12-24T18:08:43+00:00
[INFO] Final Memory: 48M/455M
[INFO] ------------------------------------------------------------------------
Waiting for Jenkins to finish collecting data
[ERROR] Failed to execute goal org.gaul:modernizer-maven-plugin:1.5.0:modernizer (modernizer-check) on project has-common: Found 3 violations -> [Help 1]
[ERROR] 
[ERROR] To see the full stack trace of the errors, re-run Maven with the -e switch.
[ERROR] Re-run Maven using the -X switch to enable full debug logging.
[ERROR] 
[ERROR] For more information about the errors and possible solutions, please read the following articles:
[ERROR] [Help 1] http://cwiki.apache.org/confluence/display/MAVEN/MojoExecutionException
[ERROR] 
[ERROR] After correcting the problems, you can resume the build with the command
[ERROR]   mvn <goals> -rf :has-common
channel stopped

Jenkins build is back to normal : dir-kerby #472

Posted by Apache Jenkins Server <je...@builds.apache.org>.
See <https://builds.apache.org/job/dir-kerby/472/display/redirect>


Build failed in Jenkins: dir-kerby #471

Posted by Apache Jenkins Server <je...@builds.apache.org>.
See <https://builds.apache.org/job/dir-kerby/471/display/redirect?page=changes>

Changes:

[coheigea] Fix for SGT clientPrincipal that is currently not populated. This fix

[coheigea] DIRKRB-692 - This closes #29.

------------------------------------------
Started by an SCM change
Started by an SCM change
[EnvInject] - Loading node environment variables.
Building remotely on H27 (ubuntu xenial) in workspace <https://builds.apache.org/job/dir-kerby/ws/>
 > git rev-parse --is-inside-work-tree # timeout=10
Fetching changes from the remote Git repository
 > git config remote.origin.url https://git-wip-us.apache.org/repos/asf/directory-kerby.git # timeout=10
Fetching upstream changes from https://git-wip-us.apache.org/repos/asf/directory-kerby.git
 > git --version # timeout=10
 > git fetch --tags --progress https://git-wip-us.apache.org/repos/asf/directory-kerby.git +refs/heads/*:refs/remotes/origin/*
 > git rev-parse refs/remotes/origin/trunk^{commit} # timeout=10
 > git rev-parse refs/remotes/origin/origin/trunk^{commit} # timeout=10
Checking out Revision 26748ae4303d328666970d26914d12a9639f33ba (refs/remotes/origin/trunk)
 > git config core.sparsecheckout # timeout=10
 > git checkout -f 26748ae4303d328666970d26914d12a9639f33ba
Commit message: "DIRKRB-692 - This closes #29."
 > git rev-list f90dc5acae6f1ccabce265a033a457e24d163933 # timeout=10
Parsing POMs
Modules changed, recalculating dependency graph
Established TCP socket on 36076
maven33-agent.jar already up to date
maven33-interceptor.jar already up to date
maven3-interceptor-commons.jar already up to date
[dir-kerby] $ /home/jenkins/tools/java/latest1.7/bin/java -Xmx512m -XX:MaxPermSize=128m -cp /home/jenkins/jenkins-slave/maven33-agent.jar:/home/jenkins/tools/maven/apache-maven-3.3.9/boot/plexus-classworlds-2.5.2.jar:/home/jenkins/tools/maven/apache-maven-3.3.9/conf/logging jenkins.maven3.agent.Maven33Main /home/jenkins/tools/maven/apache-maven-3.3.9 /home/jenkins/jenkins-slave/slave.jar /home/jenkins/jenkins-slave/maven33-interceptor.jar /home/jenkins/jenkins-slave/maven3-interceptor-commons.jar 36076
Exception in thread "main" java.lang.UnsupportedClassVersionError: hudson/remoting/Launcher : Unsupported major.minor version 52.0
	at java.lang.ClassLoader.defineClass1(Native Method)
	at java.lang.ClassLoader.defineClass(ClassLoader.java:800)
	at java.security.SecureClassLoader.defineClass(SecureClassLoader.java:142)
	at java.net.URLClassLoader.defineClass(URLClassLoader.java:449)
	at java.net.URLClassLoader.access$100(URLClassLoader.java:71)
	at java.net.URLClassLoader$1.run(URLClassLoader.java:361)
	at java.net.URLClassLoader$1.run(URLClassLoader.java:355)
	at java.security.AccessController.doPrivileged(Native Method)
	at java.net.URLClassLoader.findClass(URLClassLoader.java:354)
	at org.codehaus.plexus.classworlds.realm.ClassRealm.loadClassFromSelf(ClassRealm.java:401)
	at org.codehaus.plexus.classworlds.strategy.SelfFirstStrategy.loadClass(SelfFirstStrategy.java:42)
	at org.codehaus.plexus.classworlds.realm.ClassRealm.unsynchronizedLoadClass(ClassRealm.java:271)
	at org.codehaus.plexus.classworlds.realm.ClassRealm.loadClass(ClassRealm.java:247)
	at org.codehaus.plexus.classworlds.realm.ClassRealm.loadClass(ClassRealm.java:239)
	at jenkins.maven3.agent.Maven33Main.main(Maven33Main.java:133)
	at jenkins.maven3.agent.Maven33Main.main(Maven33Main.java:64)
ERROR: Failed to parse POMs
java.io.EOFException: unexpected stream termination
	at hudson.remoting.ChannelBuilder.negotiate(ChannelBuilder.java:408)
	at hudson.remoting.ChannelBuilder.build(ChannelBuilder.java:353)
	at hudson.slaves.Channels.forProcess(Channels.java:115)
	at hudson.maven.AbstractMavenProcessFactory.newProcess(AbstractMavenProcessFactory.java:294)
	at hudson.maven.ProcessCache.get(ProcessCache.java:236)
	at hudson.maven.MavenModuleSetBuild$MavenModuleSetBuildExecution.doRun(MavenModuleSetBuild.java:804)
	at hudson.model.AbstractBuild$AbstractBuildExecution.run(AbstractBuild.java:504)
	at hudson.model.Run.execute(Run.java:1724)
	at hudson.maven.MavenModuleSetBuild.run(MavenModuleSetBuild.java:543)
	at hudson.model.ResourceController.execute(ResourceController.java:97)
	at hudson.model.Executor.run(Executor.java:421)

Build failed in Jenkins: dir-kerby #470

Posted by Apache Jenkins Server <je...@builds.apache.org>.
See <https://builds.apache.org/job/dir-kerby/470/display/redirect?page=changes>

Changes:

[coheigea] DIRKRB-693/DIRKRB-695 - Switching to use JLine for the Kadmin tool

------------------------------------------
Started by an SCM change
[EnvInject] - Loading node environment variables.
Building remotely on H27 (ubuntu xenial) in workspace <https://builds.apache.org/job/dir-kerby/ws/>
Cloning the remote Git repository
Cloning repository https://git-wip-us.apache.org/repos/asf/directory-kerby.git
 > git init <https://builds.apache.org/job/dir-kerby/ws/> # timeout=10
Fetching upstream changes from https://git-wip-us.apache.org/repos/asf/directory-kerby.git
 > git --version # timeout=10
 > git fetch --tags --progress https://git-wip-us.apache.org/repos/asf/directory-kerby.git +refs/heads/*:refs/remotes/origin/*
 > git config remote.origin.url https://git-wip-us.apache.org/repos/asf/directory-kerby.git # timeout=10
 > git config --add remote.origin.fetch +refs/heads/*:refs/remotes/origin/* # timeout=10
 > git config remote.origin.url https://git-wip-us.apache.org/repos/asf/directory-kerby.git # timeout=10
Fetching upstream changes from https://git-wip-us.apache.org/repos/asf/directory-kerby.git
 > git fetch --tags --progress https://git-wip-us.apache.org/repos/asf/directory-kerby.git +refs/heads/*:refs/remotes/origin/*
 > git rev-parse refs/remotes/origin/trunk^{commit} # timeout=10
 > git rev-parse refs/remotes/origin/origin/trunk^{commit} # timeout=10
Checking out Revision f90dc5acae6f1ccabce265a033a457e24d163933 (refs/remotes/origin/trunk)
 > git config core.sparsecheckout # timeout=10
 > git checkout -f f90dc5acae6f1ccabce265a033a457e24d163933
Commit message: "DIRKRB-693/DIRKRB-695 - Switching to use JLine for the Kadmin tool"
 > git rev-list a21e49f17eb385afb6fb4cef2050b23bed459653 # timeout=10
Parsing POMs
Modules changed, recalculating dependency graph
Established TCP socket on 36005
maven33-agent.jar already up to date
maven33-interceptor.jar already up to date
maven3-interceptor-commons.jar already up to date
[dir-kerby] $ /home/jenkins/tools/java/latest1.7/bin/java -Xmx512m -XX:MaxPermSize=128m -cp /home/jenkins/jenkins-slave/maven33-agent.jar:/home/jenkins/tools/maven/apache-maven-3.3.9/boot/plexus-classworlds-2.5.2.jar:/home/jenkins/tools/maven/apache-maven-3.3.9/conf/logging jenkins.maven3.agent.Maven33Main /home/jenkins/tools/maven/apache-maven-3.3.9 /home/jenkins/jenkins-slave/slave.jar /home/jenkins/jenkins-slave/maven33-interceptor.jar /home/jenkins/jenkins-slave/maven3-interceptor-commons.jar 36005
Exception in thread "main" java.lang.UnsupportedClassVersionError: hudson/remoting/Launcher : Unsupported major.minor version 52.0
	at java.lang.ClassLoader.defineClass1(Native Method)
	at java.lang.ClassLoader.defineClass(ClassLoader.java:800)
	at java.security.SecureClassLoader.defineClass(SecureClassLoader.java:142)
	at java.net.URLClassLoader.defineClass(URLClassLoader.java:449)
	at java.net.URLClassLoader.access$100(URLClassLoader.java:71)
	at java.net.URLClassLoader$1.run(URLClassLoader.java:361)
	at java.net.URLClassLoader$1.run(URLClassLoader.java:355)
	at java.security.AccessController.doPrivileged(Native Method)
	at java.net.URLClassLoader.findClass(URLClassLoader.java:354)
	at org.codehaus.plexus.classworlds.realm.ClassRealm.loadClassFromSelf(ClassRealm.java:401)
	at org.codehaus.plexus.classworlds.strategy.SelfFirstStrategy.loadClass(SelfFirstStrategy.java:42)
	at org.codehaus.plexus.classworlds.realm.ClassRealm.unsynchronizedLoadClass(ClassRealm.java:271)
	at org.codehaus.plexus.classworlds.realm.ClassRealm.loadClass(ClassRealm.java:247)
	at org.codehaus.plexus.classworlds.realm.ClassRealm.loadClass(ClassRealm.java:239)
	at jenkins.maven3.agent.Maven33Main.main(Maven33Main.java:133)
	at jenkins.maven3.agent.Maven33Main.main(Maven33Main.java:64)
ERROR: Failed to parse POMs
java.io.EOFException: unexpected stream termination
	at hudson.remoting.ChannelBuilder.negotiate(ChannelBuilder.java:408)
	at hudson.remoting.ChannelBuilder.build(ChannelBuilder.java:353)
	at hudson.slaves.Channels.forProcess(Channels.java:115)
	at hudson.maven.AbstractMavenProcessFactory.newProcess(AbstractMavenProcessFactory.java:294)
	at hudson.maven.ProcessCache.get(ProcessCache.java:236)
	at hudson.maven.MavenModuleSetBuild$MavenModuleSetBuildExecution.doRun(MavenModuleSetBuild.java:804)
	at hudson.model.AbstractBuild$AbstractBuildExecution.run(AbstractBuild.java:504)
	at hudson.model.Run.execute(Run.java:1724)
	at hudson.maven.MavenModuleSetBuild.run(MavenModuleSetBuild.java:543)
	at hudson.model.ResourceController.execute(ResourceController.java:97)
	at hudson.model.Executor.run(Executor.java:421)

Build failed in Jenkins: dir-kerby #469

Posted by Apache Jenkins Server <je...@builds.apache.org>.
See <https://builds.apache.org/job/dir-kerby/469/display/redirect>

------------------------------------------
Started by timer
[EnvInject] - Loading node environment variables.
Building remotely on H31 (ubuntu xenial) in workspace <https://builds.apache.org/job/dir-kerby/ws/>
 > git rev-parse --is-inside-work-tree # timeout=10
Fetching changes from the remote Git repository
 > git config remote.origin.url https://git-wip-us.apache.org/repos/asf/directory-kerby.git # timeout=10
Fetching upstream changes from https://git-wip-us.apache.org/repos/asf/directory-kerby.git
 > git --version # timeout=10
 > git fetch --tags --progress https://git-wip-us.apache.org/repos/asf/directory-kerby.git +refs/heads/*:refs/remotes/origin/*
 > git rev-parse refs/remotes/origin/trunk^{commit} # timeout=10
 > git rev-parse refs/remotes/origin/origin/trunk^{commit} # timeout=10
Checking out Revision a21e49f17eb385afb6fb4cef2050b23bed459653 (refs/remotes/origin/trunk)
 > git config core.sparsecheckout # timeout=10
 > git checkout -f a21e49f17eb385afb6fb4cef2050b23bed459653
Commit message: "DIRKRB-685 Add MySQL plugin for new authentication mechanism."
 > git rev-list a21e49f17eb385afb6fb4cef2050b23bed459653 # timeout=10
Parsing POMs
Modules changed, recalculating dependency graph
Established TCP socket on 42842
maven33-agent.jar already up to date
maven33-interceptor.jar already up to date
maven3-interceptor-commons.jar already up to date
[dir-kerby] $ /home/jenkins/tools/java/latest1.7/bin/java -Xmx512m -XX:MaxPermSize=128m -cp /home/jenkins/jenkins-slave/maven33-agent.jar:/home/jenkins/tools/maven/apache-maven-3.3.9/boot/plexus-classworlds-2.5.2.jar:/home/jenkins/tools/maven/apache-maven-3.3.9/conf/logging jenkins.maven3.agent.Maven33Main /home/jenkins/tools/maven/apache-maven-3.3.9 /home/jenkins/jenkins-slave/slave.jar /home/jenkins/jenkins-slave/maven33-interceptor.jar /home/jenkins/jenkins-slave/maven3-interceptor-commons.jar 42842
Exception in thread "main" java.lang.UnsupportedClassVersionError: hudson/remoting/Launcher : Unsupported major.minor version 52.0
	at java.lang.ClassLoader.defineClass1(Native Method)
	at java.lang.ClassLoader.defineClass(ClassLoader.java:800)
	at java.security.SecureClassLoader.defineClass(SecureClassLoader.java:142)
	at java.net.URLClassLoader.defineClass(URLClassLoader.java:449)
	at java.net.URLClassLoader.access$100(URLClassLoader.java:71)
	at java.net.URLClassLoader$1.run(URLClassLoader.java:361)
	at java.net.URLClassLoader$1.run(URLClassLoader.java:355)
	at java.security.AccessController.doPrivileged(Native Method)
	at java.net.URLClassLoader.findClass(URLClassLoader.java:354)
	at org.codehaus.plexus.classworlds.realm.ClassRealm.loadClassFromSelf(ClassRealm.java:401)
	at org.codehaus.plexus.classworlds.strategy.SelfFirstStrategy.loadClass(SelfFirstStrategy.java:42)
	at org.codehaus.plexus.classworlds.realm.ClassRealm.unsynchronizedLoadClass(ClassRealm.java:271)
	at org.codehaus.plexus.classworlds.realm.ClassRealm.loadClass(ClassRealm.java:247)
	at org.codehaus.plexus.classworlds.realm.ClassRealm.loadClass(ClassRealm.java:239)
	at jenkins.maven3.agent.Maven33Main.main(Maven33Main.java:133)
	at jenkins.maven3.agent.Maven33Main.main(Maven33Main.java:64)
ERROR: Failed to parse POMs
java.io.EOFException: unexpected stream termination
	at hudson.remoting.ChannelBuilder.negotiate(ChannelBuilder.java:408)
	at hudson.remoting.ChannelBuilder.build(ChannelBuilder.java:353)
	at hudson.slaves.Channels.forProcess(Channels.java:115)
	at hudson.maven.AbstractMavenProcessFactory.newProcess(AbstractMavenProcessFactory.java:294)
	at hudson.maven.ProcessCache.get(ProcessCache.java:236)
	at hudson.maven.MavenModuleSetBuild$MavenModuleSetBuildExecution.doRun(MavenModuleSetBuild.java:804)
	at hudson.model.AbstractBuild$AbstractBuildExecution.run(AbstractBuild.java:504)
	at hudson.model.Run.execute(Run.java:1724)
	at hudson.maven.MavenModuleSetBuild.run(MavenModuleSetBuild.java:543)
	at hudson.model.ResourceController.execute(ResourceController.java:97)
	at hudson.model.Executor.run(Executor.java:421)

Build failed in Jenkins: dir-kerby #468

Posted by Apache Jenkins Server <je...@builds.apache.org>.
See <https://builds.apache.org/job/dir-kerby/468/display/redirect?page=changes>

Changes:

[zenglinx] DIRKRB-685 Add MySQL plugin for new authentication mechanism.

------------------------------------------
Started by an SCM change
[EnvInject] - Loading node environment variables.
Building remotely on H26 (ubuntu xenial) in workspace <https://builds.apache.org/job/dir-kerby/ws/>
 > git rev-parse --is-inside-work-tree # timeout=10
Fetching changes from the remote Git repository
 > git config remote.origin.url https://git-wip-us.apache.org/repos/asf/directory-kerby.git # timeout=10
Fetching upstream changes from https://git-wip-us.apache.org/repos/asf/directory-kerby.git
 > git --version # timeout=10
 > git fetch --tags --progress https://git-wip-us.apache.org/repos/asf/directory-kerby.git +refs/heads/*:refs/remotes/origin/*
 > git rev-parse refs/remotes/origin/trunk^{commit} # timeout=10
 > git rev-parse refs/remotes/origin/origin/trunk^{commit} # timeout=10
Checking out Revision a21e49f17eb385afb6fb4cef2050b23bed459653 (refs/remotes/origin/trunk)
 > git config core.sparsecheckout # timeout=10
 > git checkout -f a21e49f17eb385afb6fb4cef2050b23bed459653
Commit message: "DIRKRB-685 Add MySQL plugin for new authentication mechanism."
 > git rev-list f7ef29efa818ca7ab3e6a3522d623bffbbeddeb2 # timeout=10
Parsing POMs
Discovered a new module org.apache.kerby:has-plugins has-plugins
Modules changed, recalculating dependency graph
Established TCP socket on 34716
maven33-agent.jar already up to date
maven33-interceptor.jar already up to date
maven3-interceptor-commons.jar already up to date
[dir-kerby] $ /home/jenkins/tools/java/latest1.7/bin/java -Xmx512m -XX:MaxPermSize=128m -cp /home/jenkins/jenkins-slave/maven33-agent.jar:/home/jenkins/tools/maven/apache-maven-3.3.9/boot/plexus-classworlds-2.5.2.jar:/home/jenkins/tools/maven/apache-maven-3.3.9/conf/logging jenkins.maven3.agent.Maven33Main /home/jenkins/tools/maven/apache-maven-3.3.9 /home/jenkins/jenkins-slave/slave.jar /home/jenkins/jenkins-slave/maven33-interceptor.jar /home/jenkins/jenkins-slave/maven3-interceptor-commons.jar 34716
Exception in thread "main" java.lang.UnsupportedClassVersionError: hudson/remoting/Launcher : Unsupported major.minor version 52.0
	at java.lang.ClassLoader.defineClass1(Native Method)
	at java.lang.ClassLoader.defineClass(ClassLoader.java:800)
	at java.security.SecureClassLoader.defineClass(SecureClassLoader.java:142)
	at java.net.URLClassLoader.defineClass(URLClassLoader.java:449)
	at java.net.URLClassLoader.access$100(URLClassLoader.java:71)
	at java.net.URLClassLoader$1.run(URLClassLoader.java:361)
	at java.net.URLClassLoader$1.run(URLClassLoader.java:355)
	at java.security.AccessController.doPrivileged(Native Method)
	at java.net.URLClassLoader.findClass(URLClassLoader.java:354)
	at org.codehaus.plexus.classworlds.realm.ClassRealm.loadClassFromSelf(ClassRealm.java:401)
	at org.codehaus.plexus.classworlds.strategy.SelfFirstStrategy.loadClass(SelfFirstStrategy.java:42)
	at org.codehaus.plexus.classworlds.realm.ClassRealm.unsynchronizedLoadClass(ClassRealm.java:271)
	at org.codehaus.plexus.classworlds.realm.ClassRealm.loadClass(ClassRealm.java:247)
	at org.codehaus.plexus.classworlds.realm.ClassRealm.loadClass(ClassRealm.java:239)
	at jenkins.maven3.agent.Maven33Main.main(Maven33Main.java:133)
	at jenkins.maven3.agent.Maven33Main.main(Maven33Main.java:64)
ERROR: Failed to parse POMs
java.io.EOFException: unexpected stream termination
	at hudson.remoting.ChannelBuilder.negotiate(ChannelBuilder.java:408)
	at hudson.remoting.ChannelBuilder.build(ChannelBuilder.java:353)
	at hudson.slaves.Channels.forProcess(Channels.java:115)
	at hudson.maven.AbstractMavenProcessFactory.newProcess(AbstractMavenProcessFactory.java:294)
	at hudson.maven.ProcessCache.get(ProcessCache.java:236)
	at hudson.maven.MavenModuleSetBuild$MavenModuleSetBuildExecution.doRun(MavenModuleSetBuild.java:804)
	at hudson.model.AbstractBuild$AbstractBuildExecution.run(AbstractBuild.java:504)
	at hudson.model.Run.execute(Run.java:1724)
	at hudson.maven.MavenModuleSetBuild.run(MavenModuleSetBuild.java:543)
	at hudson.model.ResourceController.execute(ResourceController.java:97)
	at hudson.model.Executor.run(Executor.java:421)

Build failed in Jenkins: dir-kerby #467

Posted by Apache Jenkins Server <je...@builds.apache.org>.
See <https://builds.apache.org/job/dir-kerby/467/display/redirect?page=changes>

Changes:

[coheigea] Updating versions to 2.0.0-SNAPSHOT

------------------------------------------
Started by an SCM change
[EnvInject] - Loading node environment variables.
Building remotely on H26 (ubuntu xenial) in workspace <https://builds.apache.org/job/dir-kerby/ws/>
 > git rev-parse --is-inside-work-tree # timeout=10
Fetching changes from the remote Git repository
 > git config remote.origin.url https://git-wip-us.apache.org/repos/asf/directory-kerby.git # timeout=10
Fetching upstream changes from https://git-wip-us.apache.org/repos/asf/directory-kerby.git
 > git --version # timeout=10
 > git fetch --tags --progress https://git-wip-us.apache.org/repos/asf/directory-kerby.git +refs/heads/*:refs/remotes/origin/*
 > git rev-parse refs/remotes/origin/trunk^{commit} # timeout=10
 > git rev-parse refs/remotes/origin/origin/trunk^{commit} # timeout=10
Checking out Revision f7ef29efa818ca7ab3e6a3522d623bffbbeddeb2 (refs/remotes/origin/trunk)
 > git config core.sparsecheckout # timeout=10
 > git checkout -f f7ef29efa818ca7ab3e6a3522d623bffbbeddeb2
Commit message: "Updating versions to 2.0.0-SNAPSHOT"
 > git rev-list 4b7cf72030e2b203e8bd8308bd1c46888fa4252a # timeout=10
Parsing POMs
Modules changed, recalculating dependency graph
Established TCP socket on 46006
maven33-agent.jar already up to date
maven33-interceptor.jar already up to date
maven3-interceptor-commons.jar already up to date
[dir-kerby] $ /home/jenkins/tools/java/latest1.7/bin/java -Xmx512m -XX:MaxPermSize=128m -cp /home/jenkins/jenkins-slave/maven33-agent.jar:/home/jenkins/tools/maven/apache-maven-3.3.9/boot/plexus-classworlds-2.5.2.jar:/home/jenkins/tools/maven/apache-maven-3.3.9/conf/logging jenkins.maven3.agent.Maven33Main /home/jenkins/tools/maven/apache-maven-3.3.9 /home/jenkins/jenkins-slave/slave.jar /home/jenkins/jenkins-slave/maven33-interceptor.jar /home/jenkins/jenkins-slave/maven3-interceptor-commons.jar 46006
Exception in thread "main" java.lang.UnsupportedClassVersionError: hudson/remoting/Launcher : Unsupported major.minor version 52.0
	at java.lang.ClassLoader.defineClass1(Native Method)
	at java.lang.ClassLoader.defineClass(ClassLoader.java:800)
	at java.security.SecureClassLoader.defineClass(SecureClassLoader.java:142)
	at java.net.URLClassLoader.defineClass(URLClassLoader.java:449)
	at java.net.URLClassLoader.access$100(URLClassLoader.java:71)
	at java.net.URLClassLoader$1.run(URLClassLoader.java:361)
	at java.net.URLClassLoader$1.run(URLClassLoader.java:355)
	at java.security.AccessController.doPrivileged(Native Method)
	at java.net.URLClassLoader.findClass(URLClassLoader.java:354)
	at org.codehaus.plexus.classworlds.realm.ClassRealm.loadClassFromSelf(ClassRealm.java:401)
	at org.codehaus.plexus.classworlds.strategy.SelfFirstStrategy.loadClass(SelfFirstStrategy.java:42)
	at org.codehaus.plexus.classworlds.realm.ClassRealm.unsynchronizedLoadClass(ClassRealm.java:271)
	at org.codehaus.plexus.classworlds.realm.ClassRealm.loadClass(ClassRealm.java:247)
	at org.codehaus.plexus.classworlds.realm.ClassRealm.loadClass(ClassRealm.java:239)
	at jenkins.maven3.agent.Maven33Main.main(Maven33Main.java:133)
	at jenkins.maven3.agent.Maven33Main.main(Maven33Main.java:64)
ERROR: Failed to parse POMs
java.io.EOFException: unexpected stream termination
	at hudson.remoting.ChannelBuilder.negotiate(ChannelBuilder.java:408)
	at hudson.remoting.ChannelBuilder.build(ChannelBuilder.java:353)
	at hudson.slaves.Channels.forProcess(Channels.java:115)
	at hudson.maven.AbstractMavenProcessFactory.newProcess(AbstractMavenProcessFactory.java:294)
	at hudson.maven.ProcessCache.get(ProcessCache.java:236)
	at hudson.maven.MavenModuleSetBuild$MavenModuleSetBuildExecution.doRun(MavenModuleSetBuild.java:804)
	at hudson.model.AbstractBuild$AbstractBuildExecution.run(AbstractBuild.java:504)
	at hudson.model.Run.execute(Run.java:1724)
	at hudson.maven.MavenModuleSetBuild.run(MavenModuleSetBuild.java:543)
	at hudson.model.ResourceController.execute(ResourceController.java:97)
	at hudson.model.Executor.run(Executor.java:421)

Build failed in Jenkins: dir-kerby #466

Posted by Apache Jenkins Server <je...@builds.apache.org>.
See <https://builds.apache.org/job/dir-kerby/466/display/redirect>

------------------------------------------
Started by an SCM change
[EnvInject] - Loading node environment variables.
Building remotely on H34 (ubuntu xenial) in workspace <https://builds.apache.org/job/dir-kerby/ws/>
 > git rev-parse --is-inside-work-tree # timeout=10
Fetching changes from the remote Git repository
 > git config remote.origin.url https://git-wip-us.apache.org/repos/asf/directory-kerby.git # timeout=10
Fetching upstream changes from https://git-wip-us.apache.org/repos/asf/directory-kerby.git
 > git --version # timeout=10
 > git fetch --tags --progress https://git-wip-us.apache.org/repos/asf/directory-kerby.git +refs/heads/*:refs/remotes/origin/*
 > git rev-parse refs/remotes/origin/trunk^{commit} # timeout=10
 > git rev-parse refs/remotes/origin/origin/trunk^{commit} # timeout=10
Checking out Revision 4b7cf72030e2b203e8bd8308bd1c46888fa4252a (refs/remotes/origin/trunk)
 > git config core.sparsecheckout # timeout=10
 > git checkout -f 4b7cf72030e2b203e8bd8308bd1c46888fa4252a
Commit message: "This closes #28."
 > git rev-list 973f7ade36779d08b910d63b7ddde07c6e849dae # timeout=10
Parsing POMs
Modules changed, recalculating dependency graph
Established TCP socket on 44609
maven33-agent.jar already up to date
maven33-interceptor.jar already up to date
maven3-interceptor-commons.jar already up to date
[dir-kerby] $ /home/jenkins/tools/java/latest1.7/bin/java -Xmx512m -XX:MaxPermSize=128m -cp /home/jenkins/jenkins-slave/maven33-agent.jar:/home/jenkins/tools/maven/apache-maven-3.3.9/boot/plexus-classworlds-2.5.2.jar:/home/jenkins/tools/maven/apache-maven-3.3.9/conf/logging jenkins.maven3.agent.Maven33Main /home/jenkins/tools/maven/apache-maven-3.3.9 /home/jenkins/jenkins-slave/slave.jar /home/jenkins/jenkins-slave/maven33-interceptor.jar /home/jenkins/jenkins-slave/maven3-interceptor-commons.jar 44609
Exception in thread "main" java.lang.UnsupportedClassVersionError: hudson/remoting/Launcher : Unsupported major.minor version 52.0
	at java.lang.ClassLoader.defineClass1(Native Method)
	at java.lang.ClassLoader.defineClass(ClassLoader.java:800)
	at java.security.SecureClassLoader.defineClass(SecureClassLoader.java:142)
	at java.net.URLClassLoader.defineClass(URLClassLoader.java:449)
	at java.net.URLClassLoader.access$100(URLClassLoader.java:71)
	at java.net.URLClassLoader$1.run(URLClassLoader.java:361)
	at java.net.URLClassLoader$1.run(URLClassLoader.java:355)
	at java.security.AccessController.doPrivileged(Native Method)
	at java.net.URLClassLoader.findClass(URLClassLoader.java:354)
	at org.codehaus.plexus.classworlds.realm.ClassRealm.loadClassFromSelf(ClassRealm.java:401)
	at org.codehaus.plexus.classworlds.strategy.SelfFirstStrategy.loadClass(SelfFirstStrategy.java:42)
	at org.codehaus.plexus.classworlds.realm.ClassRealm.unsynchronizedLoadClass(ClassRealm.java:271)
	at org.codehaus.plexus.classworlds.realm.ClassRealm.loadClass(ClassRealm.java:247)
	at org.codehaus.plexus.classworlds.realm.ClassRealm.loadClass(ClassRealm.java:239)
	at jenkins.maven3.agent.Maven33Main.main(Maven33Main.java:133)
	at jenkins.maven3.agent.Maven33Main.main(Maven33Main.java:64)
ERROR: Failed to parse POMs
java.io.EOFException: unexpected stream termination
	at hudson.remoting.ChannelBuilder.negotiate(ChannelBuilder.java:408)
	at hudson.remoting.ChannelBuilder.build(ChannelBuilder.java:353)
	at hudson.slaves.Channels.forProcess(Channels.java:115)
	at hudson.maven.AbstractMavenProcessFactory.newProcess(AbstractMavenProcessFactory.java:294)
	at hudson.maven.ProcessCache.get(ProcessCache.java:236)
	at hudson.maven.MavenModuleSetBuild$MavenModuleSetBuildExecution.doRun(MavenModuleSetBuild.java:804)
	at hudson.model.AbstractBuild$AbstractBuildExecution.run(AbstractBuild.java:504)
	at hudson.model.Run.execute(Run.java:1724)
	at hudson.maven.MavenModuleSetBuild.run(MavenModuleSetBuild.java:543)
	at hudson.model.ResourceController.execute(ResourceController.java:97)
	at hudson.model.Executor.run(Executor.java:421)

Build failed in Jenkins: dir-kerby #465

Posted by Apache Jenkins Server <je...@builds.apache.org>.
See <https://builds.apache.org/job/dir-kerby/465/display/redirect?page=changes>

Changes:

[coheigea] DIRKRB-692 - Adding test

------------------------------------------
Started by an SCM change
[EnvInject] - Loading node environment variables.
Building remotely on ubuntu-1 (ubuntu trusty) in workspace <https://builds.apache.org/job/dir-kerby/ws/>
Cloning the remote Git repository
Cloning repository https://git-wip-us.apache.org/repos/asf/directory-kerby.git
 > git init <https://builds.apache.org/job/dir-kerby/ws/> # timeout=10
Fetching upstream changes from https://git-wip-us.apache.org/repos/asf/directory-kerby.git
 > git --version # timeout=10
 > git fetch --tags --progress https://git-wip-us.apache.org/repos/asf/directory-kerby.git +refs/heads/*:refs/remotes/origin/*
 > git config remote.origin.url https://git-wip-us.apache.org/repos/asf/directory-kerby.git # timeout=10
 > git config --add remote.origin.fetch +refs/heads/*:refs/remotes/origin/* # timeout=10
 > git config remote.origin.url https://git-wip-us.apache.org/repos/asf/directory-kerby.git # timeout=10
Fetching upstream changes from https://git-wip-us.apache.org/repos/asf/directory-kerby.git
 > git fetch --tags --progress https://git-wip-us.apache.org/repos/asf/directory-kerby.git +refs/heads/*:refs/remotes/origin/*
 > git rev-parse refs/remotes/origin/trunk^{commit} # timeout=10
 > git rev-parse refs/remotes/origin/origin/trunk^{commit} # timeout=10
Checking out Revision 973f7ade36779d08b910d63b7ddde07c6e849dae (refs/remotes/origin/trunk)
 > git config core.sparsecheckout # timeout=10
 > git checkout -f 973f7ade36779d08b910d63b7ddde07c6e849dae
Commit message: "DIRKRB-692 - Adding test"
 > git rev-list d94dad48ba28b8c265a4b2583df61ee2bd95b863 # timeout=10
Parsing POMs
Modules changed, recalculating dependency graph
Established TCP socket on 39532
maven33-agent.jar already up to date
maven33-interceptor.jar already up to date
maven3-interceptor-commons.jar already up to date
[dir-kerby] $ /home/jenkins/tools/java/latest1.7/bin/java -Xmx512m -XX:MaxPermSize=128m -cp /home/jenkins/jenkins-slave/maven33-agent.jar:/home/jenkins/tools/maven/apache-maven-3.3.9/boot/plexus-classworlds-2.5.2.jar:/home/jenkins/tools/maven/apache-maven-3.3.9/conf/logging jenkins.maven3.agent.Maven33Main /home/jenkins/tools/maven/apache-maven-3.3.9 /home/jenkins/jenkins-slave/slave.jar /home/jenkins/jenkins-slave/maven33-interceptor.jar /home/jenkins/jenkins-slave/maven3-interceptor-commons.jar 39532
Exception in thread "main" java.lang.UnsupportedClassVersionError: hudson/remoting/Launcher : Unsupported major.minor version 52.0
	at java.lang.ClassLoader.defineClass1(Native Method)
	at java.lang.ClassLoader.defineClass(ClassLoader.java:800)
	at java.security.SecureClassLoader.defineClass(SecureClassLoader.java:142)
	at java.net.URLClassLoader.defineClass(URLClassLoader.java:449)
	at java.net.URLClassLoader.access$100(URLClassLoader.java:71)
	at java.net.URLClassLoader$1.run(URLClassLoader.java:361)
	at java.net.URLClassLoader$1.run(URLClassLoader.java:355)
	at java.security.AccessController.doPrivileged(Native Method)
	at java.net.URLClassLoader.findClass(URLClassLoader.java:354)
	at org.codehaus.plexus.classworlds.realm.ClassRealm.loadClassFromSelf(ClassRealm.java:401)
	at org.codehaus.plexus.classworlds.strategy.SelfFirstStrategy.loadClass(SelfFirstStrategy.java:42)
	at org.codehaus.plexus.classworlds.realm.ClassRealm.unsynchronizedLoadClass(ClassRealm.java:271)
	at org.codehaus.plexus.classworlds.realm.ClassRealm.loadClass(ClassRealm.java:247)
	at org.codehaus.plexus.classworlds.realm.ClassRealm.loadClass(ClassRealm.java:239)
	at jenkins.maven3.agent.Maven33Main.main(Maven33Main.java:133)
	at jenkins.maven3.agent.Maven33Main.main(Maven33Main.java:64)
ERROR: Failed to parse POMs
java.io.EOFException: unexpected stream termination
	at hudson.remoting.ChannelBuilder.negotiate(ChannelBuilder.java:408)
	at hudson.remoting.ChannelBuilder.build(ChannelBuilder.java:353)
	at hudson.slaves.Channels.forProcess(Channels.java:115)
	at hudson.maven.AbstractMavenProcessFactory.newProcess(AbstractMavenProcessFactory.java:294)
	at hudson.maven.ProcessCache.get(ProcessCache.java:236)
	at hudson.maven.MavenModuleSetBuild$MavenModuleSetBuildExecution.doRun(MavenModuleSetBuild.java:804)
	at hudson.model.AbstractBuild$AbstractBuildExecution.run(AbstractBuild.java:504)
	at hudson.model.Run.execute(Run.java:1724)
	at hudson.maven.MavenModuleSetBuild.run(MavenModuleSetBuild.java:543)
	at hudson.model.ResourceController.execute(ResourceController.java:97)
	at hudson.model.Executor.run(Executor.java:421)

Build failed in Jenkins: dir-kerby #464

Posted by Apache Jenkins Server <je...@builds.apache.org>.
See <https://builds.apache.org/job/dir-kerby/464/display/redirect?page=changes>

Changes:

[plusplusjiajia] DIRKRB-690 Add shell script to start and stop Web Server.

------------------------------------------
Started by an SCM change
[EnvInject] - Loading node environment variables.
Building remotely on H34 (ubuntu xenial) in workspace <https://builds.apache.org/job/dir-kerby/ws/>
 > git rev-parse --is-inside-work-tree # timeout=10
Fetching changes from the remote Git repository
 > git config remote.origin.url https://git-wip-us.apache.org/repos/asf/directory-kerby.git # timeout=10
Fetching upstream changes from https://git-wip-us.apache.org/repos/asf/directory-kerby.git
 > git --version # timeout=10
 > git fetch --tags --progress https://git-wip-us.apache.org/repos/asf/directory-kerby.git +refs/heads/*:refs/remotes/origin/*
 > git rev-parse refs/remotes/origin/trunk^{commit} # timeout=10
 > git rev-parse refs/remotes/origin/origin/trunk^{commit} # timeout=10
Checking out Revision d94dad48ba28b8c265a4b2583df61ee2bd95b863 (refs/remotes/origin/trunk)
 > git config core.sparsecheckout # timeout=10
 > git checkout -f d94dad48ba28b8c265a4b2583df61ee2bd95b863
Commit message: "DIRKRB-690 Add shell script to start and stop Web Server."
 > git rev-list 682362079fbca00e2b8569e3ef28803c00e272c4 # timeout=10
Parsing POMs
Discovered a new module org.apache.kerby:has-dist HAS dist
Modules changed, recalculating dependency graph
Established TCP socket on 41591
maven33-agent.jar already up to date
maven33-interceptor.jar already up to date
maven3-interceptor-commons.jar already up to date
[dir-kerby] $ /home/jenkins/tools/java/latest1.7/bin/java -Xmx512m -XX:MaxPermSize=128m -cp /home/jenkins/jenkins-slave/maven33-agent.jar:/home/jenkins/tools/maven/apache-maven-3.3.9/boot/plexus-classworlds-2.5.2.jar:/home/jenkins/tools/maven/apache-maven-3.3.9/conf/logging jenkins.maven3.agent.Maven33Main /home/jenkins/tools/maven/apache-maven-3.3.9 /home/jenkins/jenkins-slave/slave.jar /home/jenkins/jenkins-slave/maven33-interceptor.jar /home/jenkins/jenkins-slave/maven3-interceptor-commons.jar 41591
Exception in thread "main" java.lang.UnsupportedClassVersionError: hudson/remoting/Launcher : Unsupported major.minor version 52.0
	at java.lang.ClassLoader.defineClass1(Native Method)
	at java.lang.ClassLoader.defineClass(ClassLoader.java:800)
	at java.security.SecureClassLoader.defineClass(SecureClassLoader.java:142)
	at java.net.URLClassLoader.defineClass(URLClassLoader.java:449)
	at java.net.URLClassLoader.access$100(URLClassLoader.java:71)
	at java.net.URLClassLoader$1.run(URLClassLoader.java:361)
	at java.net.URLClassLoader$1.run(URLClassLoader.java:355)
	at java.security.AccessController.doPrivileged(Native Method)
	at java.net.URLClassLoader.findClass(URLClassLoader.java:354)
	at org.codehaus.plexus.classworlds.realm.ClassRealm.loadClassFromSelf(ClassRealm.java:401)
	at org.codehaus.plexus.classworlds.strategy.SelfFirstStrategy.loadClass(SelfFirstStrategy.java:42)
	at org.codehaus.plexus.classworlds.realm.ClassRealm.unsynchronizedLoadClass(ClassRealm.java:271)
	at org.codehaus.plexus.classworlds.realm.ClassRealm.loadClass(ClassRealm.java:247)
	at org.codehaus.plexus.classworlds.realm.ClassRealm.loadClass(ClassRealm.java:239)
	at jenkins.maven3.agent.Maven33Main.main(Maven33Main.java:133)
	at jenkins.maven3.agent.Maven33Main.main(Maven33Main.java:64)
ERROR: Failed to parse POMs
java.io.EOFException: unexpected stream termination
	at hudson.remoting.ChannelBuilder.negotiate(ChannelBuilder.java:408)
	at hudson.remoting.ChannelBuilder.build(ChannelBuilder.java:353)
	at hudson.slaves.Channels.forProcess(Channels.java:115)
	at hudson.maven.AbstractMavenProcessFactory.newProcess(AbstractMavenProcessFactory.java:294)
	at hudson.maven.ProcessCache.get(ProcessCache.java:236)
	at hudson.maven.MavenModuleSetBuild$MavenModuleSetBuildExecution.doRun(MavenModuleSetBuild.java:804)
	at hudson.model.AbstractBuild$AbstractBuildExecution.run(AbstractBuild.java:504)
	at hudson.model.Run.execute(Run.java:1724)
	at hudson.maven.MavenModuleSetBuild.run(MavenModuleSetBuild.java:543)
	at hudson.model.ResourceController.execute(ResourceController.java:97)
	at hudson.model.Executor.run(Executor.java:421)

Build failed in Jenkins: dir-kerby #463

Posted by Apache Jenkins Server <je...@builds.apache.org>.
See <https://builds.apache.org/job/dir-kerby/463/display/redirect>

------------------------------------------
Started by timer
[EnvInject] - Loading node environment variables.
Building remotely on H31 (ubuntu xenial) in workspace <https://builds.apache.org/job/dir-kerby/ws/>
Cloning the remote Git repository
Cloning repository https://git-wip-us.apache.org/repos/asf/directory-kerby.git
 > git init <https://builds.apache.org/job/dir-kerby/ws/> # timeout=10
Fetching upstream changes from https://git-wip-us.apache.org/repos/asf/directory-kerby.git
 > git --version # timeout=10
 > git fetch --tags --progress https://git-wip-us.apache.org/repos/asf/directory-kerby.git +refs/heads/*:refs/remotes/origin/*
 > git config remote.origin.url https://git-wip-us.apache.org/repos/asf/directory-kerby.git # timeout=10
 > git config --add remote.origin.fetch +refs/heads/*:refs/remotes/origin/* # timeout=10
 > git config remote.origin.url https://git-wip-us.apache.org/repos/asf/directory-kerby.git # timeout=10
Fetching upstream changes from https://git-wip-us.apache.org/repos/asf/directory-kerby.git
 > git fetch --tags --progress https://git-wip-us.apache.org/repos/asf/directory-kerby.git +refs/heads/*:refs/remotes/origin/*
 > git rev-parse refs/remotes/origin/trunk^{commit} # timeout=10
 > git rev-parse refs/remotes/origin/origin/trunk^{commit} # timeout=10
Checking out Revision 682362079fbca00e2b8569e3ef28803c00e272c4 (refs/remotes/origin/trunk)
 > git config core.sparsecheckout # timeout=10
 > git checkout -f 682362079fbca00e2b8569e3ef28803c00e272c4
Commit message: "Fix compilation failure."
 > git rev-list 682362079fbca00e2b8569e3ef28803c00e272c4 # timeout=10
Parsing POMs
Modules changed, recalculating dependency graph
Established TCP socket on 34104
maven33-agent.jar already up to date
maven33-interceptor.jar already up to date
maven3-interceptor-commons.jar already up to date
[dir-kerby] $ /home/jenkins/tools/java/latest1.7/bin/java -Xmx512m -XX:MaxPermSize=128m -cp /home/jenkins/jenkins-slave/maven33-agent.jar:/home/jenkins/tools/maven/apache-maven-3.3.9/boot/plexus-classworlds-2.5.2.jar:/home/jenkins/tools/maven/apache-maven-3.3.9/conf/logging jenkins.maven3.agent.Maven33Main /home/jenkins/tools/maven/apache-maven-3.3.9 /home/jenkins/jenkins-slave/slave.jar /home/jenkins/jenkins-slave/maven33-interceptor.jar /home/jenkins/jenkins-slave/maven3-interceptor-commons.jar 34104
Exception in thread "main" java.lang.UnsupportedClassVersionError: hudson/remoting/Launcher : Unsupported major.minor version 52.0
	at java.lang.ClassLoader.defineClass1(Native Method)
	at java.lang.ClassLoader.defineClass(ClassLoader.java:800)
	at java.security.SecureClassLoader.defineClass(SecureClassLoader.java:142)
	at java.net.URLClassLoader.defineClass(URLClassLoader.java:449)
	at java.net.URLClassLoader.access$100(URLClassLoader.java:71)
	at java.net.URLClassLoader$1.run(URLClassLoader.java:361)
	at java.net.URLClassLoader$1.run(URLClassLoader.java:355)
	at java.security.AccessController.doPrivileged(Native Method)
	at java.net.URLClassLoader.findClass(URLClassLoader.java:354)
	at org.codehaus.plexus.classworlds.realm.ClassRealm.loadClassFromSelf(ClassRealm.java:401)
	at org.codehaus.plexus.classworlds.strategy.SelfFirstStrategy.loadClass(SelfFirstStrategy.java:42)
	at org.codehaus.plexus.classworlds.realm.ClassRealm.unsynchronizedLoadClass(ClassRealm.java:271)
	at org.codehaus.plexus.classworlds.realm.ClassRealm.loadClass(ClassRealm.java:247)
	at org.codehaus.plexus.classworlds.realm.ClassRealm.loadClass(ClassRealm.java:239)
	at jenkins.maven3.agent.Maven33Main.main(Maven33Main.java:133)
	at jenkins.maven3.agent.Maven33Main.main(Maven33Main.java:64)
ERROR: Failed to parse POMs
java.io.EOFException: unexpected stream termination
	at hudson.remoting.ChannelBuilder.negotiate(ChannelBuilder.java:408)
	at hudson.remoting.ChannelBuilder.build(ChannelBuilder.java:353)
	at hudson.slaves.Channels.forProcess(Channels.java:115)
	at hudson.maven.AbstractMavenProcessFactory.newProcess(AbstractMavenProcessFactory.java:294)
	at hudson.maven.ProcessCache.get(ProcessCache.java:236)
	at hudson.maven.MavenModuleSetBuild$MavenModuleSetBuildExecution.doRun(MavenModuleSetBuild.java:804)
	at hudson.model.AbstractBuild$AbstractBuildExecution.run(AbstractBuild.java:504)
	at hudson.model.Run.execute(Run.java:1724)
	at hudson.maven.MavenModuleSetBuild.run(MavenModuleSetBuild.java:543)
	at hudson.model.ResourceController.execute(ResourceController.java:97)
	at hudson.model.Executor.run(Executor.java:421)

Build failed in Jenkins: dir-kerby #462

Posted by Apache Jenkins Server <je...@builds.apache.org>.
See <https://builds.apache.org/job/dir-kerby/462/display/redirect?page=changes>

Changes:

[plusplusjiajia] Fix compilation failure.

------------------------------------------
Started by an SCM change
[EnvInject] - Loading node environment variables.
Building remotely on ubuntu-2 (ubuntu trusty) in workspace <https://builds.apache.org/job/dir-kerby/ws/>
Cloning the remote Git repository
Cloning repository https://git-wip-us.apache.org/repos/asf/directory-kerby.git
 > git init <https://builds.apache.org/job/dir-kerby/ws/> # timeout=10
Fetching upstream changes from https://git-wip-us.apache.org/repos/asf/directory-kerby.git
 > git --version # timeout=10
 > git fetch --tags --progress https://git-wip-us.apache.org/repos/asf/directory-kerby.git +refs/heads/*:refs/remotes/origin/*
 > git config remote.origin.url https://git-wip-us.apache.org/repos/asf/directory-kerby.git # timeout=10
 > git config --add remote.origin.fetch +refs/heads/*:refs/remotes/origin/* # timeout=10
 > git config remote.origin.url https://git-wip-us.apache.org/repos/asf/directory-kerby.git # timeout=10
Fetching upstream changes from https://git-wip-us.apache.org/repos/asf/directory-kerby.git
 > git fetch --tags --progress https://git-wip-us.apache.org/repos/asf/directory-kerby.git +refs/heads/*:refs/remotes/origin/*
 > git rev-parse refs/remotes/origin/trunk^{commit} # timeout=10
 > git rev-parse refs/remotes/origin/origin/trunk^{commit} # timeout=10
Checking out Revision 682362079fbca00e2b8569e3ef28803c00e272c4 (refs/remotes/origin/trunk)
 > git config core.sparsecheckout # timeout=10
 > git checkout -f 682362079fbca00e2b8569e3ef28803c00e272c4
Commit message: "Fix compilation failure."
 > git rev-list 2e9a86443024794be8df7e871cee956051ab9fdb # timeout=10
Parsing POMs
Modules changed, recalculating dependency graph
Established TCP socket on 40969
maven33-agent.jar already up to date
maven33-interceptor.jar already up to date
maven3-interceptor-commons.jar already up to date
[dir-kerby] $ /home/jenkins/tools/java/latest1.7/bin/java -Xmx512m -XX:MaxPermSize=128m -cp /home/jenkins/jenkins-slave/maven33-agent.jar:/home/jenkins/tools/maven/apache-maven-3.3.9/boot/plexus-classworlds-2.5.2.jar:/home/jenkins/tools/maven/apache-maven-3.3.9/conf/logging jenkins.maven3.agent.Maven33Main /home/jenkins/tools/maven/apache-maven-3.3.9 /home/jenkins/jenkins-slave/slave.jar /home/jenkins/jenkins-slave/maven33-interceptor.jar /home/jenkins/jenkins-slave/maven3-interceptor-commons.jar 40969
Exception in thread "main" java.lang.UnsupportedClassVersionError: hudson/remoting/Launcher : Unsupported major.minor version 52.0
	at java.lang.ClassLoader.defineClass1(Native Method)
	at java.lang.ClassLoader.defineClass(ClassLoader.java:800)
	at java.security.SecureClassLoader.defineClass(SecureClassLoader.java:142)
	at java.net.URLClassLoader.defineClass(URLClassLoader.java:449)
	at java.net.URLClassLoader.access$100(URLClassLoader.java:71)
	at java.net.URLClassLoader$1.run(URLClassLoader.java:361)
	at java.net.URLClassLoader$1.run(URLClassLoader.java:355)
	at java.security.AccessController.doPrivileged(Native Method)
	at java.net.URLClassLoader.findClass(URLClassLoader.java:354)
	at org.codehaus.plexus.classworlds.realm.ClassRealm.loadClassFromSelf(ClassRealm.java:401)
	at org.codehaus.plexus.classworlds.strategy.SelfFirstStrategy.loadClass(SelfFirstStrategy.java:42)
	at org.codehaus.plexus.classworlds.realm.ClassRealm.unsynchronizedLoadClass(ClassRealm.java:271)
	at org.codehaus.plexus.classworlds.realm.ClassRealm.loadClass(ClassRealm.java:247)
	at org.codehaus.plexus.classworlds.realm.ClassRealm.loadClass(ClassRealm.java:239)
	at jenkins.maven3.agent.Maven33Main.main(Maven33Main.java:133)
	at jenkins.maven3.agent.Maven33Main.main(Maven33Main.java:64)
ERROR: Failed to parse POMs
java.io.EOFException: unexpected stream termination
	at hudson.remoting.ChannelBuilder.negotiate(ChannelBuilder.java:408)
	at hudson.remoting.ChannelBuilder.build(ChannelBuilder.java:353)
	at hudson.slaves.Channels.forProcess(Channels.java:115)
	at hudson.maven.AbstractMavenProcessFactory.newProcess(AbstractMavenProcessFactory.java:294)
	at hudson.maven.ProcessCache.get(ProcessCache.java:236)
	at hudson.maven.MavenModuleSetBuild$MavenModuleSetBuildExecution.doRun(MavenModuleSetBuild.java:804)
	at hudson.model.AbstractBuild$AbstractBuildExecution.run(AbstractBuild.java:504)
	at hudson.model.Run.execute(Run.java:1724)
	at hudson.maven.MavenModuleSetBuild.run(MavenModuleSetBuild.java:543)
	at hudson.model.ResourceController.execute(ResourceController.java:97)
	at hudson.model.Executor.run(Executor.java:421)

Build failed in Jenkins: dir-kerby #461

Posted by Apache Jenkins Server <je...@builds.apache.org>.
See <https://builds.apache.org/job/dir-kerby/461/display/redirect?page=changes>

Changes:

[plusplusjiajia] DIRKRB-689 Create principals and export keytabs with host and role.

------------------------------------------
Started by an SCM change
[EnvInject] - Loading node environment variables.
Building remotely on H24 (ubuntu xenial) in workspace <https://builds.apache.org/job/dir-kerby/ws/>
 > git rev-parse --is-inside-work-tree # timeout=10
Fetching changes from the remote Git repository
 > git config remote.origin.url https://git-wip-us.apache.org/repos/asf/directory-kerby.git # timeout=10
Fetching upstream changes from https://git-wip-us.apache.org/repos/asf/directory-kerby.git
 > git --version # timeout=10
 > git fetch --tags --progress https://git-wip-us.apache.org/repos/asf/directory-kerby.git +refs/heads/*:refs/remotes/origin/*
 > git rev-parse refs/remotes/origin/trunk^{commit} # timeout=10
 > git rev-parse refs/remotes/origin/origin/trunk^{commit} # timeout=10
Checking out Revision 2e9a86443024794be8df7e871cee956051ab9fdb (refs/remotes/origin/trunk)
 > git config core.sparsecheckout # timeout=10
 > git checkout -f 2e9a86443024794be8df7e871cee956051ab9fdb
Commit message: "DIRKRB-689 Create principals and export keytabs with host and role."
 > git rev-list 8806cd183a93c8304768d4f6405c073c67a17f64 # timeout=10
Parsing POMs
Modules changed, recalculating dependency graph
Established TCP socket on 36409
maven33-agent.jar already up to date
maven33-interceptor.jar already up to date
maven3-interceptor-commons.jar already up to date
[dir-kerby] $ /home/jenkins/tools/java/latest1.7/bin/java -Xmx512m -XX:MaxPermSize=128m -cp /home/jenkins/jenkins-slave/maven33-agent.jar:/home/jenkins/tools/maven/apache-maven-3.3.9/boot/plexus-classworlds-2.5.2.jar:/home/jenkins/tools/maven/apache-maven-3.3.9/conf/logging jenkins.maven3.agent.Maven33Main /home/jenkins/tools/maven/apache-maven-3.3.9 /home/jenkins/jenkins-slave/slave.jar /home/jenkins/jenkins-slave/maven33-interceptor.jar /home/jenkins/jenkins-slave/maven3-interceptor-commons.jar 36409
Exception in thread "main" java.lang.UnsupportedClassVersionError: hudson/remoting/Launcher : Unsupported major.minor version 52.0
	at java.lang.ClassLoader.defineClass1(Native Method)
	at java.lang.ClassLoader.defineClass(ClassLoader.java:800)
	at java.security.SecureClassLoader.defineClass(SecureClassLoader.java:142)
	at java.net.URLClassLoader.defineClass(URLClassLoader.java:449)
	at java.net.URLClassLoader.access$100(URLClassLoader.java:71)
	at java.net.URLClassLoader$1.run(URLClassLoader.java:361)
	at java.net.URLClassLoader$1.run(URLClassLoader.java:355)
	at java.security.AccessController.doPrivileged(Native Method)
	at java.net.URLClassLoader.findClass(URLClassLoader.java:354)
	at org.codehaus.plexus.classworlds.realm.ClassRealm.loadClassFromSelf(ClassRealm.java:401)
	at org.codehaus.plexus.classworlds.strategy.SelfFirstStrategy.loadClass(SelfFirstStrategy.java:42)
	at org.codehaus.plexus.classworlds.realm.ClassRealm.unsynchronizedLoadClass(ClassRealm.java:271)
	at org.codehaus.plexus.classworlds.realm.ClassRealm.loadClass(ClassRealm.java:247)
	at org.codehaus.plexus.classworlds.realm.ClassRealm.loadClass(ClassRealm.java:239)
	at jenkins.maven3.agent.Maven33Main.main(Maven33Main.java:133)
	at jenkins.maven3.agent.Maven33Main.main(Maven33Main.java:64)
ERROR: Failed to parse POMs
java.io.EOFException: unexpected stream termination
	at hudson.remoting.ChannelBuilder.negotiate(ChannelBuilder.java:408)
	at hudson.remoting.ChannelBuilder.build(ChannelBuilder.java:353)
	at hudson.slaves.Channels.forProcess(Channels.java:115)
	at hudson.maven.AbstractMavenProcessFactory.newProcess(AbstractMavenProcessFactory.java:294)
	at hudson.maven.ProcessCache.get(ProcessCache.java:236)
	at hudson.maven.MavenModuleSetBuild$MavenModuleSetBuildExecution.doRun(MavenModuleSetBuild.java:804)
	at hudson.model.AbstractBuild$AbstractBuildExecution.run(AbstractBuild.java:504)
	at hudson.model.Run.execute(Run.java:1724)
	at hudson.maven.MavenModuleSetBuild.run(MavenModuleSetBuild.java:543)
	at hudson.model.ResourceController.execute(ResourceController.java:97)
	at hudson.model.Executor.run(Executor.java:421)

Build failed in Jenkins: dir-kerby #460

Posted by Apache Jenkins Server <je...@builds.apache.org>.
See <https://builds.apache.org/job/dir-kerby/460/display/redirect?page=changes>

Changes:

[plusplusjiajia] DIRKRB-674 Add REST API for kadmin interface.

------------------------------------------
Started by an SCM change
[EnvInject] - Loading node environment variables.
Building remotely on H27 (ubuntu xenial) in workspace <https://builds.apache.org/job/dir-kerby/ws/>
 > git rev-parse --is-inside-work-tree # timeout=10
Fetching changes from the remote Git repository
 > git config remote.origin.url https://git-wip-us.apache.org/repos/asf/directory-kerby.git # timeout=10
Fetching upstream changes from https://git-wip-us.apache.org/repos/asf/directory-kerby.git
 > git --version # timeout=10
 > git fetch --tags --progress https://git-wip-us.apache.org/repos/asf/directory-kerby.git +refs/heads/*:refs/remotes/origin/*
 > git rev-parse refs/remotes/origin/trunk^{commit} # timeout=10
 > git rev-parse refs/remotes/origin/origin/trunk^{commit} # timeout=10
Checking out Revision 8806cd183a93c8304768d4f6405c073c67a17f64 (refs/remotes/origin/trunk)
 > git config core.sparsecheckout # timeout=10
 > git checkout -f 8806cd183a93c8304768d4f6405c073c67a17f64
Commit message: "DIRKRB-674 Add REST API for kadmin interface."
 > git rev-list 05f72eb33613a7a6df27eaf28955089c7cb83014 # timeout=10
Parsing POMs
Modules changed, recalculating dependency graph
Established TCP socket on 39277
maven33-agent.jar already up to date
maven33-interceptor.jar already up to date
maven3-interceptor-commons.jar already up to date
[dir-kerby] $ /home/jenkins/tools/java/latest1.7/bin/java -Xmx512m -XX:MaxPermSize=128m -cp /home/jenkins/jenkins-slave/maven33-agent.jar:/home/jenkins/tools/maven/apache-maven-3.3.9/boot/plexus-classworlds-2.5.2.jar:/home/jenkins/tools/maven/apache-maven-3.3.9/conf/logging jenkins.maven3.agent.Maven33Main /home/jenkins/tools/maven/apache-maven-3.3.9 /home/jenkins/jenkins-slave/slave.jar /home/jenkins/jenkins-slave/maven33-interceptor.jar /home/jenkins/jenkins-slave/maven3-interceptor-commons.jar 39277
Exception in thread "main" java.lang.UnsupportedClassVersionError: hudson/remoting/Launcher : Unsupported major.minor version 52.0
	at java.lang.ClassLoader.defineClass1(Native Method)
	at java.lang.ClassLoader.defineClass(ClassLoader.java:800)
	at java.security.SecureClassLoader.defineClass(SecureClassLoader.java:142)
	at java.net.URLClassLoader.defineClass(URLClassLoader.java:449)
	at java.net.URLClassLoader.access$100(URLClassLoader.java:71)
	at java.net.URLClassLoader$1.run(URLClassLoader.java:361)
	at java.net.URLClassLoader$1.run(URLClassLoader.java:355)
	at java.security.AccessController.doPrivileged(Native Method)
	at java.net.URLClassLoader.findClass(URLClassLoader.java:354)
	at org.codehaus.plexus.classworlds.realm.ClassRealm.loadClassFromSelf(ClassRealm.java:401)
	at org.codehaus.plexus.classworlds.strategy.SelfFirstStrategy.loadClass(SelfFirstStrategy.java:42)
	at org.codehaus.plexus.classworlds.realm.ClassRealm.unsynchronizedLoadClass(ClassRealm.java:271)
	at org.codehaus.plexus.classworlds.realm.ClassRealm.loadClass(ClassRealm.java:247)
	at org.codehaus.plexus.classworlds.realm.ClassRealm.loadClass(ClassRealm.java:239)
	at jenkins.maven3.agent.Maven33Main.main(Maven33Main.java:133)
	at jenkins.maven3.agent.Maven33Main.main(Maven33Main.java:64)
ERROR: Failed to parse POMs
java.io.EOFException: unexpected stream termination
	at hudson.remoting.ChannelBuilder.negotiate(ChannelBuilder.java:408)
	at hudson.remoting.ChannelBuilder.build(ChannelBuilder.java:353)
	at hudson.slaves.Channels.forProcess(Channels.java:115)
	at hudson.maven.AbstractMavenProcessFactory.newProcess(AbstractMavenProcessFactory.java:294)
	at hudson.maven.ProcessCache.get(ProcessCache.java:236)
	at hudson.maven.MavenModuleSetBuild$MavenModuleSetBuildExecution.doRun(MavenModuleSetBuild.java:804)
	at hudson.model.AbstractBuild$AbstractBuildExecution.run(AbstractBuild.java:504)
	at hudson.model.Run.execute(Run.java:1724)
	at hudson.maven.MavenModuleSetBuild.run(MavenModuleSetBuild.java:543)
	at hudson.model.ResourceController.execute(ResourceController.java:97)
	at hudson.model.Executor.run(Executor.java:421)

Build failed in Jenkins: dir-kerby #459

Posted by Apache Jenkins Server <je...@builds.apache.org>.
See <https://builds.apache.org/job/dir-kerby/459/display/redirect>

------------------------------------------
Started by timer
[EnvInject] - Loading node environment variables.
Building remotely on H34 (ubuntu xenial) in workspace <https://builds.apache.org/job/dir-kerby/ws/>
 > git rev-parse --is-inside-work-tree # timeout=10
Fetching changes from the remote Git repository
 > git config remote.origin.url https://git-wip-us.apache.org/repos/asf/directory-kerby.git # timeout=10
Fetching upstream changes from https://git-wip-us.apache.org/repos/asf/directory-kerby.git
 > git --version # timeout=10
 > git fetch --tags --progress https://git-wip-us.apache.org/repos/asf/directory-kerby.git +refs/heads/*:refs/remotes/origin/*
 > git rev-parse refs/remotes/origin/trunk^{commit} # timeout=10
 > git rev-parse refs/remotes/origin/origin/trunk^{commit} # timeout=10
Checking out Revision 05f72eb33613a7a6df27eaf28955089c7cb83014 (refs/remotes/origin/trunk)
 > git config core.sparsecheckout # timeout=10
 > git checkout -f 05f72eb33613a7a6df27eaf28955089c7cb83014
Commit message: "Fix the build failure."
 > git rev-list 05f72eb33613a7a6df27eaf28955089c7cb83014 # timeout=10
Parsing POMs
Modules changed, recalculating dependency graph
Established TCP socket on 36439
maven33-agent.jar already up to date
maven33-interceptor.jar already up to date
maven3-interceptor-commons.jar already up to date
[dir-kerby] $ /home/jenkins/tools/java/latest1.7/bin/java -Xmx512m -XX:MaxPermSize=128m -cp /home/jenkins/jenkins-slave/maven33-agent.jar:/home/jenkins/tools/maven/apache-maven-3.3.9/boot/plexus-classworlds-2.5.2.jar:/home/jenkins/tools/maven/apache-maven-3.3.9/conf/logging jenkins.maven3.agent.Maven33Main /home/jenkins/tools/maven/apache-maven-3.3.9 /home/jenkins/jenkins-slave/slave.jar /home/jenkins/jenkins-slave/maven33-interceptor.jar /home/jenkins/jenkins-slave/maven3-interceptor-commons.jar 36439
Exception in thread "main" java.lang.UnsupportedClassVersionError: hudson/remoting/Launcher : Unsupported major.minor version 52.0
	at java.lang.ClassLoader.defineClass1(Native Method)
	at java.lang.ClassLoader.defineClass(ClassLoader.java:800)
	at java.security.SecureClassLoader.defineClass(SecureClassLoader.java:142)
	at java.net.URLClassLoader.defineClass(URLClassLoader.java:449)
	at java.net.URLClassLoader.access$100(URLClassLoader.java:71)
	at java.net.URLClassLoader$1.run(URLClassLoader.java:361)
	at java.net.URLClassLoader$1.run(URLClassLoader.java:355)
	at java.security.AccessController.doPrivileged(Native Method)
	at java.net.URLClassLoader.findClass(URLClassLoader.java:354)
	at org.codehaus.plexus.classworlds.realm.ClassRealm.loadClassFromSelf(ClassRealm.java:401)
	at org.codehaus.plexus.classworlds.strategy.SelfFirstStrategy.loadClass(SelfFirstStrategy.java:42)
	at org.codehaus.plexus.classworlds.realm.ClassRealm.unsynchronizedLoadClass(ClassRealm.java:271)
	at org.codehaus.plexus.classworlds.realm.ClassRealm.loadClass(ClassRealm.java:247)
	at org.codehaus.plexus.classworlds.realm.ClassRealm.loadClass(ClassRealm.java:239)
	at jenkins.maven3.agent.Maven33Main.main(Maven33Main.java:133)
	at jenkins.maven3.agent.Maven33Main.main(Maven33Main.java:64)
ERROR: Failed to parse POMs
java.io.EOFException: unexpected stream termination
	at hudson.remoting.ChannelBuilder.negotiate(ChannelBuilder.java:408)
	at hudson.remoting.ChannelBuilder.build(ChannelBuilder.java:353)
	at hudson.slaves.Channels.forProcess(Channels.java:115)
	at hudson.maven.AbstractMavenProcessFactory.newProcess(AbstractMavenProcessFactory.java:294)
	at hudson.maven.ProcessCache.get(ProcessCache.java:236)
	at hudson.maven.MavenModuleSetBuild$MavenModuleSetBuildExecution.doRun(MavenModuleSetBuild.java:804)
	at hudson.model.AbstractBuild$AbstractBuildExecution.run(AbstractBuild.java:504)
	at hudson.model.Run.execute(Run.java:1724)
	at hudson.maven.MavenModuleSetBuild.run(MavenModuleSetBuild.java:543)
	at hudson.model.ResourceController.execute(ResourceController.java:97)
	at hudson.model.Executor.run(Executor.java:421)

Build failed in Jenkins: dir-kerby #458

Posted by Apache Jenkins Server <je...@builds.apache.org>.
See <https://builds.apache.org/job/dir-kerby/458/display/redirect?page=changes>

Changes:

[plusplusjiajia] Fix the build failure.

------------------------------------------
Started by an SCM change
[EnvInject] - Loading node environment variables.
Building remotely on H35 (ubuntu xenial) in workspace <https://builds.apache.org/job/dir-kerby/ws/>
Cloning the remote Git repository
Cloning repository https://git-wip-us.apache.org/repos/asf/directory-kerby.git
 > git init <https://builds.apache.org/job/dir-kerby/ws/> # timeout=10
Fetching upstream changes from https://git-wip-us.apache.org/repos/asf/directory-kerby.git
 > git --version # timeout=10
 > git fetch --tags --progress https://git-wip-us.apache.org/repos/asf/directory-kerby.git +refs/heads/*:refs/remotes/origin/*
 > git config remote.origin.url https://git-wip-us.apache.org/repos/asf/directory-kerby.git # timeout=10
 > git config --add remote.origin.fetch +refs/heads/*:refs/remotes/origin/* # timeout=10
 > git config remote.origin.url https://git-wip-us.apache.org/repos/asf/directory-kerby.git # timeout=10
Fetching upstream changes from https://git-wip-us.apache.org/repos/asf/directory-kerby.git
 > git fetch --tags --progress https://git-wip-us.apache.org/repos/asf/directory-kerby.git +refs/heads/*:refs/remotes/origin/*
 > git rev-parse refs/remotes/origin/trunk^{commit} # timeout=10
 > git rev-parse refs/remotes/origin/origin/trunk^{commit} # timeout=10
Checking out Revision 05f72eb33613a7a6df27eaf28955089c7cb83014 (refs/remotes/origin/trunk)
 > git config core.sparsecheckout # timeout=10
 > git checkout -f 05f72eb33613a7a6df27eaf28955089c7cb83014
Commit message: "Fix the build failure."
 > git rev-list 2b0dd7ced8adc24b0e86da8f264a97c1e328e3c6 # timeout=10
Parsing POMs
Modules changed, recalculating dependency graph
Established TCP socket on 33828
maven33-agent.jar already up to date
maven33-interceptor.jar already up to date
maven3-interceptor-commons.jar already up to date
[dir-kerby] $ /home/jenkins/tools/java/latest1.7/bin/java -Xmx512m -XX:MaxPermSize=128m -cp /home/jenkins/jenkins-slave/maven33-agent.jar:/home/jenkins/tools/maven/apache-maven-3.3.9/boot/plexus-classworlds-2.5.2.jar:/home/jenkins/tools/maven/apache-maven-3.3.9/conf/logging jenkins.maven3.agent.Maven33Main /home/jenkins/tools/maven/apache-maven-3.3.9 /home/jenkins/jenkins-slave/slave.jar /home/jenkins/jenkins-slave/maven33-interceptor.jar /home/jenkins/jenkins-slave/maven3-interceptor-commons.jar 33828
Exception in thread "main" java.lang.UnsupportedClassVersionError: hudson/remoting/Launcher : Unsupported major.minor version 52.0
	at java.lang.ClassLoader.defineClass1(Native Method)
	at java.lang.ClassLoader.defineClass(ClassLoader.java:800)
	at java.security.SecureClassLoader.defineClass(SecureClassLoader.java:142)
	at java.net.URLClassLoader.defineClass(URLClassLoader.java:449)
	at java.net.URLClassLoader.access$100(URLClassLoader.java:71)
	at java.net.URLClassLoader$1.run(URLClassLoader.java:361)
	at java.net.URLClassLoader$1.run(URLClassLoader.java:355)
	at java.security.AccessController.doPrivileged(Native Method)
	at java.net.URLClassLoader.findClass(URLClassLoader.java:354)
	at org.codehaus.plexus.classworlds.realm.ClassRealm.loadClassFromSelf(ClassRealm.java:401)
	at org.codehaus.plexus.classworlds.strategy.SelfFirstStrategy.loadClass(SelfFirstStrategy.java:42)
	at org.codehaus.plexus.classworlds.realm.ClassRealm.unsynchronizedLoadClass(ClassRealm.java:271)
	at org.codehaus.plexus.classworlds.realm.ClassRealm.loadClass(ClassRealm.java:247)
	at org.codehaus.plexus.classworlds.realm.ClassRealm.loadClass(ClassRealm.java:239)
	at jenkins.maven3.agent.Maven33Main.main(Maven33Main.java:133)
	at jenkins.maven3.agent.Maven33Main.main(Maven33Main.java:64)
ERROR: Failed to parse POMs
java.io.EOFException: unexpected stream termination
	at hudson.remoting.ChannelBuilder.negotiate(ChannelBuilder.java:408)
	at hudson.remoting.ChannelBuilder.build(ChannelBuilder.java:353)
	at hudson.slaves.Channels.forProcess(Channels.java:115)
	at hudson.maven.AbstractMavenProcessFactory.newProcess(AbstractMavenProcessFactory.java:294)
	at hudson.maven.ProcessCache.get(ProcessCache.java:236)
	at hudson.maven.MavenModuleSetBuild$MavenModuleSetBuildExecution.doRun(MavenModuleSetBuild.java:804)
	at hudson.model.AbstractBuild$AbstractBuildExecution.run(AbstractBuild.java:504)
	at hudson.model.Run.execute(Run.java:1724)
	at hudson.maven.MavenModuleSetBuild.run(MavenModuleSetBuild.java:543)
	at hudson.model.ResourceController.execute(ResourceController.java:97)
	at hudson.model.Executor.run(Executor.java:421)

Build failed in Jenkins: dir-kerby #457

Posted by Apache Jenkins Server <je...@builds.apache.org>.
See <https://builds.apache.org/job/dir-kerby/457/display/redirect?page=changes>

Changes:

[plusplusjiajia] DIRKRB-687 Define new PA data type being used by Windows 10. Contributed

------------------------------------------
Started by an SCM change
[EnvInject] - Loading node environment variables.
Building remotely on H34 (ubuntu xenial) in workspace <https://builds.apache.org/job/dir-kerby/ws/>
 > git rev-parse --is-inside-work-tree # timeout=10
Fetching changes from the remote Git repository
 > git config remote.origin.url https://git-wip-us.apache.org/repos/asf/directory-kerby.git # timeout=10
Fetching upstream changes from https://git-wip-us.apache.org/repos/asf/directory-kerby.git
 > git --version # timeout=10
 > git fetch --tags --progress https://git-wip-us.apache.org/repos/asf/directory-kerby.git +refs/heads/*:refs/remotes/origin/*
 > git rev-parse refs/remotes/origin/trunk^{commit} # timeout=10
 > git rev-parse refs/remotes/origin/origin/trunk^{commit} # timeout=10
Checking out Revision 2b0dd7ced8adc24b0e86da8f264a97c1e328e3c6 (refs/remotes/origin/trunk)
 > git config core.sparsecheckout # timeout=10
 > git checkout -f 2b0dd7ced8adc24b0e86da8f264a97c1e328e3c6
Commit message: "DIRKRB-687 Define new PA data type being used by Windows 10. Contributed by Gerard Gagliano"
 > git rev-list 34ccabec68b2b83b683240801e3929ef43eec26e # timeout=10
Parsing POMs
Modules changed, recalculating dependency graph
Established TCP socket on 36150
maven33-agent.jar already up to date
maven33-interceptor.jar already up to date
maven3-interceptor-commons.jar already up to date
[dir-kerby] $ /home/jenkins/tools/java/latest1.7/bin/java -Xmx512m -XX:MaxPermSize=128m -cp /home/jenkins/jenkins-slave/maven33-agent.jar:/home/jenkins/tools/maven/apache-maven-3.3.9/boot/plexus-classworlds-2.5.2.jar:/home/jenkins/tools/maven/apache-maven-3.3.9/conf/logging jenkins.maven3.agent.Maven33Main /home/jenkins/tools/maven/apache-maven-3.3.9 /home/jenkins/jenkins-slave/slave.jar /home/jenkins/jenkins-slave/maven33-interceptor.jar /home/jenkins/jenkins-slave/maven3-interceptor-commons.jar 36150
Exception in thread "main" java.lang.UnsupportedClassVersionError: hudson/remoting/Launcher : Unsupported major.minor version 52.0
	at java.lang.ClassLoader.defineClass1(Native Method)
	at java.lang.ClassLoader.defineClass(ClassLoader.java:800)
	at java.security.SecureClassLoader.defineClass(SecureClassLoader.java:142)
	at java.net.URLClassLoader.defineClass(URLClassLoader.java:449)
	at java.net.URLClassLoader.access$100(URLClassLoader.java:71)
	at java.net.URLClassLoader$1.run(URLClassLoader.java:361)
	at java.net.URLClassLoader$1.run(URLClassLoader.java:355)
	at java.security.AccessController.doPrivileged(Native Method)
	at java.net.URLClassLoader.findClass(URLClassLoader.java:354)
	at org.codehaus.plexus.classworlds.realm.ClassRealm.loadClassFromSelf(ClassRealm.java:401)
	at org.codehaus.plexus.classworlds.strategy.SelfFirstStrategy.loadClass(SelfFirstStrategy.java:42)
	at org.codehaus.plexus.classworlds.realm.ClassRealm.unsynchronizedLoadClass(ClassRealm.java:271)
	at org.codehaus.plexus.classworlds.realm.ClassRealm.loadClass(ClassRealm.java:247)
	at org.codehaus.plexus.classworlds.realm.ClassRealm.loadClass(ClassRealm.java:239)
	at jenkins.maven3.agent.Maven33Main.main(Maven33Main.java:133)
	at jenkins.maven3.agent.Maven33Main.main(Maven33Main.java:64)
ERROR: Failed to parse POMs
java.io.EOFException: unexpected stream termination
	at hudson.remoting.ChannelBuilder.negotiate(ChannelBuilder.java:408)
	at hudson.remoting.ChannelBuilder.build(ChannelBuilder.java:353)
	at hudson.slaves.Channels.forProcess(Channels.java:115)
	at hudson.maven.AbstractMavenProcessFactory.newProcess(AbstractMavenProcessFactory.java:294)
	at hudson.maven.ProcessCache.get(ProcessCache.java:236)
	at hudson.maven.MavenModuleSetBuild$MavenModuleSetBuildExecution.doRun(MavenModuleSetBuild.java:804)
	at hudson.model.AbstractBuild$AbstractBuildExecution.run(AbstractBuild.java:504)
	at hudson.model.Run.execute(Run.java:1724)
	at hudson.maven.MavenModuleSetBuild.run(MavenModuleSetBuild.java:543)
	at hudson.model.ResourceController.execute(ResourceController.java:97)
	at hudson.model.Executor.run(Executor.java:421)

Build failed in Jenkins: dir-kerby #456

Posted by Apache Jenkins Server <je...@builds.apache.org>.
See <https://builds.apache.org/job/dir-kerby/456/display/redirect?page=changes>

Changes:

[plusplusjiajia] DIRKRB-681 Add new LoginModule

------------------------------------------
Started by an SCM change
[EnvInject] - Loading node environment variables.
Building remotely on H27 (ubuntu xenial) in workspace <https://builds.apache.org/job/dir-kerby/ws/>
 > git rev-parse --is-inside-work-tree # timeout=10
Fetching changes from the remote Git repository
 > git config remote.origin.url https://git-wip-us.apache.org/repos/asf/directory-kerby.git # timeout=10
Fetching upstream changes from https://git-wip-us.apache.org/repos/asf/directory-kerby.git
 > git --version # timeout=10
 > git fetch --tags --progress https://git-wip-us.apache.org/repos/asf/directory-kerby.git +refs/heads/*:refs/remotes/origin/*
 > git rev-parse refs/remotes/origin/trunk^{commit} # timeout=10
 > git rev-parse refs/remotes/origin/origin/trunk^{commit} # timeout=10
Checking out Revision 34ccabec68b2b83b683240801e3929ef43eec26e (refs/remotes/origin/trunk)
 > git config core.sparsecheckout # timeout=10
 > git checkout -f 34ccabec68b2b83b683240801e3929ef43eec26e
Commit message: "DIRKRB-681 Add new LoginModule"
 > git rev-list a8a284d9c77b4eead0d4d1b83aee6312c14a2c7a # timeout=10
Parsing POMs
Modules changed, recalculating dependency graph
Established TCP socket on 45089
maven33-agent.jar already up to date
maven33-interceptor.jar already up to date
maven3-interceptor-commons.jar already up to date
[dir-kerby] $ /home/jenkins/tools/java/latest1.7/bin/java -Xmx512m -XX:MaxPermSize=128m -cp /home/jenkins/jenkins-slave/maven33-agent.jar:/home/jenkins/tools/maven/apache-maven-3.3.9/boot/plexus-classworlds-2.5.2.jar:/home/jenkins/tools/maven/apache-maven-3.3.9/conf/logging jenkins.maven3.agent.Maven33Main /home/jenkins/tools/maven/apache-maven-3.3.9 /home/jenkins/jenkins-slave/slave.jar /home/jenkins/jenkins-slave/maven33-interceptor.jar /home/jenkins/jenkins-slave/maven3-interceptor-commons.jar 45089
Exception in thread "main" java.lang.UnsupportedClassVersionError: hudson/remoting/Launcher : Unsupported major.minor version 52.0
	at java.lang.ClassLoader.defineClass1(Native Method)
	at java.lang.ClassLoader.defineClass(ClassLoader.java:800)
	at java.security.SecureClassLoader.defineClass(SecureClassLoader.java:142)
	at java.net.URLClassLoader.defineClass(URLClassLoader.java:449)
	at java.net.URLClassLoader.access$100(URLClassLoader.java:71)
	at java.net.URLClassLoader$1.run(URLClassLoader.java:361)
	at java.net.URLClassLoader$1.run(URLClassLoader.java:355)
	at java.security.AccessController.doPrivileged(Native Method)
	at java.net.URLClassLoader.findClass(URLClassLoader.java:354)
	at org.codehaus.plexus.classworlds.realm.ClassRealm.loadClassFromSelf(ClassRealm.java:401)
	at org.codehaus.plexus.classworlds.strategy.SelfFirstStrategy.loadClass(SelfFirstStrategy.java:42)
	at org.codehaus.plexus.classworlds.realm.ClassRealm.unsynchronizedLoadClass(ClassRealm.java:271)
	at org.codehaus.plexus.classworlds.realm.ClassRealm.loadClass(ClassRealm.java:247)
	at org.codehaus.plexus.classworlds.realm.ClassRealm.loadClass(ClassRealm.java:239)
	at jenkins.maven3.agent.Maven33Main.main(Maven33Main.java:133)
	at jenkins.maven3.agent.Maven33Main.main(Maven33Main.java:64)
ERROR: Failed to parse POMs
java.io.EOFException: unexpected stream termination
	at hudson.remoting.ChannelBuilder.negotiate(ChannelBuilder.java:408)
	at hudson.remoting.ChannelBuilder.build(ChannelBuilder.java:353)
	at hudson.slaves.Channels.forProcess(Channels.java:115)
	at hudson.maven.AbstractMavenProcessFactory.newProcess(AbstractMavenProcessFactory.java:294)
	at hudson.maven.ProcessCache.get(ProcessCache.java:236)
	at hudson.maven.MavenModuleSetBuild$MavenModuleSetBuildExecution.doRun(MavenModuleSetBuild.java:804)
	at hudson.model.AbstractBuild$AbstractBuildExecution.run(AbstractBuild.java:504)
	at hudson.model.Run.execute(Run.java:1724)
	at hudson.maven.MavenModuleSetBuild.run(MavenModuleSetBuild.java:543)
	at hudson.model.ResourceController.execute(ResourceController.java:97)
	at hudson.model.Executor.run(Executor.java:421)

Build failed in Jenkins: dir-kerby #455

Posted by Apache Jenkins Server <je...@builds.apache.org>.
See <https://builds.apache.org/job/dir-kerby/455/display/redirect>

------------------------------------------
Started by timer
[EnvInject] - Loading node environment variables.
Building remotely on H26 (ubuntu xenial) in workspace <https://builds.apache.org/job/dir-kerby/ws/>
 > git rev-parse --is-inside-work-tree # timeout=10
Fetching changes from the remote Git repository
 > git config remote.origin.url https://git-wip-us.apache.org/repos/asf/directory-kerby.git # timeout=10
Fetching upstream changes from https://git-wip-us.apache.org/repos/asf/directory-kerby.git
 > git --version # timeout=10
 > git fetch --tags --progress https://git-wip-us.apache.org/repos/asf/directory-kerby.git +refs/heads/*:refs/remotes/origin/*
 > git rev-parse refs/remotes/origin/trunk^{commit} # timeout=10
 > git rev-parse refs/remotes/origin/origin/trunk^{commit} # timeout=10
Checking out Revision a8a284d9c77b4eead0d4d1b83aee6312c14a2c7a (refs/remotes/origin/trunk)
 > git config core.sparsecheckout # timeout=10
 > git checkout -f a8a284d9c77b4eead0d4d1b83aee6312c14a2c7a
Commit message: "DIRKRB-686 Some refactor work for MySQL backend."
 > git rev-list a8a284d9c77b4eead0d4d1b83aee6312c14a2c7a # timeout=10
Parsing POMs
Modules changed, recalculating dependency graph
Established TCP socket on 43647
maven33-agent.jar already up to date
maven33-interceptor.jar already up to date
maven3-interceptor-commons.jar already up to date
[dir-kerby] $ /home/jenkins/tools/java/latest1.7/bin/java -Xmx512m -XX:MaxPermSize=128m -cp /home/jenkins/jenkins-slave/maven33-agent.jar:/home/jenkins/tools/maven/apache-maven-3.3.9/boot/plexus-classworlds-2.5.2.jar:/home/jenkins/tools/maven/apache-maven-3.3.9/conf/logging jenkins.maven3.agent.Maven33Main /home/jenkins/tools/maven/apache-maven-3.3.9 /home/jenkins/jenkins-slave/slave.jar /home/jenkins/jenkins-slave/maven33-interceptor.jar /home/jenkins/jenkins-slave/maven3-interceptor-commons.jar 43647
Exception in thread "main" java.lang.UnsupportedClassVersionError: hudson/remoting/Launcher : Unsupported major.minor version 52.0
	at java.lang.ClassLoader.defineClass1(Native Method)
	at java.lang.ClassLoader.defineClass(ClassLoader.java:800)
	at java.security.SecureClassLoader.defineClass(SecureClassLoader.java:142)
	at java.net.URLClassLoader.defineClass(URLClassLoader.java:449)
	at java.net.URLClassLoader.access$100(URLClassLoader.java:71)
	at java.net.URLClassLoader$1.run(URLClassLoader.java:361)
	at java.net.URLClassLoader$1.run(URLClassLoader.java:355)
	at java.security.AccessController.doPrivileged(Native Method)
	at java.net.URLClassLoader.findClass(URLClassLoader.java:354)
	at org.codehaus.plexus.classworlds.realm.ClassRealm.loadClassFromSelf(ClassRealm.java:401)
	at org.codehaus.plexus.classworlds.strategy.SelfFirstStrategy.loadClass(SelfFirstStrategy.java:42)
	at org.codehaus.plexus.classworlds.realm.ClassRealm.unsynchronizedLoadClass(ClassRealm.java:271)
	at org.codehaus.plexus.classworlds.realm.ClassRealm.loadClass(ClassRealm.java:247)
	at org.codehaus.plexus.classworlds.realm.ClassRealm.loadClass(ClassRealm.java:239)
	at jenkins.maven3.agent.Maven33Main.main(Maven33Main.java:133)
	at jenkins.maven3.agent.Maven33Main.main(Maven33Main.java:64)
ERROR: Failed to parse POMs
java.io.EOFException: unexpected stream termination
	at hudson.remoting.ChannelBuilder.negotiate(ChannelBuilder.java:408)
	at hudson.remoting.ChannelBuilder.build(ChannelBuilder.java:353)
	at hudson.slaves.Channels.forProcess(Channels.java:115)
	at hudson.maven.AbstractMavenProcessFactory.newProcess(AbstractMavenProcessFactory.java:294)
	at hudson.maven.ProcessCache.get(ProcessCache.java:236)
	at hudson.maven.MavenModuleSetBuild$MavenModuleSetBuildExecution.doRun(MavenModuleSetBuild.java:804)
	at hudson.model.AbstractBuild$AbstractBuildExecution.run(AbstractBuild.java:504)
	at hudson.model.Run.execute(Run.java:1724)
	at hudson.maven.MavenModuleSetBuild.run(MavenModuleSetBuild.java:543)
	at hudson.model.ResourceController.execute(ResourceController.java:97)
	at hudson.model.Executor.run(Executor.java:421)

Build failed in Jenkins: dir-kerby #454

Posted by Apache Jenkins Server <je...@builds.apache.org>.
See <https://builds.apache.org/job/dir-kerby/454/display/redirect?page=changes>

Changes:

[zenglinx] DIRKRB-686 Some refactor work for MySQL backend.

------------------------------------------
Started by an SCM change
[EnvInject] - Loading node environment variables.
Building remotely on H26 (ubuntu xenial) in workspace <https://builds.apache.org/job/dir-kerby/ws/>
Cloning the remote Git repository
Cloning repository https://git-wip-us.apache.org/repos/asf/directory-kerby.git
 > git init <https://builds.apache.org/job/dir-kerby/ws/> # timeout=10
Fetching upstream changes from https://git-wip-us.apache.org/repos/asf/directory-kerby.git
 > git --version # timeout=10
 > git fetch --tags --progress https://git-wip-us.apache.org/repos/asf/directory-kerby.git +refs/heads/*:refs/remotes/origin/*
 > git config remote.origin.url https://git-wip-us.apache.org/repos/asf/directory-kerby.git # timeout=10
 > git config --add remote.origin.fetch +refs/heads/*:refs/remotes/origin/* # timeout=10
 > git config remote.origin.url https://git-wip-us.apache.org/repos/asf/directory-kerby.git # timeout=10
Fetching upstream changes from https://git-wip-us.apache.org/repos/asf/directory-kerby.git
 > git fetch --tags --progress https://git-wip-us.apache.org/repos/asf/directory-kerby.git +refs/heads/*:refs/remotes/origin/*
 > git rev-parse refs/remotes/origin/trunk^{commit} # timeout=10
 > git rev-parse refs/remotes/origin/origin/trunk^{commit} # timeout=10
Checking out Revision a8a284d9c77b4eead0d4d1b83aee6312c14a2c7a (refs/remotes/origin/trunk)
 > git config core.sparsecheckout # timeout=10
 > git checkout -f a8a284d9c77b4eead0d4d1b83aee6312c14a2c7a
Commit message: "DIRKRB-686 Some refactor work for MySQL backend."
 > git rev-list 11089e86940723fb2ca5850504b93814b4e794ad # timeout=10
Parsing POMs
Modules changed, recalculating dependency graph
Established TCP socket on 46490
maven33-agent.jar already up to date
maven33-interceptor.jar already up to date
maven3-interceptor-commons.jar already up to date
[dir-kerby] $ /home/jenkins/tools/java/latest1.7/bin/java -Xmx512m -XX:MaxPermSize=128m -cp /home/jenkins/jenkins-slave/maven33-agent.jar:/home/jenkins/tools/maven/apache-maven-3.3.9/boot/plexus-classworlds-2.5.2.jar:/home/jenkins/tools/maven/apache-maven-3.3.9/conf/logging jenkins.maven3.agent.Maven33Main /home/jenkins/tools/maven/apache-maven-3.3.9 /home/jenkins/jenkins-slave/slave.jar /home/jenkins/jenkins-slave/maven33-interceptor.jar /home/jenkins/jenkins-slave/maven3-interceptor-commons.jar 46490
Exception in thread "main" java.lang.UnsupportedClassVersionError: hudson/remoting/Launcher : Unsupported major.minor version 52.0
	at java.lang.ClassLoader.defineClass1(Native Method)
	at java.lang.ClassLoader.defineClass(ClassLoader.java:800)
	at java.security.SecureClassLoader.defineClass(SecureClassLoader.java:142)
	at java.net.URLClassLoader.defineClass(URLClassLoader.java:449)
	at java.net.URLClassLoader.access$100(URLClassLoader.java:71)
	at java.net.URLClassLoader$1.run(URLClassLoader.java:361)
	at java.net.URLClassLoader$1.run(URLClassLoader.java:355)
	at java.security.AccessController.doPrivileged(Native Method)
	at java.net.URLClassLoader.findClass(URLClassLoader.java:354)
	at org.codehaus.plexus.classworlds.realm.ClassRealm.loadClassFromSelf(ClassRealm.java:401)
	at org.codehaus.plexus.classworlds.strategy.SelfFirstStrategy.loadClass(SelfFirstStrategy.java:42)
	at org.codehaus.plexus.classworlds.realm.ClassRealm.unsynchronizedLoadClass(ClassRealm.java:271)
	at org.codehaus.plexus.classworlds.realm.ClassRealm.loadClass(ClassRealm.java:247)
	at org.codehaus.plexus.classworlds.realm.ClassRealm.loadClass(ClassRealm.java:239)
	at jenkins.maven3.agent.Maven33Main.main(Maven33Main.java:133)
	at jenkins.maven3.agent.Maven33Main.main(Maven33Main.java:64)
ERROR: Failed to parse POMs
java.io.EOFException: unexpected stream termination
	at hudson.remoting.ChannelBuilder.negotiate(ChannelBuilder.java:408)
	at hudson.remoting.ChannelBuilder.build(ChannelBuilder.java:353)
	at hudson.slaves.Channels.forProcess(Channels.java:115)
	at hudson.maven.AbstractMavenProcessFactory.newProcess(AbstractMavenProcessFactory.java:294)
	at hudson.maven.ProcessCache.get(ProcessCache.java:236)
	at hudson.maven.MavenModuleSetBuild$MavenModuleSetBuildExecution.doRun(MavenModuleSetBuild.java:804)
	at hudson.model.AbstractBuild$AbstractBuildExecution.run(AbstractBuild.java:504)
	at hudson.model.Run.execute(Run.java:1724)
	at hudson.maven.MavenModuleSetBuild.run(MavenModuleSetBuild.java:543)
	at hudson.model.ResourceController.execute(ResourceController.java:97)
	at hudson.model.Executor.run(Executor.java:421)

Build failed in Jenkins: dir-kerby #453

Posted by Apache Jenkins Server <je...@builds.apache.org>.
See <https://builds.apache.org/job/dir-kerby/453/display/redirect>

------------------------------------------
Started by an SCM change
[EnvInject] - Loading node environment variables.
Building remotely on H24 (ubuntu xenial) in workspace <https://builds.apache.org/job/dir-kerby/ws/>
 > git rev-parse --is-inside-work-tree # timeout=10
Fetching changes from the remote Git repository
 > git config remote.origin.url https://git-wip-us.apache.org/repos/asf/directory-kerby.git # timeout=10
Fetching upstream changes from https://git-wip-us.apache.org/repos/asf/directory-kerby.git
 > git --version # timeout=10
 > git fetch --tags --progress https://git-wip-us.apache.org/repos/asf/directory-kerby.git +refs/heads/*:refs/remotes/origin/*
ERROR: Error fetching remote repo 'origin'
hudson.plugins.git.GitException: Failed to fetch from https://git-wip-us.apache.org/repos/asf/directory-kerby.git
	at hudson.plugins.git.GitSCM.fetchFrom(GitSCM.java:825)
	at hudson.plugins.git.GitSCM.retrieveChanges(GitSCM.java:1092)
	at hudson.plugins.git.GitSCM.checkout(GitSCM.java:1123)
	at hudson.scm.SCM.checkout(SCM.java:495)
	at hudson.model.AbstractProject.checkout(AbstractProject.java:1202)
	at hudson.model.AbstractBuild$AbstractBuildExecution.defaultCheckout(AbstractBuild.java:574)
	at jenkins.scm.SCMCheckoutStrategy.checkout(SCMCheckoutStrategy.java:86)
	at hudson.model.AbstractBuild$AbstractBuildExecution.run(AbstractBuild.java:499)
	at hudson.model.Run.execute(Run.java:1724)
	at hudson.maven.MavenModuleSetBuild.run(MavenModuleSetBuild.java:543)
	at hudson.model.ResourceController.execute(ResourceController.java:97)
	at hudson.model.Executor.run(Executor.java:421)
Caused by: hudson.plugins.git.GitException: Command "git fetch --tags --progress https://git-wip-us.apache.org/repos/asf/directory-kerby.git +refs/heads/*:refs/remotes/origin/*" returned status code 128:
stdout: 
stderr: remote: Counting objects: 126, done.        
remote: Compressing objects:   2% (1/49)           remote: Compressing objects:   4% (2/49)           remote: Compressing objects:   6% (3/49)           remote: Compressing objects:   8% (4/49)           remote: Compressing objects:  10% (5/49)           remote: Compressing objects:  12% (6/49)           remote: Compressing objects:  14% (7/49)           remote: Compressing objects:  16% (8/49)           remote: Compressing objects:  18% (9/49)           remote: Compressing objects:  20% (10/49)           remote: Compressing objects:  22% (11/49)           remote: Compressing objects:  24% (12/49)           remote: Compressing objects:  26% (13/49)           remote: Compressing objects:  28% (14/49)           remote: Compressing objects:  30% (15/49)           remote: Compressing objects:  32% (16/49)           remote: Compressing objects:  34% (17/49)           remote: Compressing objects:  36% (18/49)           remote: Compressing objects:  38% (19/49)           remote: Compressing objects:  40% (20/49)           remote: Compressing objects:  42% (21/49)           remote: Compressing objects:  44% (22/49)           remote: Compressing objects:  46% (23/49)           remote: Compressing objects:  48% (24/49)           remote: Compressing objects:  51% (25/49)           remote: Compressing objects:  53% (26/49)           remote: Compressing objects:  55% (27/49)           remote: Compressing objects:  57% (28/49)           remote: Compressing objects:  59% (29/49)           remote: Compressing objects:  61% (30/49)           remote: Compressing objects:  63% (31/49)           remote: Compressing objects:  65% (32/49)           remote: Compressing objects:  67% (33/49)           remote: Compressing objects:  69% (34/49)           remote: Compressing objects:  71% (35/49)           remote: Compressing objects:  73% (36/49)           remote: Compressing objects:  75% (37/49)           remote: Compressing objects:  77% (38/49)           remote: Compressing objects:  79% (39/49)           remote: Compressing objects:  81% (40/49)           remote: Compressing objects:  83% (41/49)           remote: Compressing objects:  85% (42/49)           remote: Compressing objects:  87% (43/49)           remote: Compressing objects:  89% (44/49)           remote: Compressing objects:  91% (45/49)           remote: Compressing objects:  93% (46/49)           remote: Compressing objects:  95% (47/49)           remote: Compressing objects:  97% (48/49)           remote: Compressing objects: 100% (49/49)           remote: Compressing objects: 100% (49/49), done.        
remote: Total 84 (delta 30), reused 0 (delta 0)        
error: unable to create temporary file: No space left on device
fatal: failed to write object
fatal: unpack-objects failed

	at org.jenkinsci.plugins.gitclient.CliGitAPIImpl.launchCommandIn(CliGitAPIImpl.java:1970)
	at org.jenkinsci.plugins.gitclient.CliGitAPIImpl.launchCommandWithCredentials(CliGitAPIImpl.java:1689)
	at org.jenkinsci.plugins.gitclient.CliGitAPIImpl.access$300(CliGitAPIImpl.java:71)
	at org.jenkinsci.plugins.gitclient.CliGitAPIImpl$1.execute(CliGitAPIImpl.java:380)
	at org.jenkinsci.plugins.gitclient.RemoteGitImpl$CommandInvocationHandler$1.call(RemoteGitImpl.java:153)
	at org.jenkinsci.plugins.gitclient.RemoteGitImpl$CommandInvocationHandler$1.call(RemoteGitImpl.java:146)
	at hudson.remoting.UserRequest.perform(UserRequest.java:207)
	at hudson.remoting.UserRequest.perform(UserRequest.java:53)
	at hudson.remoting.Request$2.run(Request.java:358)
	at hudson.remoting.InterceptingExecutorService$1.call(InterceptingExecutorService.java:72)
	at java.util.concurrent.FutureTask.run(FutureTask.java:266)
	at java.util.concurrent.ThreadPoolExecutor.runWorker(ThreadPoolExecutor.java:1142)
	at java.util.concurrent.ThreadPoolExecutor$Worker.run(ThreadPoolExecutor.java:617)
	at java.lang.Thread.run(Thread.java:748)
	Suppressed: hudson.remoting.Channel$CallSiteStackTrace: Remote call to H24
		at hudson.remoting.Channel.attachCallSiteStackTrace(Channel.java:1693)
		at hudson.remoting.UserResponse.retrieve(UserRequest.java:310)
		at hudson.remoting.Channel.call(Channel.java:908)
		at org.jenkinsci.plugins.gitclient.RemoteGitImpl$CommandInvocationHandler.execute(RemoteGitImpl.java:146)
		at sun.reflect.GeneratedMethodAccessor804.invoke(Unknown Source)
		at sun.reflect.DelegatingMethodAccessorImpl.invoke(DelegatingMethodAccessorImpl.java:43)
		at java.lang.reflect.Method.invoke(Method.java:498)
		at org.jenkinsci.plugins.gitclient.RemoteGitImpl$CommandInvocationHandler.invoke(RemoteGitImpl.java:132)
		at com.sun.proxy.$Proxy111.execute(Unknown Source)
		at hudson.plugins.git.GitSCM.fetchFrom(GitSCM.java:823)
		at hudson.plugins.git.GitSCM.retrieveChanges(GitSCM.java:1092)
		at hudson.plugins.git.GitSCM.checkout(GitSCM.java:1123)
		at hudson.scm.SCM.checkout(SCM.java:495)
		at hudson.model.AbstractProject.checkout(AbstractProject.java:1202)
		at hudson.model.AbstractBuild$AbstractBuildExecution.defaultCheckout(AbstractBuild.java:574)
		at jenkins.scm.SCMCheckoutStrategy.checkout(SCMCheckoutStrategy.java:86)
		at hudson.model.AbstractBuild$AbstractBuildExecution.run(AbstractBuild.java:499)
		at hudson.model.Run.execute(Run.java:1724)
		at hudson.maven.MavenModuleSetBuild.run(MavenModuleSetBuild.java:543)
		at hudson.model.ResourceController.execute(ResourceController.java:97)
		at hudson.model.Executor.run(Executor.java:421)
ERROR: Error fetching remote repo 'origin'
Retrying after 10 seconds
 > git rev-parse --is-inside-work-tree # timeout=10
Fetching changes from the remote Git repository
 > git config remote.origin.url https://git-wip-us.apache.org/repos/asf/directory-kerby.git # timeout=10
ERROR: Error fetching remote repo 'origin'
hudson.plugins.git.GitException: Failed to fetch from https://git-wip-us.apache.org/repos/asf/directory-kerby.git
	at hudson.plugins.git.GitSCM.fetchFrom(GitSCM.java:825)
	at hudson.plugins.git.GitSCM.retrieveChanges(GitSCM.java:1092)
	at hudson.plugins.git.GitSCM.checkout(GitSCM.java:1123)
	at hudson.scm.SCM.checkout(SCM.java:495)
	at hudson.model.AbstractProject.checkout(AbstractProject.java:1202)
	at hudson.model.AbstractBuild$AbstractBuildExecution.defaultCheckout(AbstractBuild.java:574)
	at jenkins.scm.SCMCheckoutStrategy.checkout(SCMCheckoutStrategy.java:86)
	at hudson.model.AbstractBuild$AbstractBuildExecution.run(AbstractBuild.java:499)
	at hudson.model.Run.execute(Run.java:1724)
	at hudson.maven.MavenModuleSetBuild.run(MavenModuleSetBuild.java:543)
	at hudson.model.ResourceController.execute(ResourceController.java:97)
	at hudson.model.Executor.run(Executor.java:421)
Caused by: hudson.plugins.git.GitException: Command "git config remote.origin.url https://git-wip-us.apache.org/repos/asf/directory-kerby.git" returned status code 4:
stdout: 
stderr: error: failed to write new configuration file <https://builds.apache.org/job/dir-kerby/ws/.git/config.lock>

	at org.jenkinsci.plugins.gitclient.CliGitAPIImpl.launchCommandIn(CliGitAPIImpl.java:1970)
	at org.jenkinsci.plugins.gitclient.CliGitAPIImpl.launchCommandIn(CliGitAPIImpl.java:1938)
	at org.jenkinsci.plugins.gitclient.CliGitAPIImpl.launchCommandIn(CliGitAPIImpl.java:1934)
	at org.jenkinsci.plugins.gitclient.CliGitAPIImpl.launchCommand(CliGitAPIImpl.java:1572)
	at org.jenkinsci.plugins.gitclient.CliGitAPIImpl.launchCommand(CliGitAPIImpl.java:1584)
	at org.jenkinsci.plugins.gitclient.CliGitAPIImpl.setRemoteUrl(CliGitAPIImpl.java:1218)
	at hudson.plugins.git.GitAPI.setRemoteUrl(GitAPI.java:160)
	at sun.reflect.GeneratedMethodAccessor43.invoke(Unknown Source)
	at sun.reflect.DelegatingMethodAccessorImpl.invoke(DelegatingMethodAccessorImpl.java:43)
	at java.lang.reflect.Method.invoke(Method.java:498)
	at hudson.remoting.RemoteInvocationHandler$RPCRequest.perform(RemoteInvocationHandler.java:922)
	at hudson.remoting.RemoteInvocationHandler$RPCRequest.call(RemoteInvocationHandler.java:896)
	at hudson.remoting.RemoteInvocationHandler$RPCRequest.call(RemoteInvocationHandler.java:853)
	at hudson.remoting.UserRequest.perform(UserRequest.java:207)
	at hudson.remoting.UserRequest.perform(UserRequest.java:53)
	at hudson.remoting.Request$2.run(Request.java:358)
	at hudson.remoting.InterceptingExecutorService$1.call(InterceptingExecutorService.java:72)
	at java.util.concurrent.FutureTask.run(FutureTask.java:266)
	at java.util.concurrent.ThreadPoolExecutor.runWorker(ThreadPoolExecutor.java:1142)
	at java.util.concurrent.ThreadPoolExecutor$Worker.run(ThreadPoolExecutor.java:617)
	at java.lang.Thread.run(Thread.java:748)
	Suppressed: hudson.remoting.Channel$CallSiteStackTrace: Remote call to H24
		at hudson.remoting.Channel.attachCallSiteStackTrace(Channel.java:1693)
		at hudson.remoting.UserResponse.retrieve(UserRequest.java:310)
		at hudson.remoting.Channel.call(Channel.java:908)
		at hudson.remoting.RemoteInvocationHandler.invoke(RemoteInvocationHandler.java:281)
		at com.sun.proxy.$Proxy110.setRemoteUrl(Unknown Source)
		at org.jenkinsci.plugins.gitclient.RemoteGitImpl.setRemoteUrl(RemoteGitImpl.java:295)
		at hudson.plugins.git.GitSCM.fetchFrom(GitSCM.java:813)
		at hudson.plugins.git.GitSCM.retrieveChanges(GitSCM.java:1092)
		at hudson.plugins.git.GitSCM.checkout(GitSCM.java:1123)
		at hudson.scm.SCM.checkout(SCM.java:495)
		at hudson.model.AbstractProject.checkout(AbstractProject.java:1202)
		at hudson.model.AbstractBuild$AbstractBuildExecution.defaultCheckout(AbstractBuild.java:574)
		at jenkins.scm.SCMCheckoutStrategy.checkout(SCMCheckoutStrategy.java:86)
		at hudson.model.AbstractBuild$AbstractBuildExecution.run(AbstractBuild.java:499)
		at hudson.model.Run.execute(Run.java:1724)
		at hudson.maven.MavenModuleSetBuild.run(MavenModuleSetBuild.java:543)
		at hudson.model.ResourceController.execute(ResourceController.java:97)
		at hudson.model.Executor.run(Executor.java:421)
ERROR: Error fetching remote repo 'origin'
Retrying after 10 seconds
 > git rev-parse --is-inside-work-tree # timeout=10
Fetching changes from the remote Git repository
 > git config remote.origin.url https://git-wip-us.apache.org/repos/asf/directory-kerby.git # timeout=10
ERROR: Error fetching remote repo 'origin'
hudson.plugins.git.GitException: Failed to fetch from https://git-wip-us.apache.org/repos/asf/directory-kerby.git
	at hudson.plugins.git.GitSCM.fetchFrom(GitSCM.java:825)
	at hudson.plugins.git.GitSCM.retrieveChanges(GitSCM.java:1092)
	at hudson.plugins.git.GitSCM.checkout(GitSCM.java:1123)
	at hudson.scm.SCM.checkout(SCM.java:495)
	at hudson.model.AbstractProject.checkout(AbstractProject.java:1202)
	at hudson.model.AbstractBuild$AbstractBuildExecution.defaultCheckout(AbstractBuild.java:574)
	at jenkins.scm.SCMCheckoutStrategy.checkout(SCMCheckoutStrategy.java:86)
	at hudson.model.AbstractBuild$AbstractBuildExecution.run(AbstractBuild.java:499)
	at hudson.model.Run.execute(Run.java:1724)
	at hudson.maven.MavenModuleSetBuild.run(MavenModuleSetBuild.java:543)
	at hudson.model.ResourceController.execute(ResourceController.java:97)
	at hudson.model.Executor.run(Executor.java:421)
Caused by: hudson.plugins.git.GitException: Command "git config remote.origin.url https://git-wip-us.apache.org/repos/asf/directory-kerby.git" returned status code 4:
stdout: 
stderr: error: failed to write new configuration file <https://builds.apache.org/job/dir-kerby/ws/.git/config.lock>

	at org.jenkinsci.plugins.gitclient.CliGitAPIImpl.launchCommandIn(CliGitAPIImpl.java:1970)
	at org.jenkinsci.plugins.gitclient.CliGitAPIImpl.launchCommandIn(CliGitAPIImpl.java:1938)
	at org.jenkinsci.plugins.gitclient.CliGitAPIImpl.launchCommandIn(CliGitAPIImpl.java:1934)
	at org.jenkinsci.plugins.gitclient.CliGitAPIImpl.launchCommand(CliGitAPIImpl.java:1572)
	at org.jenkinsci.plugins.gitclient.CliGitAPIImpl.launchCommand(CliGitAPIImpl.java:1584)
	at org.jenkinsci.plugins.gitclient.CliGitAPIImpl.setRemoteUrl(CliGitAPIImpl.java:1218)
	at hudson.plugins.git.GitAPI.setRemoteUrl(GitAPI.java:160)
	at sun.reflect.GeneratedMethodAccessor43.invoke(Unknown Source)
	at sun.reflect.DelegatingMethodAccessorImpl.invoke(DelegatingMethodAccessorImpl.java:43)
	at java.lang.reflect.Method.invoke(Method.java:498)
	at hudson.remoting.RemoteInvocationHandler$RPCRequest.perform(RemoteInvocationHandler.java:922)
	at hudson.remoting.RemoteInvocationHandler$RPCRequest.call(RemoteInvocationHandler.java:896)
	at hudson.remoting.RemoteInvocationHandler$RPCRequest.call(RemoteInvocationHandler.java:853)
	at hudson.remoting.UserRequest.perform(UserRequest.java:207)
	at hudson.remoting.UserRequest.perform(UserRequest.java:53)
	at hudson.remoting.Request$2.run(Request.java:358)
	at hudson.remoting.InterceptingExecutorService$1.call(InterceptingExecutorService.java:72)
	at java.util.concurrent.FutureTask.run(FutureTask.java:266)
	at java.util.concurrent.ThreadPoolExecutor.runWorker(ThreadPoolExecutor.java:1142)
	at java.util.concurrent.ThreadPoolExecutor$Worker.run(ThreadPoolExecutor.java:617)
	at java.lang.Thread.run(Thread.java:748)
	Suppressed: hudson.remoting.Channel$CallSiteStackTrace: Remote call to H24
		at hudson.remoting.Channel.attachCallSiteStackTrace(Channel.java:1693)
		at hudson.remoting.UserResponse.retrieve(UserRequest.java:310)
		at hudson.remoting.Channel.call(Channel.java:908)
		at hudson.remoting.RemoteInvocationHandler.invoke(RemoteInvocationHandler.java:281)
		at com.sun.proxy.$Proxy110.setRemoteUrl(Unknown Source)
		at org.jenkinsci.plugins.gitclient.RemoteGitImpl.setRemoteUrl(RemoteGitImpl.java:295)
		at hudson.plugins.git.GitSCM.fetchFrom(GitSCM.java:813)
		at hudson.plugins.git.GitSCM.retrieveChanges(GitSCM.java:1092)
		at hudson.plugins.git.GitSCM.checkout(GitSCM.java:1123)
		at hudson.scm.SCM.checkout(SCM.java:495)
		at hudson.model.AbstractProject.checkout(AbstractProject.java:1202)
		at hudson.model.AbstractBuild$AbstractBuildExecution.defaultCheckout(AbstractBuild.java:574)
		at jenkins.scm.SCMCheckoutStrategy.checkout(SCMCheckoutStrategy.java:86)
		at hudson.model.AbstractBuild$AbstractBuildExecution.run(AbstractBuild.java:499)
		at hudson.model.Run.execute(Run.java:1724)
		at hudson.maven.MavenModuleSetBuild.run(MavenModuleSetBuild.java:543)
		at hudson.model.ResourceController.execute(ResourceController.java:97)
		at hudson.model.Executor.run(Executor.java:421)
ERROR: Error fetching remote repo 'origin'


Build failed in Jenkins: dir-kerby #452

Posted by Apache Jenkins Server <je...@builds.apache.org>.
See <https://builds.apache.org/job/dir-kerby/452/display/redirect?page=changes>

Changes:

[zenglinx] DIRKRB-678 Implement MySQL identity backend for KDC server.

------------------------------------------
Started by an SCM change
[EnvInject] - Loading node environment variables.
Building remotely on H27 (ubuntu xenial) in workspace <https://builds.apache.org/job/dir-kerby/ws/>
 > git rev-parse --is-inside-work-tree # timeout=10
Fetching changes from the remote Git repository
 > git config remote.origin.url https://git-wip-us.apache.org/repos/asf/directory-kerby.git # timeout=10
Fetching upstream changes from https://git-wip-us.apache.org/repos/asf/directory-kerby.git
 > git --version # timeout=10
 > git fetch --tags --progress https://git-wip-us.apache.org/repos/asf/directory-kerby.git +refs/heads/*:refs/remotes/origin/*
 > git rev-parse refs/remotes/origin/trunk^{commit} # timeout=10
 > git rev-parse refs/remotes/origin/origin/trunk^{commit} # timeout=10
Checking out Revision 11089e86940723fb2ca5850504b93814b4e794ad (refs/remotes/origin/trunk)
 > git config core.sparsecheckout # timeout=10
 > git checkout -f 11089e86940723fb2ca5850504b93814b4e794ad
Commit message: "DIRKRB-678 Implement MySQL identity backend for KDC server."
 > git rev-list 7b30a96ee798cb74ef8f797754b297db59ce2f70 # timeout=10
Parsing POMs
Discovered a new module org.apache.kerby:mysql-backend MySQL identity backend
Modules changed, recalculating dependency graph
Established TCP socket on 37723
maven33-agent.jar already up to date
maven33-interceptor.jar already up to date
maven3-interceptor-commons.jar already up to date
[dir-kerby] $ /home/jenkins/tools/java/latest1.7/bin/java -Xmx512m -XX:MaxPermSize=128m -cp /home/jenkins/jenkins-slave/maven33-agent.jar:/home/jenkins/tools/maven/apache-maven-3.3.9/boot/plexus-classworlds-2.5.2.jar:/home/jenkins/tools/maven/apache-maven-3.3.9/conf/logging jenkins.maven3.agent.Maven33Main /home/jenkins/tools/maven/apache-maven-3.3.9 /home/jenkins/jenkins-slave/slave.jar /home/jenkins/jenkins-slave/maven33-interceptor.jar /home/jenkins/jenkins-slave/maven3-interceptor-commons.jar 37723
Exception in thread "main" java.lang.UnsupportedClassVersionError: hudson/remoting/Launcher : Unsupported major.minor version 52.0
	at java.lang.ClassLoader.defineClass1(Native Method)
	at java.lang.ClassLoader.defineClass(ClassLoader.java:800)
	at java.security.SecureClassLoader.defineClass(SecureClassLoader.java:142)
	at java.net.URLClassLoader.defineClass(URLClassLoader.java:449)
	at java.net.URLClassLoader.access$100(URLClassLoader.java:71)
	at java.net.URLClassLoader$1.run(URLClassLoader.java:361)
	at java.net.URLClassLoader$1.run(URLClassLoader.java:355)
	at java.security.AccessController.doPrivileged(Native Method)
	at java.net.URLClassLoader.findClass(URLClassLoader.java:354)
	at org.codehaus.plexus.classworlds.realm.ClassRealm.loadClassFromSelf(ClassRealm.java:401)
	at org.codehaus.plexus.classworlds.strategy.SelfFirstStrategy.loadClass(SelfFirstStrategy.java:42)
	at org.codehaus.plexus.classworlds.realm.ClassRealm.unsynchronizedLoadClass(ClassRealm.java:271)
	at org.codehaus.plexus.classworlds.realm.ClassRealm.loadClass(ClassRealm.java:247)
	at org.codehaus.plexus.classworlds.realm.ClassRealm.loadClass(ClassRealm.java:239)
	at jenkins.maven3.agent.Maven33Main.main(Maven33Main.java:133)
	at jenkins.maven3.agent.Maven33Main.main(Maven33Main.java:64)
ERROR: Failed to parse POMs
java.io.EOFException: unexpected stream termination
	at hudson.remoting.ChannelBuilder.negotiate(ChannelBuilder.java:408)
	at hudson.remoting.ChannelBuilder.build(ChannelBuilder.java:353)
	at hudson.slaves.Channels.forProcess(Channels.java:115)
	at hudson.maven.AbstractMavenProcessFactory.newProcess(AbstractMavenProcessFactory.java:294)
	at hudson.maven.ProcessCache.get(ProcessCache.java:236)
	at hudson.maven.MavenModuleSetBuild$MavenModuleSetBuildExecution.doRun(MavenModuleSetBuild.java:804)
	at hudson.model.AbstractBuild$AbstractBuildExecution.run(AbstractBuild.java:504)
	at hudson.model.Run.execute(Run.java:1724)
	at hudson.maven.MavenModuleSetBuild.run(MavenModuleSetBuild.java:543)
	at hudson.model.ResourceController.execute(ResourceController.java:97)
	at hudson.model.Executor.run(Executor.java:421)

Build failed in Jenkins: dir-kerby #451

Posted by Apache Jenkins Server <je...@builds.apache.org>.
See <https://builds.apache.org/job/dir-kerby/451/display/redirect>

------------------------------------------
Started by timer
[EnvInject] - Loading node environment variables.
Building remotely on H27 (ubuntu xenial) in workspace <https://builds.apache.org/job/dir-kerby/ws/>
 > git rev-parse --is-inside-work-tree # timeout=10
Fetching changes from the remote Git repository
 > git config remote.origin.url https://git-wip-us.apache.org/repos/asf/directory-kerby.git # timeout=10
Fetching upstream changes from https://git-wip-us.apache.org/repos/asf/directory-kerby.git
 > git --version # timeout=10
 > git fetch --tags --progress https://git-wip-us.apache.org/repos/asf/directory-kerby.git +refs/heads/*:refs/remotes/origin/*
 > git rev-parse refs/remotes/origin/trunk^{commit} # timeout=10
 > git rev-parse refs/remotes/origin/origin/trunk^{commit} # timeout=10
Checking out Revision 7b30a96ee798cb74ef8f797754b297db59ce2f70 (refs/remotes/origin/trunk)
 > git config core.sparsecheckout # timeout=10
 > git checkout -f 7b30a96ee798cb74ef8f797754b297db59ce2f70
Commit message: "Fixing a few typos"
 > git rev-list 7b30a96ee798cb74ef8f797754b297db59ce2f70 # timeout=10
Parsing POMs
Modules changed, recalculating dependency graph
Established TCP socket on 38407
maven33-agent.jar already up to date
maven33-interceptor.jar already up to date
maven3-interceptor-commons.jar already up to date
[dir-kerby] $ /home/jenkins/tools/java/latest1.7/bin/java -Xmx512m -XX:MaxPermSize=128m -cp /home/jenkins/jenkins-slave/maven33-agent.jar:/home/jenkins/tools/maven/apache-maven-3.3.9/boot/plexus-classworlds-2.5.2.jar:/home/jenkins/tools/maven/apache-maven-3.3.9/conf/logging jenkins.maven3.agent.Maven33Main /home/jenkins/tools/maven/apache-maven-3.3.9 /home/jenkins/jenkins-slave/slave.jar /home/jenkins/jenkins-slave/maven33-interceptor.jar /home/jenkins/jenkins-slave/maven3-interceptor-commons.jar 38407
Exception in thread "main" java.lang.UnsupportedClassVersionError: hudson/remoting/Launcher : Unsupported major.minor version 52.0
	at java.lang.ClassLoader.defineClass1(Native Method)
	at java.lang.ClassLoader.defineClass(ClassLoader.java:800)
	at java.security.SecureClassLoader.defineClass(SecureClassLoader.java:142)
	at java.net.URLClassLoader.defineClass(URLClassLoader.java:449)
	at java.net.URLClassLoader.access$100(URLClassLoader.java:71)
	at java.net.URLClassLoader$1.run(URLClassLoader.java:361)
	at java.net.URLClassLoader$1.run(URLClassLoader.java:355)
	at java.security.AccessController.doPrivileged(Native Method)
	at java.net.URLClassLoader.findClass(URLClassLoader.java:354)
	at org.codehaus.plexus.classworlds.realm.ClassRealm.loadClassFromSelf(ClassRealm.java:401)
	at org.codehaus.plexus.classworlds.strategy.SelfFirstStrategy.loadClass(SelfFirstStrategy.java:42)
	at org.codehaus.plexus.classworlds.realm.ClassRealm.unsynchronizedLoadClass(ClassRealm.java:271)
	at org.codehaus.plexus.classworlds.realm.ClassRealm.loadClass(ClassRealm.java:247)
	at org.codehaus.plexus.classworlds.realm.ClassRealm.loadClass(ClassRealm.java:239)
	at jenkins.maven3.agent.Maven33Main.main(Maven33Main.java:133)
	at jenkins.maven3.agent.Maven33Main.main(Maven33Main.java:64)
ERROR: Failed to parse POMs
java.io.EOFException: unexpected stream termination
	at hudson.remoting.ChannelBuilder.negotiate(ChannelBuilder.java:408)
	at hudson.remoting.ChannelBuilder.build(ChannelBuilder.java:353)
	at hudson.slaves.Channels.forProcess(Channels.java:115)
	at hudson.maven.AbstractMavenProcessFactory.newProcess(AbstractMavenProcessFactory.java:294)
	at hudson.maven.ProcessCache.get(ProcessCache.java:236)
	at hudson.maven.MavenModuleSetBuild$MavenModuleSetBuildExecution.doRun(MavenModuleSetBuild.java:804)
	at hudson.model.AbstractBuild$AbstractBuildExecution.run(AbstractBuild.java:504)
	at hudson.model.Run.execute(Run.java:1724)
	at hudson.maven.MavenModuleSetBuild.run(MavenModuleSetBuild.java:543)
	at hudson.model.ResourceController.execute(ResourceController.java:97)
	at hudson.model.Executor.run(Executor.java:421)

Build failed in Jenkins: dir-kerby #450

Posted by Apache Jenkins Server <je...@builds.apache.org>.
See <https://builds.apache.org/job/dir-kerby/450/display/redirect?page=changes>

Changes:

[coheigea] Fixing a few typos

------------------------------------------
Started by an SCM change
[EnvInject] - Loading node environment variables.
Building remotely on ubuntu-4 (ubuntu trusty) in workspace <https://builds.apache.org/job/dir-kerby/ws/>
Cloning the remote Git repository
Cloning repository https://git-wip-us.apache.org/repos/asf/directory-kerby.git
 > git init <https://builds.apache.org/job/dir-kerby/ws/> # timeout=10
Fetching upstream changes from https://git-wip-us.apache.org/repos/asf/directory-kerby.git
 > git --version # timeout=10
 > git fetch --tags --progress https://git-wip-us.apache.org/repos/asf/directory-kerby.git +refs/heads/*:refs/remotes/origin/*
 > git config remote.origin.url https://git-wip-us.apache.org/repos/asf/directory-kerby.git # timeout=10
 > git config --add remote.origin.fetch +refs/heads/*:refs/remotes/origin/* # timeout=10
 > git config remote.origin.url https://git-wip-us.apache.org/repos/asf/directory-kerby.git # timeout=10
Fetching upstream changes from https://git-wip-us.apache.org/repos/asf/directory-kerby.git
 > git fetch --tags --progress https://git-wip-us.apache.org/repos/asf/directory-kerby.git +refs/heads/*:refs/remotes/origin/*
 > git rev-parse refs/remotes/origin/trunk^{commit} # timeout=10
 > git rev-parse refs/remotes/origin/origin/trunk^{commit} # timeout=10
Checking out Revision 7b30a96ee798cb74ef8f797754b297db59ce2f70 (refs/remotes/origin/trunk)
 > git config core.sparsecheckout # timeout=10
 > git checkout -f 7b30a96ee798cb74ef8f797754b297db59ce2f70
Commit message: "Fixing a few typos"
 > git rev-list 5c613f3068777c13d175c0ba7978056ddc3549e9 # timeout=10
Parsing POMs
Modules changed, recalculating dependency graph
Established TCP socket on 60012
maven33-agent.jar already up to date
maven33-interceptor.jar already up to date
maven3-interceptor-commons.jar already up to date
[dir-kerby] $ /home/jenkins/tools/java/latest1.7/bin/java -Xmx512m -XX:MaxPermSize=128m -cp /home/jenkins/jenkins-slave/maven33-agent.jar:/home/jenkins/tools/maven/apache-maven-3.3.9/boot/plexus-classworlds-2.5.2.jar:/home/jenkins/tools/maven/apache-maven-3.3.9/conf/logging jenkins.maven3.agent.Maven33Main /home/jenkins/tools/maven/apache-maven-3.3.9 /home/jenkins/jenkins-slave/slave.jar /home/jenkins/jenkins-slave/maven33-interceptor.jar /home/jenkins/jenkins-slave/maven3-interceptor-commons.jar 60012
Exception in thread "main" java.lang.UnsupportedClassVersionError: hudson/remoting/Launcher : Unsupported major.minor version 52.0
	at java.lang.ClassLoader.defineClass1(Native Method)
	at java.lang.ClassLoader.defineClass(ClassLoader.java:800)
	at java.security.SecureClassLoader.defineClass(SecureClassLoader.java:142)
	at java.net.URLClassLoader.defineClass(URLClassLoader.java:449)
	at java.net.URLClassLoader.access$100(URLClassLoader.java:71)
	at java.net.URLClassLoader$1.run(URLClassLoader.java:361)
	at java.net.URLClassLoader$1.run(URLClassLoader.java:355)
	at java.security.AccessController.doPrivileged(Native Method)
	at java.net.URLClassLoader.findClass(URLClassLoader.java:354)
	at org.codehaus.plexus.classworlds.realm.ClassRealm.loadClassFromSelf(ClassRealm.java:401)
	at org.codehaus.plexus.classworlds.strategy.SelfFirstStrategy.loadClass(SelfFirstStrategy.java:42)
	at org.codehaus.plexus.classworlds.realm.ClassRealm.unsynchronizedLoadClass(ClassRealm.java:271)
	at org.codehaus.plexus.classworlds.realm.ClassRealm.loadClass(ClassRealm.java:247)
	at org.codehaus.plexus.classworlds.realm.ClassRealm.loadClass(ClassRealm.java:239)
	at jenkins.maven3.agent.Maven33Main.main(Maven33Main.java:133)
	at jenkins.maven3.agent.Maven33Main.main(Maven33Main.java:64)
ERROR: Failed to parse POMs
java.io.EOFException: unexpected stream termination
	at hudson.remoting.ChannelBuilder.negotiate(ChannelBuilder.java:408)
	at hudson.remoting.ChannelBuilder.build(ChannelBuilder.java:353)
	at hudson.slaves.Channels.forProcess(Channels.java:115)
	at hudson.maven.AbstractMavenProcessFactory.newProcess(AbstractMavenProcessFactory.java:294)
	at hudson.maven.ProcessCache.get(ProcessCache.java:236)
	at hudson.maven.MavenModuleSetBuild$MavenModuleSetBuildExecution.doRun(MavenModuleSetBuild.java:804)
	at hudson.model.AbstractBuild$AbstractBuildExecution.run(AbstractBuild.java:504)
	at hudson.model.Run.execute(Run.java:1724)
	at hudson.maven.MavenModuleSetBuild.run(MavenModuleSetBuild.java:543)
	at hudson.model.ResourceController.execute(ResourceController.java:97)
	at hudson.model.Executor.run(Executor.java:421)

Build failed in Jenkins: dir-kerby #449

Posted by Apache Jenkins Server <je...@builds.apache.org>.
See <https://builds.apache.org/job/dir-kerby/449/display/redirect?page=changes>

Changes:

[coheigea] DIRKRB-683 - Support "-q" (query) option for the Kadmin script

------------------------------------------
Started by an SCM change
[EnvInject] - Loading node environment variables.
Building remotely on H24 (ubuntu xenial) in workspace <https://builds.apache.org/job/dir-kerby/ws/>
 > git rev-parse --is-inside-work-tree # timeout=10
Fetching changes from the remote Git repository
 > git config remote.origin.url https://git-wip-us.apache.org/repos/asf/directory-kerby.git # timeout=10
Fetching upstream changes from https://git-wip-us.apache.org/repos/asf/directory-kerby.git
 > git --version # timeout=10
 > git fetch --tags --progress https://git-wip-us.apache.org/repos/asf/directory-kerby.git +refs/heads/*:refs/remotes/origin/*
 > git rev-parse refs/remotes/origin/trunk^{commit} # timeout=10
 > git rev-parse refs/remotes/origin/origin/trunk^{commit} # timeout=10
Checking out Revision 5c613f3068777c13d175c0ba7978056ddc3549e9 (refs/remotes/origin/trunk)
 > git config core.sparsecheckout # timeout=10
 > git checkout -f 5c613f3068777c13d175c0ba7978056ddc3549e9
Commit message: "DIRKRB-683 - Support "-q" (query) option for the Kadmin script"
 > git rev-list ec9de35b7d0f0664a10289c0ce1716a10ac3a078 # timeout=10
Parsing POMs
Modules changed, recalculating dependency graph
Established TCP socket on 40712
maven33-agent.jar already up to date
maven33-interceptor.jar already up to date
maven3-interceptor-commons.jar already up to date
[dir-kerby] $ /home/jenkins/tools/java/latest1.7/bin/java -Xmx512m -XX:MaxPermSize=128m -cp /home/jenkins/jenkins-slave/maven33-agent.jar:/home/jenkins/tools/maven/apache-maven-3.3.9/boot/plexus-classworlds-2.5.2.jar:/home/jenkins/tools/maven/apache-maven-3.3.9/conf/logging jenkins.maven3.agent.Maven33Main /home/jenkins/tools/maven/apache-maven-3.3.9 /home/jenkins/jenkins-slave/slave.jar /home/jenkins/jenkins-slave/maven33-interceptor.jar /home/jenkins/jenkins-slave/maven3-interceptor-commons.jar 40712
Exception in thread "main" java.lang.UnsupportedClassVersionError: hudson/remoting/Launcher : Unsupported major.minor version 52.0
	at java.lang.ClassLoader.defineClass1(Native Method)
	at java.lang.ClassLoader.defineClass(ClassLoader.java:800)
	at java.security.SecureClassLoader.defineClass(SecureClassLoader.java:142)
	at java.net.URLClassLoader.defineClass(URLClassLoader.java:449)
	at java.net.URLClassLoader.access$100(URLClassLoader.java:71)
	at java.net.URLClassLoader$1.run(URLClassLoader.java:361)
	at java.net.URLClassLoader$1.run(URLClassLoader.java:355)
	at java.security.AccessController.doPrivileged(Native Method)
	at java.net.URLClassLoader.findClass(URLClassLoader.java:354)
	at org.codehaus.plexus.classworlds.realm.ClassRealm.loadClassFromSelf(ClassRealm.java:401)
	at org.codehaus.plexus.classworlds.strategy.SelfFirstStrategy.loadClass(SelfFirstStrategy.java:42)
	at org.codehaus.plexus.classworlds.realm.ClassRealm.unsynchronizedLoadClass(ClassRealm.java:271)
	at org.codehaus.plexus.classworlds.realm.ClassRealm.loadClass(ClassRealm.java:247)
	at org.codehaus.plexus.classworlds.realm.ClassRealm.loadClass(ClassRealm.java:239)
	at jenkins.maven3.agent.Maven33Main.main(Maven33Main.java:133)
	at jenkins.maven3.agent.Maven33Main.main(Maven33Main.java:64)
ERROR: Failed to parse POMs
java.io.EOFException: unexpected stream termination
	at hudson.remoting.ChannelBuilder.negotiate(ChannelBuilder.java:408)
	at hudson.remoting.ChannelBuilder.build(ChannelBuilder.java:353)
	at hudson.slaves.Channels.forProcess(Channels.java:115)
	at hudson.maven.AbstractMavenProcessFactory.newProcess(AbstractMavenProcessFactory.java:294)
	at hudson.maven.ProcessCache.get(ProcessCache.java:236)
	at hudson.maven.MavenModuleSetBuild$MavenModuleSetBuildExecution.doRun(MavenModuleSetBuild.java:804)
	at hudson.model.AbstractBuild$AbstractBuildExecution.run(AbstractBuild.java:504)
	at hudson.model.Run.execute(Run.java:1724)
	at hudson.maven.MavenModuleSetBuild.run(MavenModuleSetBuild.java:543)
	at hudson.model.ResourceController.execute(ResourceController.java:97)
	at hudson.model.Executor.run(Executor.java:421)

Build failed in Jenkins: dir-kerby #448

Posted by Apache Jenkins Server <je...@builds.apache.org>.
See <https://builds.apache.org/job/dir-kerby/448/display/redirect>

------------------------------------------
Started by timer
[EnvInject] - Loading node environment variables.
Building remotely on H27 (ubuntu xenial) in workspace <https://builds.apache.org/job/dir-kerby/ws/>
 > git rev-parse --is-inside-work-tree # timeout=10
Fetching changes from the remote Git repository
 > git config remote.origin.url https://git-wip-us.apache.org/repos/asf/directory-kerby.git # timeout=10
Fetching upstream changes from https://git-wip-us.apache.org/repos/asf/directory-kerby.git
 > git --version # timeout=10
 > git fetch --tags --progress https://git-wip-us.apache.org/repos/asf/directory-kerby.git +refs/heads/*:refs/remotes/origin/*
 > git rev-parse refs/remotes/origin/trunk^{commit} # timeout=10
 > git rev-parse refs/remotes/origin/origin/trunk^{commit} # timeout=10
Checking out Revision ec9de35b7d0f0664a10289c0ce1716a10ac3a078 (refs/remotes/origin/trunk)
 > git config core.sparsecheckout # timeout=10
 > git checkout -f ec9de35b7d0f0664a10289c0ce1716a10ac3a078
Commit message: "Updating BouncyCastle"
 > git rev-list ec9de35b7d0f0664a10289c0ce1716a10ac3a078 # timeout=10
Parsing POMs
Modules changed, recalculating dependency graph
Established TCP socket on 41196
maven33-agent.jar already up to date
maven33-interceptor.jar already up to date
maven3-interceptor-commons.jar already up to date
[dir-kerby] $ /home/jenkins/tools/java/latest1.7/bin/java -Xmx512m -XX:MaxPermSize=128m -cp /home/jenkins/jenkins-slave/maven33-agent.jar:/home/jenkins/tools/maven/apache-maven-3.3.9/boot/plexus-classworlds-2.5.2.jar:/home/jenkins/tools/maven/apache-maven-3.3.9/conf/logging jenkins.maven3.agent.Maven33Main /home/jenkins/tools/maven/apache-maven-3.3.9 /home/jenkins/jenkins-slave/slave.jar /home/jenkins/jenkins-slave/maven33-interceptor.jar /home/jenkins/jenkins-slave/maven3-interceptor-commons.jar 41196
Exception in thread "main" java.lang.UnsupportedClassVersionError: hudson/remoting/Launcher : Unsupported major.minor version 52.0
	at java.lang.ClassLoader.defineClass1(Native Method)
	at java.lang.ClassLoader.defineClass(ClassLoader.java:800)
	at java.security.SecureClassLoader.defineClass(SecureClassLoader.java:142)
	at java.net.URLClassLoader.defineClass(URLClassLoader.java:449)
	at java.net.URLClassLoader.access$100(URLClassLoader.java:71)
	at java.net.URLClassLoader$1.run(URLClassLoader.java:361)
	at java.net.URLClassLoader$1.run(URLClassLoader.java:355)
	at java.security.AccessController.doPrivileged(Native Method)
	at java.net.URLClassLoader.findClass(URLClassLoader.java:354)
	at org.codehaus.plexus.classworlds.realm.ClassRealm.loadClassFromSelf(ClassRealm.java:401)
	at org.codehaus.plexus.classworlds.strategy.SelfFirstStrategy.loadClass(SelfFirstStrategy.java:42)
	at org.codehaus.plexus.classworlds.realm.ClassRealm.unsynchronizedLoadClass(ClassRealm.java:271)
	at org.codehaus.plexus.classworlds.realm.ClassRealm.loadClass(ClassRealm.java:247)
	at org.codehaus.plexus.classworlds.realm.ClassRealm.loadClass(ClassRealm.java:239)
	at jenkins.maven3.agent.Maven33Main.main(Maven33Main.java:133)
	at jenkins.maven3.agent.Maven33Main.main(Maven33Main.java:64)
ERROR: Failed to parse POMs
java.io.EOFException: unexpected stream termination
	at hudson.remoting.ChannelBuilder.negotiate(ChannelBuilder.java:408)
	at hudson.remoting.ChannelBuilder.build(ChannelBuilder.java:353)
	at hudson.slaves.Channels.forProcess(Channels.java:115)
	at hudson.maven.AbstractMavenProcessFactory.newProcess(AbstractMavenProcessFactory.java:294)
	at hudson.maven.ProcessCache.get(ProcessCache.java:236)
	at hudson.maven.MavenModuleSetBuild$MavenModuleSetBuildExecution.doRun(MavenModuleSetBuild.java:804)
	at hudson.model.AbstractBuild$AbstractBuildExecution.run(AbstractBuild.java:504)
	at hudson.model.Run.execute(Run.java:1724)
	at hudson.maven.MavenModuleSetBuild.run(MavenModuleSetBuild.java:543)
	at hudson.model.ResourceController.execute(ResourceController.java:97)
	at hudson.model.Executor.run(Executor.java:421)

Build failed in Jenkins: dir-kerby #447

Posted by Apache Jenkins Server <je...@builds.apache.org>.
See <https://builds.apache.org/job/dir-kerby/447/display/redirect?page=changes>

Changes:

[coheigea] Fixing build

[coheigea] Updating BouncyCastle

------------------------------------------
Started by an SCM change
Started by an SCM change
[EnvInject] - Loading node environment variables.
Building remotely on H24 (ubuntu xenial) in workspace <https://builds.apache.org/job/dir-kerby/ws/>
Cloning the remote Git repository
Cloning repository https://git-wip-us.apache.org/repos/asf/directory-kerby.git
 > git init <https://builds.apache.org/job/dir-kerby/ws/> # timeout=10
Fetching upstream changes from https://git-wip-us.apache.org/repos/asf/directory-kerby.git
 > git --version # timeout=10
 > git fetch --tags --progress https://git-wip-us.apache.org/repos/asf/directory-kerby.git +refs/heads/*:refs/remotes/origin/*
 > git config remote.origin.url https://git-wip-us.apache.org/repos/asf/directory-kerby.git # timeout=10
 > git config --add remote.origin.fetch +refs/heads/*:refs/remotes/origin/* # timeout=10
 > git config remote.origin.url https://git-wip-us.apache.org/repos/asf/directory-kerby.git # timeout=10
Fetching upstream changes from https://git-wip-us.apache.org/repos/asf/directory-kerby.git
 > git fetch --tags --progress https://git-wip-us.apache.org/repos/asf/directory-kerby.git +refs/heads/*:refs/remotes/origin/*
 > git rev-parse refs/remotes/origin/trunk^{commit} # timeout=10
 > git rev-parse refs/remotes/origin/origin/trunk^{commit} # timeout=10
Checking out Revision ec9de35b7d0f0664a10289c0ce1716a10ac3a078 (refs/remotes/origin/trunk)
 > git config core.sparsecheckout # timeout=10
 > git checkout -f ec9de35b7d0f0664a10289c0ce1716a10ac3a078
Commit message: "Updating BouncyCastle"
 > git rev-list 4410adf91b406013f11ab87c7ce31b2ca34a7c8a # timeout=10
Parsing POMs
Modules changed, recalculating dependency graph
Established TCP socket on 35287
maven33-agent.jar already up to date
maven33-interceptor.jar already up to date
maven3-interceptor-commons.jar already up to date
[dir-kerby] $ /home/jenkins/tools/java/latest1.7/bin/java -Xmx512m -XX:MaxPermSize=128m -cp /home/jenkins/jenkins-slave/maven33-agent.jar:/home/jenkins/tools/maven/apache-maven-3.3.9/boot/plexus-classworlds-2.5.2.jar:/home/jenkins/tools/maven/apache-maven-3.3.9/conf/logging jenkins.maven3.agent.Maven33Main /home/jenkins/tools/maven/apache-maven-3.3.9 /home/jenkins/jenkins-slave/slave.jar /home/jenkins/jenkins-slave/maven33-interceptor.jar /home/jenkins/jenkins-slave/maven3-interceptor-commons.jar 35287
Exception in thread "main" java.lang.UnsupportedClassVersionError: hudson/remoting/Launcher : Unsupported major.minor version 52.0
	at java.lang.ClassLoader.defineClass1(Native Method)
	at java.lang.ClassLoader.defineClass(ClassLoader.java:800)
	at java.security.SecureClassLoader.defineClass(SecureClassLoader.java:142)
	at java.net.URLClassLoader.defineClass(URLClassLoader.java:449)
	at java.net.URLClassLoader.access$100(URLClassLoader.java:71)
	at java.net.URLClassLoader$1.run(URLClassLoader.java:361)
	at java.net.URLClassLoader$1.run(URLClassLoader.java:355)
	at java.security.AccessController.doPrivileged(Native Method)
	at java.net.URLClassLoader.findClass(URLClassLoader.java:354)
	at org.codehaus.plexus.classworlds.realm.ClassRealm.loadClassFromSelf(ClassRealm.java:401)
	at org.codehaus.plexus.classworlds.strategy.SelfFirstStrategy.loadClass(SelfFirstStrategy.java:42)
	at org.codehaus.plexus.classworlds.realm.ClassRealm.unsynchronizedLoadClass(ClassRealm.java:271)
	at org.codehaus.plexus.classworlds.realm.ClassRealm.loadClass(ClassRealm.java:247)
	at org.codehaus.plexus.classworlds.realm.ClassRealm.loadClass(ClassRealm.java:239)
	at jenkins.maven3.agent.Maven33Main.main(Maven33Main.java:133)
	at jenkins.maven3.agent.Maven33Main.main(Maven33Main.java:64)
ERROR: Failed to parse POMs
java.io.EOFException: unexpected stream termination
	at hudson.remoting.ChannelBuilder.negotiate(ChannelBuilder.java:408)
	at hudson.remoting.ChannelBuilder.build(ChannelBuilder.java:353)
	at hudson.slaves.Channels.forProcess(Channels.java:115)
	at hudson.maven.AbstractMavenProcessFactory.newProcess(AbstractMavenProcessFactory.java:294)
	at hudson.maven.ProcessCache.get(ProcessCache.java:236)
	at hudson.maven.MavenModuleSetBuild$MavenModuleSetBuildExecution.doRun(MavenModuleSetBuild.java:804)
	at hudson.model.AbstractBuild$AbstractBuildExecution.run(AbstractBuild.java:504)
	at hudson.model.Run.execute(Run.java:1724)
	at hudson.maven.MavenModuleSetBuild.run(MavenModuleSetBuild.java:543)
	at hudson.model.ResourceController.execute(ResourceController.java:97)
	at hudson.model.Executor.run(Executor.java:421)

Build failed in Jenkins: dir-kerby #446

Posted by Apache Jenkins Server <je...@builds.apache.org>.
See <https://builds.apache.org/job/dir-kerby/446/display/redirect?page=changes>

Changes:

[plusplusjiajia] DIRKRB-676 Add new authentication mechanism Kerberos-based token

------------------------------------------
Started by an SCM change
[EnvInject] - Loading node environment variables.
Building remotely on H34 (ubuntu xenial) in workspace <https://builds.apache.org/job/dir-kerby/ws/>
 > git rev-parse --is-inside-work-tree # timeout=10
Fetching changes from the remote Git repository
 > git config remote.origin.url https://git-wip-us.apache.org/repos/asf/directory-kerby.git # timeout=10
Fetching upstream changes from https://git-wip-us.apache.org/repos/asf/directory-kerby.git
 > git --version # timeout=10
 > git fetch --tags --progress https://git-wip-us.apache.org/repos/asf/directory-kerby.git +refs/heads/*:refs/remotes/origin/*
 > git rev-parse refs/remotes/origin/trunk^{commit} # timeout=10
 > git rev-parse refs/remotes/origin/origin/trunk^{commit} # timeout=10
Checking out Revision 4410adf91b406013f11ab87c7ce31b2ca34a7c8a (refs/remotes/origin/trunk)
 > git config core.sparsecheckout # timeout=10
 > git checkout -f 4410adf91b406013f11ab87c7ce31b2ca34a7c8a
Commit message: "Merge remote-tracking branch 'asf/trunk' into trunk"
 > git rev-list 5a81d03fd69868d07a1db0f5e1081d4ee4535b49 # timeout=10
Parsing POMs
Modules changed, recalculating dependency graph
Established TCP socket on 34162
maven33-agent.jar already up to date
maven33-interceptor.jar already up to date
maven3-interceptor-commons.jar already up to date
[dir-kerby] $ /home/jenkins/tools/java/latest1.7/bin/java -Xmx512m -XX:MaxPermSize=128m -cp /home/jenkins/jenkins-slave/maven33-agent.jar:/home/jenkins/tools/maven/apache-maven-3.3.9/boot/plexus-classworlds-2.5.2.jar:/home/jenkins/tools/maven/apache-maven-3.3.9/conf/logging jenkins.maven3.agent.Maven33Main /home/jenkins/tools/maven/apache-maven-3.3.9 /home/jenkins/jenkins-slave/slave.jar /home/jenkins/jenkins-slave/maven33-interceptor.jar /home/jenkins/jenkins-slave/maven3-interceptor-commons.jar 34162
Exception in thread "main" java.lang.UnsupportedClassVersionError: hudson/remoting/Launcher : Unsupported major.minor version 52.0
	at java.lang.ClassLoader.defineClass1(Native Method)
	at java.lang.ClassLoader.defineClass(ClassLoader.java:800)
	at java.security.SecureClassLoader.defineClass(SecureClassLoader.java:142)
	at java.net.URLClassLoader.defineClass(URLClassLoader.java:449)
	at java.net.URLClassLoader.access$100(URLClassLoader.java:71)
	at java.net.URLClassLoader$1.run(URLClassLoader.java:361)
	at java.net.URLClassLoader$1.run(URLClassLoader.java:355)
	at java.security.AccessController.doPrivileged(Native Method)
	at java.net.URLClassLoader.findClass(URLClassLoader.java:354)
	at org.codehaus.plexus.classworlds.realm.ClassRealm.loadClassFromSelf(ClassRealm.java:401)
	at org.codehaus.plexus.classworlds.strategy.SelfFirstStrategy.loadClass(SelfFirstStrategy.java:42)
	at org.codehaus.plexus.classworlds.realm.ClassRealm.unsynchronizedLoadClass(ClassRealm.java:271)
	at org.codehaus.plexus.classworlds.realm.ClassRealm.loadClass(ClassRealm.java:247)
	at org.codehaus.plexus.classworlds.realm.ClassRealm.loadClass(ClassRealm.java:239)
	at jenkins.maven3.agent.Maven33Main.main(Maven33Main.java:133)
	at jenkins.maven3.agent.Maven33Main.main(Maven33Main.java:64)
ERROR: Failed to parse POMs
java.io.EOFException: unexpected stream termination
	at hudson.remoting.ChannelBuilder.negotiate(ChannelBuilder.java:408)
	at hudson.remoting.ChannelBuilder.build(ChannelBuilder.java:353)
	at hudson.slaves.Channels.forProcess(Channels.java:115)
	at hudson.maven.AbstractMavenProcessFactory.newProcess(AbstractMavenProcessFactory.java:294)
	at hudson.maven.ProcessCache.get(ProcessCache.java:236)
	at hudson.maven.MavenModuleSetBuild$MavenModuleSetBuildExecution.doRun(MavenModuleSetBuild.java:804)
	at hudson.model.AbstractBuild$AbstractBuildExecution.run(AbstractBuild.java:504)
	at hudson.model.Run.execute(Run.java:1724)
	at hudson.maven.MavenModuleSetBuild.run(MavenModuleSetBuild.java:543)
	at hudson.model.ResourceController.execute(ResourceController.java:97)
	at hudson.model.Executor.run(Executor.java:421)

Build failed in Jenkins: dir-kerby #445

Posted by Apache Jenkins Server <je...@builds.apache.org>.
See <https://builds.apache.org/job/dir-kerby/445/display/redirect>

------------------------------------------
Started by timer
[EnvInject] - Loading node environment variables.
Building remotely on H27 (ubuntu xenial) in workspace <https://builds.apache.org/job/dir-kerby/ws/>
 > git rev-parse --is-inside-work-tree # timeout=10
Fetching changes from the remote Git repository
 > git config remote.origin.url https://git-wip-us.apache.org/repos/asf/directory-kerby.git # timeout=10
Fetching upstream changes from https://git-wip-us.apache.org/repos/asf/directory-kerby.git
 > git --version # timeout=10
 > git fetch --tags --progress https://git-wip-us.apache.org/repos/asf/directory-kerby.git +refs/heads/*:refs/remotes/origin/*
 > git rev-parse refs/remotes/origin/trunk^{commit} # timeout=10
 > git rev-parse refs/remotes/origin/origin/trunk^{commit} # timeout=10
Checking out Revision 5a81d03fd69868d07a1db0f5e1081d4ee4535b49 (refs/remotes/origin/trunk)
 > git config core.sparsecheckout # timeout=10
 > git checkout -f 5a81d03fd69868d07a1db0f5e1081d4ee4535b49
Commit message: "DIRKRB-682 Fix checksum verify in TgsRequest."
 > git rev-list 5a81d03fd69868d07a1db0f5e1081d4ee4535b49 # timeout=10
Parsing POMs
Modules changed, recalculating dependency graph
Established TCP socket on 35232
maven33-agent.jar already up to date
maven33-interceptor.jar already up to date
maven3-interceptor-commons.jar already up to date
[dir-kerby] $ /home/jenkins/tools/java/latest1.7/bin/java -Xmx512m -XX:MaxPermSize=128m -cp /home/jenkins/jenkins-slave/maven33-agent.jar:/home/jenkins/tools/maven/apache-maven-3.3.9/boot/plexus-classworlds-2.5.2.jar:/home/jenkins/tools/maven/apache-maven-3.3.9/conf/logging jenkins.maven3.agent.Maven33Main /home/jenkins/tools/maven/apache-maven-3.3.9 /home/jenkins/jenkins-slave/slave.jar /home/jenkins/jenkins-slave/maven33-interceptor.jar /home/jenkins/jenkins-slave/maven3-interceptor-commons.jar 35232
Exception in thread "main" java.lang.UnsupportedClassVersionError: hudson/remoting/Launcher : Unsupported major.minor version 52.0
	at java.lang.ClassLoader.defineClass1(Native Method)
	at java.lang.ClassLoader.defineClass(ClassLoader.java:800)
	at java.security.SecureClassLoader.defineClass(SecureClassLoader.java:142)
	at java.net.URLClassLoader.defineClass(URLClassLoader.java:449)
	at java.net.URLClassLoader.access$100(URLClassLoader.java:71)
	at java.net.URLClassLoader$1.run(URLClassLoader.java:361)
	at java.net.URLClassLoader$1.run(URLClassLoader.java:355)
	at java.security.AccessController.doPrivileged(Native Method)
	at java.net.URLClassLoader.findClass(URLClassLoader.java:354)
	at org.codehaus.plexus.classworlds.realm.ClassRealm.loadClassFromSelf(ClassRealm.java:401)
	at org.codehaus.plexus.classworlds.strategy.SelfFirstStrategy.loadClass(SelfFirstStrategy.java:42)
	at org.codehaus.plexus.classworlds.realm.ClassRealm.unsynchronizedLoadClass(ClassRealm.java:271)
	at org.codehaus.plexus.classworlds.realm.ClassRealm.loadClass(ClassRealm.java:247)
	at org.codehaus.plexus.classworlds.realm.ClassRealm.loadClass(ClassRealm.java:239)
	at jenkins.maven3.agent.Maven33Main.main(Maven33Main.java:133)
	at jenkins.maven3.agent.Maven33Main.main(Maven33Main.java:64)
ERROR: Failed to parse POMs
java.io.EOFException: unexpected stream termination
	at hudson.remoting.ChannelBuilder.negotiate(ChannelBuilder.java:408)
	at hudson.remoting.ChannelBuilder.build(ChannelBuilder.java:353)
	at hudson.slaves.Channels.forProcess(Channels.java:115)
	at hudson.maven.AbstractMavenProcessFactory.newProcess(AbstractMavenProcessFactory.java:294)
	at hudson.maven.ProcessCache.get(ProcessCache.java:236)
	at hudson.maven.MavenModuleSetBuild$MavenModuleSetBuildExecution.doRun(MavenModuleSetBuild.java:804)
	at hudson.model.AbstractBuild$AbstractBuildExecution.run(AbstractBuild.java:504)
	at hudson.model.Run.execute(Run.java:1724)
	at hudson.maven.MavenModuleSetBuild.run(MavenModuleSetBuild.java:543)
	at hudson.model.ResourceController.execute(ResourceController.java:97)
	at hudson.model.Executor.run(Executor.java:421)

Build failed in Jenkins: dir-kerby #444

Posted by Apache Jenkins Server <je...@builds.apache.org>.
See <https://builds.apache.org/job/dir-kerby/444/display/redirect?page=changes>

Changes:

[plusplusjiajia] DIRKRB-682 Fix checksum verify in TgsRequest.

------------------------------------------
[...truncated 1.06 MB...]
[JENKINS] Archiving disabled
[INFO]                                                                         
[INFO] ------------------------------------------------------------------------
[INFO] Building HAS project 1.1.1-SNAPSHOT
[INFO] ------------------------------------------------------------------------
[INFO] 
[INFO] --- maven-clean-plugin:3.0.0:clean (default-clean) @ has-project ---
[INFO] Deleting <https://builds.apache.org/job/dir-kerby/ws/has-project/target>
[INFO] 
[INFO] >>> maven-pmd-plugin:3.7:check (validate) > :pmd @ has-project >>>
[INFO] 
[INFO] --- maven-pmd-plugin:3.7:pmd (pmd) @ has-project ---
[INFO] 
[INFO] <<< maven-pmd-plugin:3.7:check (validate) < :pmd @ has-project <<<
[INFO] 
[INFO] --- maven-pmd-plugin:3.7:check (validate) @ has-project ---
[INFO] 
[INFO] --- maven-checkstyle-plugin:2.17:check (validate) @ has-project ---
[INFO] 
[INFO] --- maven-remote-resources-plugin:1.5:process (process-resource-bundles) @ has-project ---
[INFO] 
[INFO] --- maven-site-plugin:3.5.1:attach-descriptor (attach-descriptor) @ has-project ---
[INFO] 
[INFO] >>> maven-source-plugin:3.0.0:jar (attach-sources) > generate-sources @ has-project >>>
[INFO] 
[INFO] >>> maven-pmd-plugin:3.7:check (validate) > :pmd @ has-project >>>
[INFO] 
[INFO] --- maven-pmd-plugin:3.7:pmd (pmd) @ has-project ---
[INFO] 
[INFO] <<< maven-pmd-plugin:3.7:check (validate) < :pmd @ has-project <<<
[INFO] 
[INFO] --- maven-pmd-plugin:3.7:check (validate) @ has-project ---
[INFO] 
[INFO] --- maven-checkstyle-plugin:2.17:check (validate) @ has-project ---
[WARNING] Failed to getClass for org.apache.maven.plugins.source.SourceJarMojo
[INFO] 
[INFO] <<< maven-source-plugin:3.0.0:jar (attach-sources) < generate-sources @ has-project <<<
[INFO] 
[INFO] --- maven-source-plugin:3.0.0:jar (attach-sources) @ has-project ---
[INFO] 
[INFO] --- modernizer-maven-plugin:1.5.0:modernizer (modernizer-check) @ has-project ---
[INFO] 
[INFO] --- maven-install-plugin:2.5.2:install (default-install) @ has-project ---
[INFO] Installing <https://builds.apache.org/job/dir-kerby/ws/has-project/pom.xml> to /home/jenkins/jenkins-slave/maven-repositories/0/org/apache/kerby/has-project/1.1.1-SNAPSHOT/has-project-1.1.1-SNAPSHOT.pom
[INFO] 
[INFO] --- maven-deploy-plugin:2.8.2:deploy (default-deploy) @ has-project ---
[INFO] Downloading: https://repository.apache.org/content/repositories/snapshots/org/apache/kerby/has-project/1.1.1-SNAPSHOT/maven-metadata.xml
[INFO] Downloaded: https://repository.apache.org/content/repositories/snapshots/org/apache/kerby/has-project/1.1.1-SNAPSHOT/maven-metadata.xml (604 B at 1.2 KB/sec)
[INFO] Uploading: https://repository.apache.org/content/repositories/snapshots/org/apache/kerby/has-project/1.1.1-SNAPSHOT/has-project-1.1.1-20171227.080735-7.pom
[INFO] Uploaded: https://repository.apache.org/content/repositories/snapshots/org/apache/kerby/has-project/1.1.1-SNAPSHOT/has-project-1.1.1-20171227.080735-7.pom (670 B at 0.9 KB/sec)
[INFO] Downloading: https://repository.apache.org/content/repositories/snapshots/org/apache/kerby/has-project/maven-metadata.xml
[INFO] Downloaded: https://repository.apache.org/content/repositories/snapshots/org/apache/kerby/has-project/maven-metadata.xml (287 B at 0.6 KB/sec)
[INFO] Uploading: https://repository.apache.org/content/repositories/snapshots/org/apache/kerby/has-project/1.1.1-SNAPSHOT/maven-metadata.xml
[INFO] Uploaded: https://repository.apache.org/content/repositories/snapshots/org/apache/kerby/has-project/1.1.1-SNAPSHOT/maven-metadata.xml (604 B at 0.9 KB/sec)
[INFO] Uploading: https://repository.apache.org/content/repositories/snapshots/org/apache/kerby/has-project/maven-metadata.xml
[INFO] Uploaded: https://repository.apache.org/content/repositories/snapshots/org/apache/kerby/has-project/maven-metadata.xml (287 B at 0.4 KB/sec)
[JENKINS] Archiving disabled
[INFO]                                                                         
[INFO] ------------------------------------------------------------------------
[INFO] Building has-common 1.1.1-SNAPSHOT
[INFO] ------------------------------------------------------------------------
[INFO] Downloading: https://repo.maven.apache.org/maven2/org/apache/hadoop/hadoop-annotations/3.0.0/hadoop-annotations-3.0.0.pom
[INFO] Downloaded: https://repo.maven.apache.org/maven2/org/apache/hadoop/hadoop-annotations/3.0.0/hadoop-annotations-3.0.0.pom (3 KB at 24.5 KB/sec)
[INFO] Downloading: https://repo.maven.apache.org/maven2/org/apache/hadoop/hadoop-project/3.0.0/hadoop-project-3.0.0.pom
[INFO] Downloaded: https://repo.maven.apache.org/maven2/org/apache/hadoop/hadoop-project/3.0.0/hadoop-project-3.0.0.pom (62 KB at 2209.5 KB/sec)
[INFO] Downloading: https://repo.maven.apache.org/maven2/org/apache/hadoop/hadoop-main/3.0.0/hadoop-main-3.0.0.pom
[INFO] Downloaded: https://repo.maven.apache.org/maven2/org/apache/hadoop/hadoop-main/3.0.0/hadoop-main-3.0.0.pom (26 KB at 1390.3 KB/sec)
[INFO] Downloading: https://repo.maven.apache.org/maven2/org/apache/hadoop/hadoop-annotations/3.0.0/hadoop-annotations-3.0.0.jar
[INFO] Downloaded: https://repo.maven.apache.org/maven2/org/apache/hadoop/hadoop-annotations/3.0.0/hadoop-annotations-3.0.0.jar (59 KB at 2764.8 KB/sec)
[INFO] 
[INFO] --- maven-clean-plugin:3.0.0:clean (default-clean) @ has-common ---
[INFO] Deleting <https://builds.apache.org/job/dir-kerby/ws/has-project/has-common/target>
[INFO] 
[INFO] >>> maven-pmd-plugin:3.7:check (validate) > :pmd @ has-common >>>
[INFO] 
[INFO] --- maven-pmd-plugin:3.7:pmd (pmd) @ has-common ---
[INFO] 
[INFO] <<< maven-pmd-plugin:3.7:check (validate) < :pmd @ has-common <<<
[INFO] 
[INFO] --- maven-pmd-plugin:3.7:check (validate) @ has-common ---
[INFO] 
[INFO] 
[INFO] --- maven-checkstyle-plugin:2.17:check (validate) @ has-common ---
[INFO] 
[INFO] --- maven-remote-resources-plugin:1.5:process (process-resource-bundles) @ has-common ---
[INFO] 
[INFO] --- maven-resources-plugin:2.7:resources (default-resources) @ has-common ---
[INFO] Using 'UTF-8' encoding to copy filtered resources.
[INFO] skip non existing resourceDirectory <https://builds.apache.org/job/dir-kerby/ws/has-project/has-common/src/main/resources>
[INFO] Copying 3 resources
[INFO] 
[INFO] --- maven-compiler-plugin:3.6.2:compile (default-compile) @ has-common ---
[INFO] Changes detected - recompiling the module!
[INFO] Compiling 19 source files to <https://builds.apache.org/job/dir-kerby/ws/has-project/has-common/target/classes>
[INFO] 
[INFO] --- maven-resources-plugin:2.7:testResources (default-testResources) @ has-common ---
[INFO] Using 'UTF-8' encoding to copy filtered resources.
[INFO] skip non existing resourceDirectory <https://builds.apache.org/job/dir-kerby/ws/has-project/has-common/src/test/resources>
[INFO] Copying 3 resources
[INFO] 
[INFO] --- maven-compiler-plugin:3.6.2:testCompile (default-testCompile) @ has-common ---
[INFO] No sources to compile
[INFO] 
[INFO] --- maven-surefire-plugin:2.20.1:test (default-test) @ has-common ---
[INFO] 
[INFO] --- maven-surefire-plugin:2.20.1:test (default) @ has-common ---
[JENKINS] Recording test results
[INFO] Skipping execution of surefire because it has already been run for this configuration
[JENKINS] Recording test results
[INFO] 
[INFO] --- maven-jar-plugin:3.0.0:jar (default-jar) @ has-common ---
[INFO] Building jar: <https://builds.apache.org/job/dir-kerby/ws/has-project/has-common/target/has-common-1.1.1-SNAPSHOT.jar>
[INFO] 
[INFO] --- maven-site-plugin:3.5.1:attach-descriptor (attach-descriptor) @ has-common ---
[INFO] 
[INFO] >>> maven-source-plugin:3.0.0:jar (attach-sources) > generate-sources @ has-common >>>
[INFO] 
[INFO] >>> maven-pmd-plugin:3.7:check (validate) > :pmd @ has-common >>>
[INFO] 
[INFO] --- maven-pmd-plugin:3.7:pmd (pmd) @ has-common ---
[INFO] 
[INFO] <<< maven-pmd-plugin:3.7:check (validate) < :pmd @ has-common <<<
[INFO] 
[INFO] --- maven-pmd-plugin:3.7:check (validate) @ has-common ---
[INFO] 
[INFO] 
[INFO] --- maven-checkstyle-plugin:2.17:check (validate) @ has-common ---
[WARNING] Failed to getClass for org.apache.maven.plugins.source.SourceJarMojo
[INFO] 
[INFO] <<< maven-source-plugin:3.0.0:jar (attach-sources) < generate-sources @ has-common <<<
[INFO] 
[INFO] --- maven-source-plugin:3.0.0:jar (attach-sources) @ has-common ---
[INFO] Building jar: <https://builds.apache.org/job/dir-kerby/ws/has-project/has-common/target/has-common-1.1.1-SNAPSHOT-sources.jar>
[INFO] 
[INFO] --- modernizer-maven-plugin:1.5.0:modernizer (modernizer-check) @ has-common ---
[ERROR] <https://builds.apache.org/job/dir-kerby/ws/has-project/has-common/src/main/java/org/apache/kerby/has/common/spnego/AuthToken.java>:114: Prefer java.lang.StringBuilder
[ERROR] <https://builds.apache.org/job/dir-kerby/ws/has-project/has-common/src/main/java/org/apache/kerby/has/common/ssl/SSLHostnameVerifier$AbstractVerifier.java>:379: Prefer java.lang.StringBuilder
[ERROR] <https://builds.apache.org/job/dir-kerby/ws/has-project/has-common/src/main/java/org/apache/kerby/has/common/ssl/SSLHostnameVerifier$AbstractVerifier.java>:418: Prefer java.lang.StringBuilder
[JENKINS] Archiving disabled
[JENKINS] Archiving disabled
[JENKINS] Archiving disabled
[JENKINS] Archiving disabled
[JENKINS] Archiving disabled
[JENKINS] Archiving disabled
[JENKINS] Archiving disabled
[JENKINS] Archiving disabled
[JENKINS] Archiving disabled
[JENKINS] Archiving disabled
[JENKINS] Archiving disabled
[JENKINS] Archiving disabled
[JENKINS] Archiving disabled
[JENKINS] Archiving disabled
[JENKINS] Archiving disabled
[JENKINS] Archiving disabled
[JENKINS] Archiving disabled
[JENKINS] Archiving disabled
[JENKINS] Archiving disabled
[JENKINS] Archiving disabled
[JENKINS] Archiving disabled
[JENKINS] Archiving disabled
[JENKINS] Archiving disabled
[JENKINS] Archiving disabled
[JENKINS] Archiving disabled
[JENKINS] Archiving disabled
[JENKINS] Archiving disabled
[JENKINS] Archiving disabled
[JENKINS] Archiving disabled
[JENKINS] Archiving disabled
[JENKINS] Archiving disabled
[JENKINS] Archiving disabled
[JENKINS] Archiving disabled
[JENKINS] Archiving disabled
[JENKINS] Archiving disabled
[JENKINS] Archiving disabled
[JENKINS] Archiving disabled
[JENKINS] Archiving disabled
[JENKINS] Archiving disabled
[JENKINS] Archiving disabled
[JENKINS] Archiving disabled
[JENKINS] Archiving disabled
[JENKINS] Archiving disabled
[JENKINS] Archiving disabled
[JENKINS] Archiving disabled[INFO] ------------------------------------------------------------------------
[INFO] Reactor Summary:
[INFO] 

[INFO] Apache Kerby Project ............................... SUCCESS [ 13.214 s]
[INFO] Kerby-common Project ............................... SUCCESS [  7.606 s]
[INFO] Kerby ASN1 Project ................................. SUCCESS [01:23 min]
[INFO] Kerby Config ....................................... SUCCESS [ 17.703 s]
[INFO] Kerby Util ......................................... SUCCESS [ 17.782 s]
[INFO] Kerby XDR Project .................................. SUCCESS [ 21.160 s]
[INFO] Kerby PKIX Project ................................. SUCCESS [ 22.057 s]
[INFO] Kerby-kerb Project ................................. SUCCESS [  6.716 s]
[INFO] Kerby-kerb core .................................... SUCCESS [ 28.033 s]
[INFO] Kerby-kerb Crypto .................................. SUCCESS [ 32.447 s]
[INFO] Kerby-kerb Common .................................. SUCCESS [ 18.556 s]
[INFO] Kerby-kerb Util .................................... SUCCESS [ 22.406 s]
[INFO] Kerby-kerb Identity ................................ SUCCESS [ 12.663 s]
[INFO] Kerby-kerb Identity Test ........................... SUCCESS [ 12.525 s]
[INFO] Kerby providers .................................... SUCCESS [  7.357 s]
[INFO] Token provider ..................................... SUCCESS [ 17.282 s]
[INFO] Kerby-kerb Client .................................. SUCCESS [ 20.286 s]
[INFO] Kerby-kerb Server .................................. SUCCESS [ 17.375 s]
[INFO] Kerby-kerb Admin ................................... SUCCESS [ 15.670 s]
[INFO] Kerb Simple Kdc .................................... SUCCESS [ 15.056 s]
[INFO] Kerby-kerb server all .............................. SUCCESS [ 10.338 s]
[INFO] Kerby KDC Server ................................... SUCCESS [ 13.023 s]
[INFO] Kerb Kdc Test ...................................... SUCCESS [ 52.128 s]
[INFO] Kerby-kerb GssAPI .................................. SUCCESS [ 17.371 s]
[INFO] Kerb Integration Test .............................. SUCCESS [ 53.411 s]
[INFO] Kerby-kerb Admin Server ............................ SUCCESS [ 14.966 s]
[INFO] Kerby-kerb client api all .......................... SUCCESS [ 11.367 s]
[INFO] Kdc Tool Project ................................... SUCCESS [  8.366 s]
[INFO] Client Tool ........................................ SUCCESS [ 13.468 s]
[INFO] KDC Tool ........................................... SUCCESS [ 15.573 s]
[INFO] Kerby Backend ...................................... SUCCESS [  7.189 s]
[INFO] Json identity backend .............................. SUCCESS [ 16.084 s]
[INFO] Kerby Kdc Test ..................................... SUCCESS [ 56.168 s]
[INFO] Ldap identity backend .............................. SUCCESS [02:56 min]
[INFO] Mavibot based backend .............................. SUCCESS [ 17.697 s]
[INFO] Zookeeper identity backend ......................... SUCCESS [ 32.570 s]
[INFO] Kerby Distribution ................................. SUCCESS [  8.443 s]
[INFO] KDC Dist ........................................... SUCCESS [  7.849 s]
[INFO] Tool Dist .......................................... SUCCESS [  8.211 s]
[INFO] Kerby benchmark .................................... SUCCESS [ 14.022 s]
[INFO] HAS project ........................................ SUCCESS [  8.647 s]
[INFO] has-common ......................................... FAILURE [ 10.533 s]
[INFO] has-server ......................................... SKIPPED
[INFO] has-client ......................................... SKIPPED
[INFO] ------------------------------------------------------------------------
[INFO] BUILD FAILURE
[INFO] ------------------------------------------------------------------------
[INFO] Total time: 18:25 min
[INFO] Finished at: 2017-12-27T08:08:34+00:00
[INFO] Final Memory: 49M/455M
[INFO] ------------------------------------------------------------------------
Waiting for Jenkins to finish collecting data[ERROR] Failed to execute goal org.gaul:modernizer-maven-plugin:1.5.0:modernizer (modernizer-check) on project has-common: Found 3 violations -> [Help 1]
[ERROR] 
[ERROR] To see the full stack trace of the errors, re-run Maven with the -e switch.
[ERROR] Re-run Maven using the -X switch to enable full debug logging.
[ERROR] 
[ERROR] For more information about the errors and possible solutions, please read the following articles:
[ERROR] [Help 1] http://cwiki.apache.org/confluence/display/MAVEN/MojoExecutionException
[ERROR] 
[ERROR] After correcting the problems, you can resume the build with the command
[ERROR]   mvn <goals> -rf :has-common

channel stopped

Build failed in Jenkins: dir-kerby #443

Posted by Apache Jenkins Server <je...@builds.apache.org>.
See <https://builds.apache.org/job/dir-kerby/443/display/redirect?page=changes>

Changes:

[plusplusjiajia] DIRKRB-680 Add new authentication mechanism API

------------------------------------------
[...truncated 1.07 MB...]
[INFO] Downloaded: https://repository.apache.org/content/repositories/snapshots/org/apache/kerby/benchmark/maven-metadata.xml (389 B at 0.8 KB/sec)
[INFO] Uploading: https://repository.apache.org/content/repositories/snapshots/org/apache/kerby/benchmark/1.1.1-SNAPSHOT/maven-metadata.xml
[INFO] Uploaded: https://repository.apache.org/content/repositories/snapshots/org/apache/kerby/benchmark/1.1.1-SNAPSHOT/maven-metadata.xml (993 B at 1.4 KB/sec)
[INFO] Uploading: https://repository.apache.org/content/repositories/snapshots/org/apache/kerby/benchmark/maven-metadata.xml
[INFO] Uploaded: https://repository.apache.org/content/repositories/snapshots/org/apache/kerby/benchmark/maven-metadata.xml (389 B at 0.6 KB/sec)
[INFO] Uploading: https://repository.apache.org/content/repositories/snapshots/org/apache/kerby/benchmark/1.1.1-SNAPSHOT/benchmark-1.1.1-20171226.025841-19-sources.jar
[INFO] Uploaded: https://repository.apache.org/content/repositories/snapshots/org/apache/kerby/benchmark/1.1.1-SNAPSHOT/benchmark-1.1.1-20171226.025841-19-sources.jar (25 KB at 31.8 KB/sec)
[INFO] Uploading: https://repository.apache.org/content/repositories/snapshots/org/apache/kerby/benchmark/1.1.1-SNAPSHOT/maven-metadata.xml
[INFO] Uploaded: https://repository.apache.org/content/repositories/snapshots/org/apache/kerby/benchmark/1.1.1-SNAPSHOT/maven-metadata.xml (993 B at 1.4 KB/sec)
[JENKINS] Archiving disabled
[INFO]                                                                         
[INFO] ------------------------------------------------------------------------
[INFO] Building HAS project 1.1.1-SNAPSHOT
[INFO] ------------------------------------------------------------------------
[INFO] 
[INFO] --- maven-clean-plugin:3.0.0:clean (default-clean) @ has-project ---
[INFO] Deleting <https://builds.apache.org/job/dir-kerby/ws/has-project/target>
[INFO] 
[INFO] >>> maven-pmd-plugin:3.7:check (validate) > :pmd @ has-project >>>
[INFO] 
[INFO] --- maven-pmd-plugin:3.7:pmd (pmd) @ has-project ---
[INFO] 
[INFO] <<< maven-pmd-plugin:3.7:check (validate) < :pmd @ has-project <<<
[INFO] 
[INFO] --- maven-pmd-plugin:3.7:check (validate) @ has-project ---
[INFO] 
[INFO] --- maven-checkstyle-plugin:2.17:check (validate) @ has-project ---
[INFO] 
[INFO] --- maven-remote-resources-plugin:1.5:process (process-resource-bundles) @ has-project ---
[INFO] 
[INFO] --- maven-site-plugin:3.5.1:attach-descriptor (attach-descriptor) @ has-project ---
[INFO] 
[INFO] >>> maven-source-plugin:3.0.0:jar (attach-sources) > generate-sources @ has-project >>>
[INFO] 
[INFO] >>> maven-pmd-plugin:3.7:check (validate) > :pmd @ has-project >>>
[INFO] 
[INFO] --- maven-pmd-plugin:3.7:pmd (pmd) @ has-project ---
[INFO] 
[INFO] <<< maven-pmd-plugin:3.7:check (validate) < :pmd @ has-project <<<
[INFO] 
[INFO] --- maven-pmd-plugin:3.7:check (validate) @ has-project ---
[INFO] 
[INFO] --- maven-checkstyle-plugin:2.17:check (validate) @ has-project ---
[WARNING] Failed to getClass for org.apache.maven.plugins.source.SourceJarMojo
[INFO] 
[INFO] <<< maven-source-plugin:3.0.0:jar (attach-sources) < generate-sources @ has-project <<<
[INFO] 
[INFO] --- maven-source-plugin:3.0.0:jar (attach-sources) @ has-project ---
[INFO] 
[INFO] --- modernizer-maven-plugin:1.5.0:modernizer (modernizer-check) @ has-project ---
[INFO] 
[INFO] --- maven-install-plugin:2.5.2:install (default-install) @ has-project ---
[INFO] Installing <https://builds.apache.org/job/dir-kerby/ws/has-project/pom.xml> to /home/jenkins/jenkins-slave/maven-repositories/1/org/apache/kerby/has-project/1.1.1-SNAPSHOT/has-project-1.1.1-SNAPSHOT.pom
[INFO] 
[INFO] --- maven-deploy-plugin:2.8.2:deploy (default-deploy) @ has-project ---
[INFO] Downloading: https://repository.apache.org/content/repositories/snapshots/org/apache/kerby/has-project/1.1.1-SNAPSHOT/maven-metadata.xml
[INFO] Downloaded: https://repository.apache.org/content/repositories/snapshots/org/apache/kerby/has-project/1.1.1-SNAPSHOT/maven-metadata.xml (604 B at 1.3 KB/sec)
[INFO] Uploading: https://repository.apache.org/content/repositories/snapshots/org/apache/kerby/has-project/1.1.1-SNAPSHOT/has-project-1.1.1-20171226.025852-5.pom
[INFO] Uploaded: https://repository.apache.org/content/repositories/snapshots/org/apache/kerby/has-project/1.1.1-SNAPSHOT/has-project-1.1.1-20171226.025852-5.pom (670 B at 0.9 KB/sec)
[INFO] Downloading: https://repository.apache.org/content/repositories/snapshots/org/apache/kerby/has-project/maven-metadata.xml
[INFO] Downloaded: https://repository.apache.org/content/repositories/snapshots/org/apache/kerby/has-project/maven-metadata.xml (287 B at 0.6 KB/sec)
[INFO] Uploading: https://repository.apache.org/content/repositories/snapshots/org/apache/kerby/has-project/1.1.1-SNAPSHOT/maven-metadata.xml
[INFO] Uploaded: https://repository.apache.org/content/repositories/snapshots/org/apache/kerby/has-project/1.1.1-SNAPSHOT/maven-metadata.xml (604 B at 0.9 KB/sec)
[INFO] Uploading: https://repository.apache.org/content/repositories/snapshots/org/apache/kerby/has-project/maven-metadata.xml
[INFO] Uploaded: https://repository.apache.org/content/repositories/snapshots/org/apache/kerby/has-project/maven-metadata.xml (287 B at 0.4 KB/sec)
[JENKINS] Archiving disabled
[INFO]                                                                         
[INFO] ------------------------------------------------------------------------
[INFO] Building has-common 1.1.1-SNAPSHOT
[INFO] ------------------------------------------------------------------------
[INFO] 
[INFO] --- maven-clean-plugin:3.0.0:clean (default-clean) @ has-common ---
[INFO] Deleting <https://builds.apache.org/job/dir-kerby/ws/has-project/has-common/target>
[INFO] 
[INFO] >>> maven-pmd-plugin:3.7:check (validate) > :pmd @ has-common >>>
[INFO] 
[INFO] --- maven-pmd-plugin:3.7:pmd (pmd) @ has-common ---
[INFO] 
[INFO] <<< maven-pmd-plugin:3.7:check (validate) < :pmd @ has-common <<<
[INFO] 
[INFO] --- maven-pmd-plugin:3.7:check (validate) @ has-common ---
[INFO] 
[INFO] 
[INFO] --- maven-checkstyle-plugin:2.17:check (validate) @ has-common ---
[INFO] 
[INFO] --- maven-remote-resources-plugin:1.5:process (process-resource-bundles) @ has-common ---
[INFO] 
[INFO] --- maven-resources-plugin:2.7:resources (default-resources) @ has-common ---
[INFO] Using 'UTF-8' encoding to copy filtered resources.
[INFO] skip non existing resourceDirectory <https://builds.apache.org/job/dir-kerby/ws/has-project/has-common/src/main/resources>
[INFO] Copying 3 resources
[INFO] 
[INFO] --- maven-compiler-plugin:3.6.2:compile (default-compile) @ has-common ---
[INFO] Changes detected - recompiling the module!
[INFO] Compiling 19 source files to <https://builds.apache.org/job/dir-kerby/ws/has-project/has-common/target/classes>
[INFO] 
[INFO] --- maven-resources-plugin:2.7:testResources (default-testResources) @ has-common ---
[INFO] Using 'UTF-8' encoding to copy filtered resources.
[INFO] skip non existing resourceDirectory <https://builds.apache.org/job/dir-kerby/ws/has-project/has-common/src/test/resources>
[INFO] Copying 3 resources
[INFO] 
[INFO] --- maven-compiler-plugin:3.6.2:testCompile (default-testCompile) @ has-common ---
[INFO] No sources to compile
[INFO] 
[INFO] --- maven-surefire-plugin:2.20.1:test (default-test) @ has-common ---
[INFO] 
[JENKINS] Recording test results[INFO] --- maven-surefire-plugin:2.20.1:test (default) @ has-common ---

[INFO] Skipping execution of surefire because it has already been run for this configuration
[JENKINS] Recording test results
[INFO] 
[INFO] --- maven-jar-plugin:3.0.0:jar (default-jar) @ has-common ---
[INFO] Building jar: <https://builds.apache.org/job/dir-kerby/ws/has-project/has-common/target/has-common-1.1.1-SNAPSHOT.jar>
[INFO] 
[INFO] --- maven-site-plugin:3.5.1:attach-descriptor (attach-descriptor) @ has-common ---
[INFO] 
[INFO] >>> maven-source-plugin:3.0.0:jar (attach-sources) > generate-sources @ has-common >>>
[INFO] 
[INFO] >>> maven-pmd-plugin:3.7:check (validate) > :pmd @ has-common >>>
[INFO] 
[INFO] --- maven-pmd-plugin:3.7:pmd (pmd) @ has-common ---
[INFO] 
[INFO] <<< maven-pmd-plugin:3.7:check (validate) < :pmd @ has-common <<<
[INFO] 
[INFO] --- maven-pmd-plugin:3.7:check (validate) @ has-common ---
[INFO] 
[INFO] 
[INFO] --- maven-checkstyle-plugin:2.17:check (validate) @ has-common ---
[WARNING] Failed to getClass for org.apache.maven.plugins.source.SourceJarMojo
[INFO] 
[INFO] <<< maven-source-plugin:3.0.0:jar (attach-sources) < generate-sources @ has-common <<<
[INFO] 
[INFO] --- maven-source-plugin:3.0.0:jar (attach-sources) @ has-common ---
[INFO] Building jar: <https://builds.apache.org/job/dir-kerby/ws/has-project/has-common/target/has-common-1.1.1-SNAPSHOT-sources.jar>
[INFO] 
[INFO] --- modernizer-maven-plugin:1.5.0:modernizer (modernizer-check) @ has-common ---
[ERROR] <https://builds.apache.org/job/dir-kerby/ws/has-project/has-common/src/main/java/org/apache/kerby/has/common/spnego/AuthToken.java>:114: Prefer java.lang.StringBuilder
[ERROR] <https://builds.apache.org/job/dir-kerby/ws/has-project/has-common/src/main/java/org/apache/kerby/has/common/ssl/SSLHostnameVerifier$AbstractVerifier.java>:379: Prefer java.lang.StringBuilder
[ERROR] <https://builds.apache.org/job/dir-kerby/ws/has-project/has-common/src/main/java/org/apache/kerby/has/common/ssl/SSLHostnameVerifier$AbstractVerifier.java>:418: Prefer java.lang.StringBuilder
[JENKINS] Archiving disabled
[JENKINS] Archiving disabled
[JENKINS] Archiving disabled
[JENKINS] Archiving disabled
[JENKINS] Archiving disabled
[JENKINS] Archiving disabled
[JENKINS] Archiving disabled
[JENKINS] Archiving disabled
[JENKINS] Archiving disabled
[JENKINS] Archiving disabled
[JENKINS] Archiving disabled
[JENKINS] Archiving disabled
[JENKINS] Archiving disabled
[JENKINS] Archiving disabled
[JENKINS] Archiving disabled
[JENKINS] Archiving disabled
[JENKINS] Archiving disabled
[JENKINS] Archiving disabled
[JENKINS] Archiving disabled
[JENKINS] Archiving disabled
[JENKINS] Archiving disabled
[JENKINS] Archiving disabled
[JENKINS] Archiving disabled
[JENKINS] Archiving disabled
[JENKINS] Archiving disabled
[JENKINS] Archiving disabled
[JENKINS] Archiving disabled
[JENKINS] Archiving disabled
[JENKINS] Archiving disabled
[JENKINS] Archiving disabled
[JENKINS] Archiving disabled
[JENKINS] Archiving disabled
[JENKINS] Archiving disabled
[JENKINS] Archiving disabled
[JENKINS] Archiving disabled
[JENKINS] Archiving disabled
[JENKINS] Archiving disabled
[JENKINS] Archiving disabled
[JENKINS] Archiving disabled
[JENKINS] Archiving disabled
[JENKINS] Archiving disabled
[JENKINS] Archiving disabled
[JENKINS] Archiving disabled
[JENKINS] Archiving disabled
[JENKINS] Archiving disabled[INFO] ------------------------------------------------------------------------
[INFO] Reactor Summary:
[INFO] 
[INFO] Apache Kerby Project ............................... SUCCESS [ 12.904 s]
[INFO] Kerby-common Project ............................... SUCCESS [  6.880 s]
[INFO] Kerby ASN1 Project ................................. SUCCESS [01:20 min]
[INFO] Kerby Config ....................................... SUCCESS [ 17.803 s]
[INFO] Kerby Util ......................................... SUCCESS [ 18.396 s]
[INFO] Kerby XDR Project .................................. SUCCESS [ 20.757 s]
[INFO] Kerby PKIX Project ................................. SUCCESS [ 21.789 s]
[INFO] Kerby-kerb Project ................................. SUCCESS [  7.082 s]
[INFO] Kerby-kerb core .................................... SUCCESS [ 27.574 s]
[INFO] Kerby-kerb Crypto .................................. SUCCESS [ 32.304 s]
[INFO] Kerby-kerb Common .................................. SUCCESS [ 17.809 s]
[INFO] Kerby-kerb Util .................................... SUCCESS [ 22.919 s]
[INFO] Kerby-kerb Identity ................................ SUCCESS [ 12.559 s]
[INFO] Kerby-kerb Identity Test ........................... SUCCESS [ 12.169 s]
[INFO] Kerby providers .................................... SUCCESS [  6.817 s]
[INFO] Token provider ..................................... SUCCESS [ 16.838 s]
[INFO] Kerby-kerb Client .................................. SUCCESS [ 19.070 s]
[INFO] Kerby-kerb Server .................................. SUCCESS [ 17.961 s]
[INFO] Kerby-kerb Admin ................................... SUCCESS [ 14.277 s]
[INFO] Kerb Simple Kdc .................................... SUCCESS [ 15.011 s]
[INFO] Kerby-kerb server all .............................. SUCCESS [ 10.914 s]
[INFO] Kerby KDC Server ................................... SUCCESS [ 12.571 s]
[INFO] Kerb Kdc Test ...................................... SUCCESS [ 51.319 s]
[INFO] Kerby-kerb GssAPI .................................. SUCCESS [ 14.237 s]
[INFO] Kerb Integration Test .............................. SUCCESS [ 52.265 s]
[INFO] Kerby-kerb Admin Server ............................ SUCCESS [ 13.552 s]
[INFO] Kerby-kerb client api all .......................... SUCCESS [ 10.751 s]
[INFO] Kdc Tool Project ................................... SUCCESS [  6.771 s]
[INFO] Client Tool ........................................ SUCCESS [ 12.841 s]
[INFO] KDC Tool ........................................... SUCCESS [ 14.304 s]
[INFO] Kerby Backend ...................................... SUCCESS [  6.865 s]
[INFO] Json identity backend .............................. SUCCESS [ 14.976 s]
[INFO] Kerby Kdc Test ..................................... SUCCESS [ 54.819 s]
[INFO] Ldap identity backend .............................. SUCCESS [02:50 min]
[INFO] Mavibot based backend .............................. SUCCESS [ 15.723 s]
[INFO] Zookeeper identity backend ......................... SUCCESS [ 30.024 s]
[INFO] Kerby Distribution ................................. SUCCESS [  7.446 s]
[INFO] KDC Dist ........................................... SUCCESS [  7.113 s]
[INFO] Tool Dist .......................................... SUCCESS [  6.745 s]
[INFO] Kerby benchmark .................................... SUCCESS [ 13.314 s]
[INFO] HAS project ........................................ SUCCESS [  6.606 s]
[INFO] has-common ......................................... FAILURE [  8.093 s]
[INFO] has-server ......................................... SKIPPED
[INFO] has-client ......................................... SKIPPED
[INFO] ------------------------------------------------------------------------
[INFO] BUILD FAILURE
[INFO] ------------------------------------------------------------------------
[INFO] Total time: 17:21 min
[INFO] Finished at: 2017-12-26T02:59:39+00:00

[INFO] Final Memory: 49M/455M
[INFO] ------------------------------------------------------------------------
[ERROR] Failed to execute goal org.gaul:modernizer-maven-plugin:1.5.0:modernizer (modernizer-check) on project has-common: Found 3 violations -> [Help 1]
[ERROR] 
[ERROR] To see the full stack trace of the errors, re-run Maven with the -e switch.
[ERROR] Re-run Maven using the -X switch to enable full debug logging.
[ERROR] 
[ERROR] For more information about the errors and possible solutions, please read the following articles:
[ERROR] [Help 1] http://cwiki.apache.org/confluence/display/MAVEN/MojoExecutionException
[ERROR] 
[ERROR] After correcting the problems, you can resume the build with the command
[ERROR]   mvn <goals> -rf :has-common
channel stopped