You are viewing a plain text version of this content. The canonical link for it is here.
Posted to dev@juneau.apache.org by Apache Jenkins Server <je...@builds.apache.org> on 2026/09/04 19:00:27 UTC

Build failed in Jenkins: Juneau » Juneau-Java-17 #2664

See <https://ci-builds.apache.org/job/Juneau/job/Juneau-Java-17/2664/display/redirect?page=changes>

Changes:

[James Bognar] Add an enforceable in-dialog result receipt (ModalDef.keepOpenOnSubmit + ActionResult.resultForm) and a dialog-scoped child-action catalog (ModalDef.childActions) for stacked wizard steps.


------------------------------------------
Started by an SCM change
Running as SYSTEM
[EnvInject] - Loading node environment variables.
Building remotely on builds33 (ubuntu) in workspace <https://ci-builds.apache.org/job/Juneau/job/Juneau-Java-17/ws/>
The recommended git tool is: NONE
No credentials specified
 > git rev-parse --resolve-git-dir <https://ci-builds.apache.org/job/Juneau/job/Juneau-Java-17/ws/.git> # timeout=10
Fetching changes from the remote Git repository
 > git config remote.origin.url https://github.com/apache/juneau.git # timeout=10
Fetching upstream changes from https://github.com/apache/juneau.git
 > git --version # timeout=10
 > git --version # 'git version 2.34.1'
 > git fetch --tags --force --progress -- https://github.com/apache/juneau.git +refs/heads/*:refs/remotes/origin/* # timeout=10
 > git rev-parse refs/remotes/origin/master^{commit} # timeout=10
Checking out Revision e991410d79ecc7fa760fcdb1c295f61990510728 (refs/remotes/origin/master)
 > git config core.sparsecheckout # timeout=10
 > git checkout -f e991410d79ecc7fa760fcdb1c295f61990510728 # timeout=10
Commit message: "Add an enforceable in-dialog result receipt (ModalDef.keepOpenOnSubmit + ActionResult.resultForm) and a dialog-scoped child-action catalog (ModalDef.childActions) for stacked wizard steps."
 > git rev-list --no-walk 3bac80e396c916b473e912a47edfedb11a00c398 # timeout=10
[Juneau-Java-17] $ mvn clean install deploy javadoc:aggregate
FATAL: command execution failed
java.io.IOException: error=2, No such file or directory
	at java.base/java.lang.ProcessImpl.forkAndExec(Native Method)
	at java.base/java.lang.ProcessImpl.<init>(ProcessImpl.java:314)
	at java.base/java.lang.ProcessImpl.start(ProcessImpl.java:244)
	at java.base/java.lang.ProcessBuilder.start(ProcessBuilder.java:1110)
Also:   hudson.remoting.Channel$CallSiteStackTrace: Remote call to builds33
		at hudson.remoting.Channel.attachCallSiteStackTrace(Channel.java:1923)
		at hudson.remoting.UserRequest$ExceptionResponse.retrieve(UserRequest.java:384)
		at hudson.remoting.Channel.call(Channel.java:1112)
		at hudson.Launcher$RemoteLauncher.launch(Launcher.java:1121)
		at hudson.Launcher$ProcStarter.start(Launcher.java:506)
		at hudson.Launcher$ProcStarter.join(Launcher.java:517)
		at hudson.tasks.Maven.perform(Maven.java:368)
		at hudson.tasks.BuildStepMonitor$1.perform(BuildStepMonitor.java:20)
		at hudson.model.AbstractBuild$AbstractBuildExecution.perform(AbstractBuild.java:818)
		at hudson.model.Build$BuildExecution.build(Build.java:199)
		at hudson.model.Build$BuildExecution.doRun(Build.java:164)
		at hudson.model.AbstractBuild$AbstractBuildExecution.run(AbstractBuild.java:527)
		at hudson.model.Run.execute(Run.java:1833)
		at hudson.model.FreeStyleBuild.run(FreeStyleBuild.java:44)
		at hudson.model.ResourceController.execute(ResourceController.java:101)
		at hudson.model.Executor.run(Executor.java:446)
Caused: java.io.IOException: Cannot run program "mvn" (in directory "<https://ci-builds.apache.org/job/Juneau/job/Juneau-Java-17/ws/")>: error=2, No such file or directory
	at java.base/java.lang.ProcessBuilder.start(ProcessBuilder.java:1143)
	at java.base/java.lang.ProcessBuilder.start(ProcessBuilder.java:1073)
	at hudson.Proc$LocalProc.<init>(Proc.java:252)
	at hudson.Proc$LocalProc.<init>(Proc.java:221)
	at hudson.Launcher$LocalLauncher.launch(Launcher.java:994)
	at hudson.Launcher$ProcStarter.start(Launcher.java:506)
	at hudson.Launcher$RemoteLaunchCallable.call(Launcher.java:1395)
	at hudson.Launcher$RemoteLaunchCallable.call(Launcher.java:1337)
	at hudson.remoting.UserRequest.perform(UserRequest.java:225)
	at hudson.remoting.UserRequest.perform(UserRequest.java:50)
	at hudson.remoting.Request$2.run(Request.java:391)
	at hudson.remoting.InterceptingExecutorService.lambda$wrap$0(InterceptingExecutorService.java:81)
	at java.base/java.util.concurrent.FutureTask.run(FutureTask.java:264)
	at java.base/java.util.concurrent.ThreadPoolExecutor.runWorker(ThreadPoolExecutor.java:1136)
	at java.base/java.util.concurrent.ThreadPoolExecutor$Worker.run(ThreadPoolExecutor.java:635)
	at java.base/java.lang.Thread.run(Thread.java:840)
Build step 'Invoke top-level Maven targets' marked build as failure
Recording test results
[Checks API] No suitable checks publisher found.

Jenkins build is back to normal : Juneau » Juneau-Java-17 #2702

Posted by Apache Jenkins Server <je...@builds.apache.org>.
See <https://ci-builds.apache.org/job/Juneau/job/Juneau-Java-17/2702/display/redirect>


Build failed in Jenkins: Juneau » Juneau-Java-17 #2701

Posted by Apache Jenkins Server <je...@builds.apache.org>.
See <https://ci-builds.apache.org/job/Juneau/job/Juneau-Java-17/2701/display/redirect?page=changes>

Changes:

[James Bognar] WORK-J0533: coordinated OpenRewrite bump to plugin 6.46.1 and rewrite-java 8.90.4, and disable keep-alive on the MCP elicitation IT client to avoid the stale-socket CI flake.


------------------------------------------
Started by an SCM change
Running as SYSTEM
[EnvInject] - Loading node environment variables.
Building remotely on builds33 (ubuntu) in workspace <https://ci-builds.apache.org/job/Juneau/job/Juneau-Java-17/ws/>
The recommended git tool is: NONE
No credentials specified
 > git rev-parse --resolve-git-dir <https://ci-builds.apache.org/job/Juneau/job/Juneau-Java-17/ws/.git> # timeout=10
Fetching changes from the remote Git repository
 > git config remote.origin.url https://github.com/apache/juneau.git # timeout=10
Fetching upstream changes from https://github.com/apache/juneau.git
 > git --version # timeout=10
 > git --version # 'git version 2.34.1'
 > git fetch --tags --force --progress -- https://github.com/apache/juneau.git +refs/heads/*:refs/remotes/origin/* # timeout=10
 > git rev-parse refs/remotes/origin/master^{commit} # timeout=10
Checking out Revision 7bb3a545dbb01c8e2635053247fe45116b8ecb05 (refs/remotes/origin/master)
 > git config core.sparsecheckout # timeout=10
 > git checkout -f 7bb3a545dbb01c8e2635053247fe45116b8ecb05 # timeout=10
Commit message: "WORK-J0533: coordinated OpenRewrite bump to plugin 6.46.1 and rewrite-java 8.90.4, and disable keep-alive on the MCP elicitation IT client to avoid the stale-socket CI flake."
 > git rev-list --no-walk cccf7f1bc401078a864a4978851e6cbc02e13feb # timeout=10
[Juneau-Java-17] $ mvn clean install deploy javadoc:aggregate
FATAL: command execution failed
java.io.IOException: error=2, No such file or directory
	at java.base/java.lang.ProcessImpl.forkAndExec(Native Method)
	at java.base/java.lang.ProcessImpl.<init>(ProcessImpl.java:314)
	at java.base/java.lang.ProcessImpl.start(ProcessImpl.java:244)
	at java.base/java.lang.ProcessBuilder.start(ProcessBuilder.java:1110)
Also:   hudson.remoting.Channel$CallSiteStackTrace: Remote call to builds33
		at hudson.remoting.Channel.attachCallSiteStackTrace(Channel.java:1923)
		at hudson.remoting.UserRequest$ExceptionResponse.retrieve(UserRequest.java:384)
		at hudson.remoting.Channel.call(Channel.java:1112)
		at hudson.Launcher$RemoteLauncher.launch(Launcher.java:1121)
		at hudson.Launcher$ProcStarter.start(Launcher.java:506)
		at hudson.Launcher$ProcStarter.join(Launcher.java:517)
		at hudson.tasks.Maven.perform(Maven.java:368)
		at hudson.tasks.BuildStepMonitor$1.perform(BuildStepMonitor.java:20)
		at hudson.model.AbstractBuild$AbstractBuildExecution.perform(AbstractBuild.java:818)
		at hudson.model.Build$BuildExecution.build(Build.java:199)
		at hudson.model.Build$BuildExecution.doRun(Build.java:164)
		at hudson.model.AbstractBuild$AbstractBuildExecution.run(AbstractBuild.java:527)
		at hudson.model.Run.execute(Run.java:1833)
		at hudson.model.FreeStyleBuild.run(FreeStyleBuild.java:44)
		at hudson.model.ResourceController.execute(ResourceController.java:101)
		at hudson.model.Executor.run(Executor.java:446)
Caused: java.io.IOException: Cannot run program "mvn" (in directory "<https://ci-builds.apache.org/job/Juneau/job/Juneau-Java-17/ws/")>: error=2, No such file or directory
	at java.base/java.lang.ProcessBuilder.start(ProcessBuilder.java:1143)
	at java.base/java.lang.ProcessBuilder.start(ProcessBuilder.java:1073)
	at hudson.Proc$LocalProc.<init>(Proc.java:252)
	at hudson.Proc$LocalProc.<init>(Proc.java:221)
	at hudson.Launcher$LocalLauncher.launch(Launcher.java:994)
	at hudson.Launcher$ProcStarter.start(Launcher.java:506)
	at hudson.Launcher$RemoteLaunchCallable.call(Launcher.java:1395)
	at hudson.Launcher$RemoteLaunchCallable.call(Launcher.java:1337)
	at hudson.remoting.UserRequest.perform(UserRequest.java:225)
	at hudson.remoting.UserRequest.perform(UserRequest.java:50)
	at hudson.remoting.Request$2.run(Request.java:391)
	at hudson.remoting.InterceptingExecutorService.lambda$wrap$0(InterceptingExecutorService.java:81)
	at java.base/java.util.concurrent.FutureTask.run(FutureTask.java:264)
	at java.base/java.util.concurrent.ThreadPoolExecutor.runWorker(ThreadPoolExecutor.java:1136)
	at java.base/java.util.concurrent.ThreadPoolExecutor$Worker.run(ThreadPoolExecutor.java:635)
	at java.base/java.lang.Thread.run(Thread.java:840)
Build step 'Invoke top-level Maven targets' marked build as failure
Recording test results
ERROR: Step ‘Publish JUnit test result report’ failed: No test report files were found. Configuration error?

Build failed in Jenkins: Juneau » Juneau-Java-17 #2700

Posted by Apache Jenkins Server <je...@builds.apache.org>.
See <https://ci-builds.apache.org/job/Juneau/job/Juneau-Java-17/2700/display/redirect?page=changes>

Changes:

[github] build(deps): bump com.squareup.okhttp3:okhttp-jvm from 5.3.2 to 5.5.0

[github] build(deps): bump org.apache.tomcat.embed:tomcat-embed-core

[github] build(deps-dev): bump com.nimbusds:oauth2-oidc-sdk

[github] build(deps): bump opentelemetry.version from 1.63.0 to 1.65.0

[github] build(deps): bump actions/setup-java from 5.7.0 to 6.0.0

[github] build(deps): bump github/codeql-action/init from 4.37.6 to 4.37.9

[github] build(deps): bump github/codeql-action/analyze from 4.37.6 to 4.37.9


------------------------------------------
Started by an SCM change
Running as SYSTEM
[EnvInject] - Loading node environment variables.
Building remotely on builds58 (ubuntu ubuntu-avx) in workspace <https://ci-builds.apache.org/job/Juneau/job/Juneau-Java-17/ws/>
The recommended git tool is: NONE
No credentials specified
 > git rev-parse --resolve-git-dir <https://ci-builds.apache.org/job/Juneau/job/Juneau-Java-17/ws/.git> # timeout=10
Fetching changes from the remote Git repository
 > git config remote.origin.url https://github.com/apache/juneau.git # timeout=10
Fetching upstream changes from https://github.com/apache/juneau.git
 > git --version # timeout=10
 > git --version # 'git version 2.34.1'
 > git fetch --tags --force --progress -- https://github.com/apache/juneau.git +refs/heads/*:refs/remotes/origin/* # timeout=10
 > git rev-parse refs/remotes/origin/master^{commit} # timeout=10
Checking out Revision cccf7f1bc401078a864a4978851e6cbc02e13feb (refs/remotes/origin/master)
 > git config core.sparsecheckout # timeout=10
 > git checkout -f cccf7f1bc401078a864a4978851e6cbc02e13feb # timeout=10
Commit message: "Merge pull request #395 from dependabot/github_actions/github/codeql-action/analyze-4.37.9"
 > git rev-list --no-walk 669c2e678dbbcd75cb3d8437664d29028c7334fe # timeout=10
[Juneau-Java-17] $ mvn clean install deploy javadoc:aggregate
FATAL: command execution failed
java.io.IOException: error=2, No such file or directory
	at java.base/java.lang.ProcessImpl.forkAndExec(Native Method)
	at java.base/java.lang.ProcessImpl.<init>(ProcessImpl.java:314)
	at java.base/java.lang.ProcessImpl.start(ProcessImpl.java:244)
	at java.base/java.lang.ProcessBuilder.start(ProcessBuilder.java:1110)
Also:   hudson.remoting.Channel$CallSiteStackTrace: Remote call to builds58
		at hudson.remoting.Channel.attachCallSiteStackTrace(Channel.java:1923)
		at hudson.remoting.UserRequest$ExceptionResponse.retrieve(UserRequest.java:384)
		at hudson.remoting.Channel.call(Channel.java:1112)
		at hudson.Launcher$RemoteLauncher.launch(Launcher.java:1121)
		at hudson.Launcher$ProcStarter.start(Launcher.java:506)
		at hudson.Launcher$ProcStarter.join(Launcher.java:517)
		at hudson.tasks.Maven.perform(Maven.java:368)
		at hudson.tasks.BuildStepMonitor$1.perform(BuildStepMonitor.java:20)
		at hudson.model.AbstractBuild$AbstractBuildExecution.perform(AbstractBuild.java:818)
		at hudson.model.Build$BuildExecution.build(Build.java:199)
		at hudson.model.Build$BuildExecution.doRun(Build.java:164)
		at hudson.model.AbstractBuild$AbstractBuildExecution.run(AbstractBuild.java:527)
		at hudson.model.Run.execute(Run.java:1833)
		at hudson.model.FreeStyleBuild.run(FreeStyleBuild.java:44)
		at hudson.model.ResourceController.execute(ResourceController.java:101)
		at hudson.model.Executor.run(Executor.java:446)
Caused: java.io.IOException: Cannot run program "mvn" (in directory "<https://ci-builds.apache.org/job/Juneau/job/Juneau-Java-17/ws/")>: error=2, No such file or directory
	at java.base/java.lang.ProcessBuilder.start(ProcessBuilder.java:1143)
	at java.base/java.lang.ProcessBuilder.start(ProcessBuilder.java:1073)
	at hudson.Proc$LocalProc.<init>(Proc.java:252)
	at hudson.Proc$LocalProc.<init>(Proc.java:221)
	at hudson.Launcher$LocalLauncher.launch(Launcher.java:994)
	at hudson.Launcher$ProcStarter.start(Launcher.java:506)
	at hudson.Launcher$RemoteLaunchCallable.call(Launcher.java:1395)
	at hudson.Launcher$RemoteLaunchCallable.call(Launcher.java:1337)
	at hudson.remoting.UserRequest.perform(UserRequest.java:225)
	at hudson.remoting.UserRequest.perform(UserRequest.java:50)
	at hudson.remoting.Request$2.run(Request.java:391)
	at hudson.remoting.InterceptingExecutorService.lambda$wrap$0(InterceptingExecutorService.java:81)
	at java.base/java.util.concurrent.FutureTask.run(FutureTask.java:264)
	at java.base/java.util.concurrent.ThreadPoolExecutor.runWorker(ThreadPoolExecutor.java:1136)
	at java.base/java.util.concurrent.ThreadPoolExecutor$Worker.run(ThreadPoolExecutor.java:635)
	at java.base/java.lang.Thread.run(Thread.java:840)
Build step 'Invoke top-level Maven targets' marked build as failure
Recording test results
[Checks API] No suitable checks publisher found.

Re: Build failed in Jenkins: Juneau » Juneau-Java-17 #2699

Posted by James Bognar <ja...@apache.org>.
FYI...this looks like maven is missing from the environment.  I've opened
an infra ticket for it.

On Sun, Sep 13, 2026 at 9:10 AM Apache Jenkins Server <
jenkins@builds.apache.org> wrote:

> See <
> https://ci-builds.apache.org/job/Juneau/job/Juneau-Java-17/2699/display/redirect?page=changes
> >
>
> Changes:
>
> [James Bognar] Register a stub SlotDetailChevron populator so the JS
> harness CI does not fail on an unregistered 'p' name, and restore SAML
> reject-at-parse after the Commons Secure XML merge dropped
> disallow-doctype-decl.
>
>
> ------------------------------------------
> Started by an SCM change
> Running as SYSTEM
> [EnvInject] - Loading node environment variables.
> Building remotely on builds58 (ubuntu ubuntu-avx) in workspace <
> https://ci-builds.apache.org/job/Juneau/job/Juneau-Java-17/ws/>
> The recommended git tool is: NONE
> No credentials specified
>  > git rev-parse --resolve-git-dir <
> https://ci-builds.apache.org/job/Juneau/job/Juneau-Java-17/ws/.git> #
> timeout=10
> Fetching changes from the remote Git repository
>  > git config remote.origin.url https://github.com/apache/juneau.git #
> timeout=10
> Fetching upstream changes from https://github.com/apache/juneau.git
>  > git --version # timeout=10
>  > git --version # 'git version 2.34.1'
>  > git fetch --tags --force --progress --
> https://github.com/apache/juneau.git +refs/heads/*:refs/remotes/origin/*
> # timeout=10
>  > git rev-parse refs/remotes/origin/master^{commit} # timeout=10
> Checking out Revision 669c2e678dbbcd75cb3d8437664d29028c7334fe
> (refs/remotes/origin/master)
>  > git config core.sparsecheckout # timeout=10
>  > git checkout -f 669c2e678dbbcd75cb3d8437664d29028c7334fe # timeout=10
> Commit message: "Register a stub SlotDetailChevron populator so the JS
> harness CI does not fail on an unregistered 'p' name, and restore SAML
> reject-at-parse after the Commons Secure XML merge dropped
> disallow-doctype-decl."
>  > git rev-list --no-walk 6a556c55819f082646c9fe930cc984d86ec11edf #
> timeout=10
> [Juneau-Java-17] $ mvn clean install deploy javadoc:aggregate
> FATAL: command execution failed
> java.io.IOException: error=2, No such file or directory
>         at java.base/java.lang.ProcessImpl.forkAndExec(Native Method)
>         at java.base/java.lang.ProcessImpl.<init>(ProcessImpl.java:314)
>         at java.base/java.lang.ProcessImpl.start(ProcessImpl.java:244)
>         at
> java.base/java.lang.ProcessBuilder.start(ProcessBuilder.java:1110)
> Also:   hudson.remoting.Channel$CallSiteStackTrace: Remote call to builds58
>                 at
> hudson.remoting.Channel.attachCallSiteStackTrace(Channel.java:1923)
>                 at
> hudson.remoting.UserRequest$ExceptionResponse.retrieve(UserRequest.java:384)
>                 at hudson.remoting.Channel.call(Channel.java:1112)
>                 at
> hudson.Launcher$RemoteLauncher.launch(Launcher.java:1121)
>                 at hudson.Launcher$ProcStarter.start(Launcher.java:506)
>                 at hudson.Launcher$ProcStarter.join(Launcher.java:517)
>                 at hudson.tasks.Maven.perform(Maven.java:368)
>                 at
> hudson.tasks.BuildStepMonitor$1.perform(BuildStepMonitor.java:20)
>                 at
> hudson.model.AbstractBuild$AbstractBuildExecution.perform(AbstractBuild.java:818)
>                 at hudson.model.Build$BuildExecution.build(Build.java:199)
>                 at hudson.model.Build$BuildExecution.doRun(Build.java:164)
>                 at
> hudson.model.AbstractBuild$AbstractBuildExecution.run(AbstractBuild.java:527)
>                 at hudson.model.Run.execute(Run.java:1833)
>                 at hudson.model.FreeStyleBuild.run(FreeStyleBuild.java:44)
>                 at
> hudson.model.ResourceController.execute(ResourceController.java:101)
>                 at hudson.model.Executor.run(Executor.java:446)
> Caused: java.io.IOException: Cannot run program "mvn" (in directory "<
> https://ci-builds.apache.org/job/Juneau/job/Juneau-Java-17/ws/")>:
> error=2, No such file or directory
>         at
> java.base/java.lang.ProcessBuilder.start(ProcessBuilder.java:1143)
>         at
> java.base/java.lang.ProcessBuilder.start(ProcessBuilder.java:1073)
>         at hudson.Proc$LocalProc.<init>(Proc.java:252)
>         at hudson.Proc$LocalProc.<init>(Proc.java:221)
>         at hudson.Launcher$LocalLauncher.launch(Launcher.java:994)
>         at hudson.Launcher$ProcStarter.start(Launcher.java:506)
>         at hudson.Launcher$RemoteLaunchCallable.call(Launcher.java:1395)
>         at hudson.Launcher$RemoteLaunchCallable.call(Launcher.java:1337)
>         at hudson.remoting.UserRequest.perform(UserRequest.java:225)
>         at hudson.remoting.UserRequest.perform(UserRequest.java:50)
>         at hudson.remoting.Request$2.run(Request.java:391)
>         at
> hudson.remoting.InterceptingExecutorService.lambda$wrap$0(InterceptingExecutorService.java:81)
>         at
> java.base/java.util.concurrent.FutureTask.run(FutureTask.java:264)
>         at
> java.base/java.util.concurrent.ThreadPoolExecutor.runWorker(ThreadPoolExecutor.java:1136)
>         at
> java.base/java.util.concurrent.ThreadPoolExecutor$Worker.run(ThreadPoolExecutor.java:635)
>         at java.base/java.lang.Thread.run(Thread.java:840)
> Build step 'Invoke top-level Maven targets' marked build as failure
> Recording test results
> [Checks API] No suitable checks publisher found.
>

Build failed in Jenkins: Juneau » Juneau-Java-17 #2699

Posted by Apache Jenkins Server <je...@builds.apache.org>.
See <https://ci-builds.apache.org/job/Juneau/job/Juneau-Java-17/2699/display/redirect?page=changes>

Changes:

[James Bognar] Register a stub SlotDetailChevron populator so the JS harness CI does not fail on an unregistered 'p' name, and restore SAML reject-at-parse after the Commons Secure XML merge dropped disallow-doctype-decl.


------------------------------------------
Started by an SCM change
Running as SYSTEM
[EnvInject] - Loading node environment variables.
Building remotely on builds58 (ubuntu ubuntu-avx) in workspace <https://ci-builds.apache.org/job/Juneau/job/Juneau-Java-17/ws/>
The recommended git tool is: NONE
No credentials specified
 > git rev-parse --resolve-git-dir <https://ci-builds.apache.org/job/Juneau/job/Juneau-Java-17/ws/.git> # timeout=10
Fetching changes from the remote Git repository
 > git config remote.origin.url https://github.com/apache/juneau.git # timeout=10
Fetching upstream changes from https://github.com/apache/juneau.git
 > git --version # timeout=10
 > git --version # 'git version 2.34.1'
 > git fetch --tags --force --progress -- https://github.com/apache/juneau.git +refs/heads/*:refs/remotes/origin/* # timeout=10
 > git rev-parse refs/remotes/origin/master^{commit} # timeout=10
Checking out Revision 669c2e678dbbcd75cb3d8437664d29028c7334fe (refs/remotes/origin/master)
 > git config core.sparsecheckout # timeout=10
 > git checkout -f 669c2e678dbbcd75cb3d8437664d29028c7334fe # timeout=10
Commit message: "Register a stub SlotDetailChevron populator so the JS harness CI does not fail on an unregistered 'p' name, and restore SAML reject-at-parse after the Commons Secure XML merge dropped disallow-doctype-decl."
 > git rev-list --no-walk 6a556c55819f082646c9fe930cc984d86ec11edf # timeout=10
[Juneau-Java-17] $ mvn clean install deploy javadoc:aggregate
FATAL: command execution failed
java.io.IOException: error=2, No such file or directory
	at java.base/java.lang.ProcessImpl.forkAndExec(Native Method)
	at java.base/java.lang.ProcessImpl.<init>(ProcessImpl.java:314)
	at java.base/java.lang.ProcessImpl.start(ProcessImpl.java:244)
	at java.base/java.lang.ProcessBuilder.start(ProcessBuilder.java:1110)
Also:   hudson.remoting.Channel$CallSiteStackTrace: Remote call to builds58
		at hudson.remoting.Channel.attachCallSiteStackTrace(Channel.java:1923)
		at hudson.remoting.UserRequest$ExceptionResponse.retrieve(UserRequest.java:384)
		at hudson.remoting.Channel.call(Channel.java:1112)
		at hudson.Launcher$RemoteLauncher.launch(Launcher.java:1121)
		at hudson.Launcher$ProcStarter.start(Launcher.java:506)
		at hudson.Launcher$ProcStarter.join(Launcher.java:517)
		at hudson.tasks.Maven.perform(Maven.java:368)
		at hudson.tasks.BuildStepMonitor$1.perform(BuildStepMonitor.java:20)
		at hudson.model.AbstractBuild$AbstractBuildExecution.perform(AbstractBuild.java:818)
		at hudson.model.Build$BuildExecution.build(Build.java:199)
		at hudson.model.Build$BuildExecution.doRun(Build.java:164)
		at hudson.model.AbstractBuild$AbstractBuildExecution.run(AbstractBuild.java:527)
		at hudson.model.Run.execute(Run.java:1833)
		at hudson.model.FreeStyleBuild.run(FreeStyleBuild.java:44)
		at hudson.model.ResourceController.execute(ResourceController.java:101)
		at hudson.model.Executor.run(Executor.java:446)
Caused: java.io.IOException: Cannot run program "mvn" (in directory "<https://ci-builds.apache.org/job/Juneau/job/Juneau-Java-17/ws/")>: error=2, No such file or directory
	at java.base/java.lang.ProcessBuilder.start(ProcessBuilder.java:1143)
	at java.base/java.lang.ProcessBuilder.start(ProcessBuilder.java:1073)
	at hudson.Proc$LocalProc.<init>(Proc.java:252)
	at hudson.Proc$LocalProc.<init>(Proc.java:221)
	at hudson.Launcher$LocalLauncher.launch(Launcher.java:994)
	at hudson.Launcher$ProcStarter.start(Launcher.java:506)
	at hudson.Launcher$RemoteLaunchCallable.call(Launcher.java:1395)
	at hudson.Launcher$RemoteLaunchCallable.call(Launcher.java:1337)
	at hudson.remoting.UserRequest.perform(UserRequest.java:225)
	at hudson.remoting.UserRequest.perform(UserRequest.java:50)
	at hudson.remoting.Request$2.run(Request.java:391)
	at hudson.remoting.InterceptingExecutorService.lambda$wrap$0(InterceptingExecutorService.java:81)
	at java.base/java.util.concurrent.FutureTask.run(FutureTask.java:264)
	at java.base/java.util.concurrent.ThreadPoolExecutor.runWorker(ThreadPoolExecutor.java:1136)
	at java.base/java.util.concurrent.ThreadPoolExecutor$Worker.run(ThreadPoolExecutor.java:635)
	at java.base/java.lang.Thread.run(Thread.java:840)
Build step 'Invoke top-level Maven targets' marked build as failure
Recording test results
[Checks API] No suitable checks publisher found.

Build failed in Jenkins: Juneau » Juneau-Java-17 #2698

Posted by Apache Jenkins Server <je...@builds.apache.org>.
See <https://ci-builds.apache.org/job/Juneau/job/Juneau-Java-17/2698/display/redirect?page=changes>

Changes:

[garydgregory] Use Apache Commons Secure XML.


------------------------------------------
Started by an SCM change
Running as SYSTEM
[EnvInject] - Loading node environment variables.
Building remotely on builds33 (ubuntu) in workspace <https://ci-builds.apache.org/job/Juneau/job/Juneau-Java-17/ws/>
The recommended git tool is: NONE
No credentials specified
 > git rev-parse --resolve-git-dir <https://ci-builds.apache.org/job/Juneau/job/Juneau-Java-17/ws/.git> # timeout=10
Fetching changes from the remote Git repository
 > git config remote.origin.url https://github.com/apache/juneau.git # timeout=10
Fetching upstream changes from https://github.com/apache/juneau.git
 > git --version # timeout=10
 > git --version # 'git version 2.34.1'
 > git fetch --tags --force --progress -- https://github.com/apache/juneau.git +refs/heads/*:refs/remotes/origin/* # timeout=10
 > git rev-parse refs/remotes/origin/master^{commit} # timeout=10
Checking out Revision 6a556c55819f082646c9fe930cc984d86ec11edf (refs/remotes/origin/master)
 > git config core.sparsecheckout # timeout=10
 > git checkout -f 6a556c55819f082646c9fe930cc984d86ec11edf # timeout=10
Commit message: "Merge pull request #397 from garydgregory/feature/use_commons_secure_xml"
 > git rev-list --no-walk cb56843d180a7e11d9bc8dd89f3ca19dc5befc18 # timeout=10
[Juneau-Java-17] $ mvn clean install deploy javadoc:aggregate
FATAL: command execution failed
java.io.IOException: error=2, No such file or directory
	at java.base/java.lang.ProcessImpl.forkAndExec(Native Method)
	at java.base/java.lang.ProcessImpl.<init>(ProcessImpl.java:314)
	at java.base/java.lang.ProcessImpl.start(ProcessImpl.java:244)
	at java.base/java.lang.ProcessBuilder.start(ProcessBuilder.java:1110)
Also:   hudson.remoting.Channel$CallSiteStackTrace: Remote call to builds33
		at hudson.remoting.Channel.attachCallSiteStackTrace(Channel.java:1923)
		at hudson.remoting.UserRequest$ExceptionResponse.retrieve(UserRequest.java:384)
		at hudson.remoting.Channel.call(Channel.java:1112)
		at hudson.Launcher$RemoteLauncher.launch(Launcher.java:1121)
		at hudson.Launcher$ProcStarter.start(Launcher.java:506)
		at hudson.Launcher$ProcStarter.join(Launcher.java:517)
		at hudson.tasks.Maven.perform(Maven.java:368)
		at hudson.tasks.BuildStepMonitor$1.perform(BuildStepMonitor.java:20)
		at hudson.model.AbstractBuild$AbstractBuildExecution.perform(AbstractBuild.java:818)
		at hudson.model.Build$BuildExecution.build(Build.java:199)
		at hudson.model.Build$BuildExecution.doRun(Build.java:164)
		at hudson.model.AbstractBuild$AbstractBuildExecution.run(AbstractBuild.java:527)
		at hudson.model.Run.execute(Run.java:1833)
		at hudson.model.FreeStyleBuild.run(FreeStyleBuild.java:44)
		at hudson.model.ResourceController.execute(ResourceController.java:101)
		at hudson.model.Executor.run(Executor.java:446)
Caused: java.io.IOException: Cannot run program "mvn" (in directory "<https://ci-builds.apache.org/job/Juneau/job/Juneau-Java-17/ws/")>: error=2, No such file or directory
	at java.base/java.lang.ProcessBuilder.start(ProcessBuilder.java:1143)
	at java.base/java.lang.ProcessBuilder.start(ProcessBuilder.java:1073)
	at hudson.Proc$LocalProc.<init>(Proc.java:252)
	at hudson.Proc$LocalProc.<init>(Proc.java:221)
	at hudson.Launcher$LocalLauncher.launch(Launcher.java:994)
	at hudson.Launcher$ProcStarter.start(Launcher.java:506)
	at hudson.Launcher$RemoteLaunchCallable.call(Launcher.java:1395)
	at hudson.Launcher$RemoteLaunchCallable.call(Launcher.java:1337)
	at hudson.remoting.UserRequest.perform(UserRequest.java:225)
	at hudson.remoting.UserRequest.perform(UserRequest.java:50)
	at hudson.remoting.Request$2.run(Request.java:391)
	at hudson.remoting.InterceptingExecutorService.lambda$wrap$0(InterceptingExecutorService.java:81)
	at java.base/java.util.concurrent.FutureTask.run(FutureTask.java:264)
	at java.base/java.util.concurrent.ThreadPoolExecutor.runWorker(ThreadPoolExecutor.java:1136)
	at java.base/java.util.concurrent.ThreadPoolExecutor$Worker.run(ThreadPoolExecutor.java:635)
	at java.base/java.lang.Thread.run(Thread.java:840)
Build step 'Invoke top-level Maven targets' marked build as failure
Recording test results
ERROR: Step ‘Publish JUnit test result report’ failed: No test report files were found. Configuration error?

Build failed in Jenkins: Juneau » Juneau-Java-17 #2697

Posted by Apache Jenkins Server <je...@builds.apache.org>.
See <https://ci-builds.apache.org/job/Juneau/job/Juneau-Java-17/2697/display/redirect?page=changes>

Changes:

[James Bognar] Harden RowAction.form GET URLs (WORK-J0527): substitute per-row {property} tokens before the confirmation GET, and refuse blank, residual, or .. paths the same way endpoints refuse malformed writes.


------------------------------------------
Started by an SCM change
Running as SYSTEM
[EnvInject] - Loading node environment variables.
Building remotely on builds58 (ubuntu ubuntu-avx) in workspace <https://ci-builds.apache.org/job/Juneau/job/Juneau-Java-17/ws/>
The recommended git tool is: NONE
No credentials specified
 > git rev-parse --resolve-git-dir <https://ci-builds.apache.org/job/Juneau/job/Juneau-Java-17/ws/.git> # timeout=10
Fetching changes from the remote Git repository
 > git config remote.origin.url https://github.com/apache/juneau.git # timeout=10
Fetching upstream changes from https://github.com/apache/juneau.git
 > git --version # timeout=10
 > git --version # 'git version 2.34.1'
 > git fetch --tags --force --progress -- https://github.com/apache/juneau.git +refs/heads/*:refs/remotes/origin/* # timeout=10
 > git rev-parse refs/remotes/origin/master^{commit} # timeout=10
Checking out Revision cb56843d180a7e11d9bc8dd89f3ca19dc5befc18 (refs/remotes/origin/master)
 > git config core.sparsecheckout # timeout=10
 > git checkout -f cb56843d180a7e11d9bc8dd89f3ca19dc5befc18 # timeout=10
Commit message: "Harden RowAction.form GET URLs (WORK-J0527): substitute per-row {property} tokens before the confirmation GET, and refuse blank, residual, or .. paths the same way endpoints refuse malformed writes."
 > git rev-list --no-walk e28041033e5f5b91cccdeb5e22806399d87b5a23 # timeout=10
[Juneau-Java-17] $ mvn clean install deploy javadoc:aggregate
FATAL: command execution failed
java.io.IOException: error=2, No such file or directory
	at java.base/java.lang.ProcessImpl.forkAndExec(Native Method)
	at java.base/java.lang.ProcessImpl.<init>(ProcessImpl.java:314)
	at java.base/java.lang.ProcessImpl.start(ProcessImpl.java:244)
	at java.base/java.lang.ProcessBuilder.start(ProcessBuilder.java:1110)
Also:   hudson.remoting.Channel$CallSiteStackTrace: Remote call to builds58
		at hudson.remoting.Channel.attachCallSiteStackTrace(Channel.java:1923)
		at hudson.remoting.UserRequest$ExceptionResponse.retrieve(UserRequest.java:384)
		at hudson.remoting.Channel.call(Channel.java:1112)
		at hudson.Launcher$RemoteLauncher.launch(Launcher.java:1121)
		at hudson.Launcher$ProcStarter.start(Launcher.java:506)
		at hudson.Launcher$ProcStarter.join(Launcher.java:517)
		at hudson.tasks.Maven.perform(Maven.java:368)
		at hudson.tasks.BuildStepMonitor$1.perform(BuildStepMonitor.java:20)
		at hudson.model.AbstractBuild$AbstractBuildExecution.perform(AbstractBuild.java:818)
		at hudson.model.Build$BuildExecution.build(Build.java:199)
		at hudson.model.Build$BuildExecution.doRun(Build.java:164)
		at hudson.model.AbstractBuild$AbstractBuildExecution.run(AbstractBuild.java:527)
		at hudson.model.Run.execute(Run.java:1833)
		at hudson.model.FreeStyleBuild.run(FreeStyleBuild.java:44)
		at hudson.model.ResourceController.execute(ResourceController.java:101)
		at hudson.model.Executor.run(Executor.java:446)
Caused: java.io.IOException: Cannot run program "mvn" (in directory "<https://ci-builds.apache.org/job/Juneau/job/Juneau-Java-17/ws/")>: error=2, No such file or directory
	at java.base/java.lang.ProcessBuilder.start(ProcessBuilder.java:1143)
	at java.base/java.lang.ProcessBuilder.start(ProcessBuilder.java:1073)
	at hudson.Proc$LocalProc.<init>(Proc.java:252)
	at hudson.Proc$LocalProc.<init>(Proc.java:221)
	at hudson.Launcher$LocalLauncher.launch(Launcher.java:994)
	at hudson.Launcher$ProcStarter.start(Launcher.java:506)
	at hudson.Launcher$RemoteLaunchCallable.call(Launcher.java:1395)
	at hudson.Launcher$RemoteLaunchCallable.call(Launcher.java:1337)
	at hudson.remoting.UserRequest.perform(UserRequest.java:225)
	at hudson.remoting.UserRequest.perform(UserRequest.java:50)
	at hudson.remoting.Request$2.run(Request.java:391)
	at hudson.remoting.InterceptingExecutorService.lambda$wrap$0(InterceptingExecutorService.java:81)
	at java.base/java.util.concurrent.FutureTask.run(FutureTask.java:264)
	at java.base/java.util.concurrent.ThreadPoolExecutor.runWorker(ThreadPoolExecutor.java:1136)
	at java.base/java.util.concurrent.ThreadPoolExecutor$Worker.run(ThreadPoolExecutor.java:635)
	at java.base/java.lang.Thread.run(Thread.java:840)
Build step 'Invoke top-level Maven targets' marked build as failure
Recording test results
[Checks API] No suitable checks publisher found.

Build failed in Jenkins: Juneau » Juneau-Java-17 #2696

Posted by Apache Jenkins Server <je...@builds.apache.org>.
See <https://ci-builds.apache.org/job/Juneau/job/Juneau-Java-17/2696/display/redirect?page=changes>

Changes:

[James Bognar] Retire row-detail headerActions (WORK-J0524): authors paint body buttons instead, and restrict SinkRenderAllowlist.assertAllowed to frozen built-in ids.


------------------------------------------
Started by an SCM change
Running as SYSTEM
[EnvInject] - Loading node environment variables.
Building remotely on builds58 (ubuntu ubuntu-avx) in workspace <https://ci-builds.apache.org/job/Juneau/job/Juneau-Java-17/ws/>
The recommended git tool is: NONE
No credentials specified
 > git rev-parse --resolve-git-dir <https://ci-builds.apache.org/job/Juneau/job/Juneau-Java-17/ws/.git> # timeout=10
Fetching changes from the remote Git repository
 > git config remote.origin.url https://github.com/apache/juneau.git # timeout=10
Fetching upstream changes from https://github.com/apache/juneau.git
 > git --version # timeout=10
 > git --version # 'git version 2.34.1'
 > git fetch --tags --force --progress -- https://github.com/apache/juneau.git +refs/heads/*:refs/remotes/origin/* # timeout=10
 > git rev-parse refs/remotes/origin/master^{commit} # timeout=10
Checking out Revision e28041033e5f5b91cccdeb5e22806399d87b5a23 (refs/remotes/origin/master)
 > git config core.sparsecheckout # timeout=10
 > git checkout -f e28041033e5f5b91cccdeb5e22806399d87b5a23 # timeout=10
Commit message: "Retire row-detail headerActions (WORK-J0524): authors paint body buttons instead, and restrict SinkRenderAllowlist.assertAllowed to frozen built-in ids."
 > git rev-list --no-walk 353b64f428b627e9c57da21e343a60a76408f504 # timeout=10
[Juneau-Java-17] $ mvn clean install deploy javadoc:aggregate
FATAL: command execution failed
java.io.IOException: error=2, No such file or directory
	at java.base/java.lang.ProcessImpl.forkAndExec(Native Method)
	at java.base/java.lang.ProcessImpl.<init>(ProcessImpl.java:314)
	at java.base/java.lang.ProcessImpl.start(ProcessImpl.java:244)
	at java.base/java.lang.ProcessBuilder.start(ProcessBuilder.java:1110)
Also:   hudson.remoting.Channel$CallSiteStackTrace: Remote call to builds58
		at hudson.remoting.Channel.attachCallSiteStackTrace(Channel.java:1923)
		at hudson.remoting.UserRequest$ExceptionResponse.retrieve(UserRequest.java:384)
		at hudson.remoting.Channel.call(Channel.java:1112)
		at hudson.Launcher$RemoteLauncher.launch(Launcher.java:1121)
		at hudson.Launcher$ProcStarter.start(Launcher.java:506)
		at hudson.Launcher$ProcStarter.join(Launcher.java:517)
		at hudson.tasks.Maven.perform(Maven.java:368)
		at hudson.tasks.BuildStepMonitor$1.perform(BuildStepMonitor.java:20)
		at hudson.model.AbstractBuild$AbstractBuildExecution.perform(AbstractBuild.java:818)
		at hudson.model.Build$BuildExecution.build(Build.java:199)
		at hudson.model.Build$BuildExecution.doRun(Build.java:164)
		at hudson.model.AbstractBuild$AbstractBuildExecution.run(AbstractBuild.java:527)
		at hudson.model.Run.execute(Run.java:1833)
		at hudson.model.FreeStyleBuild.run(FreeStyleBuild.java:44)
		at hudson.model.ResourceController.execute(ResourceController.java:101)
		at hudson.model.Executor.run(Executor.java:446)
Caused: java.io.IOException: Cannot run program "mvn" (in directory "<https://ci-builds.apache.org/job/Juneau/job/Juneau-Java-17/ws/")>: error=2, No such file or directory
	at java.base/java.lang.ProcessBuilder.start(ProcessBuilder.java:1143)
	at java.base/java.lang.ProcessBuilder.start(ProcessBuilder.java:1073)
	at hudson.Proc$LocalProc.<init>(Proc.java:252)
	at hudson.Proc$LocalProc.<init>(Proc.java:221)
	at hudson.Launcher$LocalLauncher.launch(Launcher.java:994)
	at hudson.Launcher$ProcStarter.start(Launcher.java:506)
	at hudson.Launcher$RemoteLaunchCallable.call(Launcher.java:1395)
	at hudson.Launcher$RemoteLaunchCallable.call(Launcher.java:1337)
	at hudson.remoting.UserRequest.perform(UserRequest.java:225)
	at hudson.remoting.UserRequest.perform(UserRequest.java:50)
	at hudson.remoting.Request$2.run(Request.java:391)
	at hudson.remoting.InterceptingExecutorService.lambda$wrap$0(InterceptingExecutorService.java:81)
	at java.base/java.util.concurrent.FutureTask.run(FutureTask.java:264)
	at java.base/java.util.concurrent.ThreadPoolExecutor.runWorker(ThreadPoolExecutor.java:1136)
	at java.base/java.util.concurrent.ThreadPoolExecutor$Worker.run(ThreadPoolExecutor.java:635)
	at java.base/java.lang.Thread.run(Thread.java:840)
Build step 'Invoke top-level Maven targets' marked build as failure
Recording test results
[Checks API] No suitable checks publisher found.

Build failed in Jenkins: Juneau » Juneau-Java-17 #2695

Posted by Apache Jenkins Server <je...@builds.apache.org>.
See <https://ci-builds.apache.org/job/Juneau/job/Juneau-Java-17/2695/display/redirect?page=changes>

Changes:

[James Bognar] Make row-detail region-only (WORK-J0522e): drop nested-table DetailSection/DetailField expanders in favor of named region populators, and align ExampleViewsEndToEnd_Test a01 to the region-only alerts expander.


------------------------------------------
Started by an SCM change
Running as SYSTEM
[EnvInject] - Loading node environment variables.
Building remotely on builds58 (ubuntu ubuntu-avx) in workspace <https://ci-builds.apache.org/job/Juneau/job/Juneau-Java-17/ws/>
The recommended git tool is: NONE
No credentials specified
 > git rev-parse --resolve-git-dir <https://ci-builds.apache.org/job/Juneau/job/Juneau-Java-17/ws/.git> # timeout=10
Fetching changes from the remote Git repository
 > git config remote.origin.url https://github.com/apache/juneau.git # timeout=10
Fetching upstream changes from https://github.com/apache/juneau.git
 > git --version # timeout=10
 > git --version # 'git version 2.34.1'
 > git fetch --tags --force --progress -- https://github.com/apache/juneau.git +refs/heads/*:refs/remotes/origin/* # timeout=10
 > git rev-parse refs/remotes/origin/master^{commit} # timeout=10
Checking out Revision 353b64f428b627e9c57da21e343a60a76408f504 (refs/remotes/origin/master)
 > git config core.sparsecheckout # timeout=10
 > git checkout -f 353b64f428b627e9c57da21e343a60a76408f504 # timeout=10
Commit message: "Make row-detail region-only (WORK-J0522e): drop nested-table DetailSection/DetailField expanders in favor of named region populators, and align ExampleViewsEndToEnd_Test a01 to the region-only alerts expander."
 > git rev-list --no-walk df81f656b9e52d494b4f9a51b63fbb25da9f3283 # timeout=10
[Juneau-Java-17] $ mvn clean install deploy javadoc:aggregate
FATAL: command execution failed
java.io.IOException: error=2, No such file or directory
	at java.base/java.lang.ProcessImpl.forkAndExec(Native Method)
	at java.base/java.lang.ProcessImpl.<init>(ProcessImpl.java:314)
	at java.base/java.lang.ProcessImpl.start(ProcessImpl.java:244)
	at java.base/java.lang.ProcessBuilder.start(ProcessBuilder.java:1110)
Also:   hudson.remoting.Channel$CallSiteStackTrace: Remote call to builds58
		at hudson.remoting.Channel.attachCallSiteStackTrace(Channel.java:1923)
		at hudson.remoting.UserRequest$ExceptionResponse.retrieve(UserRequest.java:384)
		at hudson.remoting.Channel.call(Channel.java:1112)
		at hudson.Launcher$RemoteLauncher.launch(Launcher.java:1121)
		at hudson.Launcher$ProcStarter.start(Launcher.java:506)
		at hudson.Launcher$ProcStarter.join(Launcher.java:517)
		at hudson.tasks.Maven.perform(Maven.java:368)
		at hudson.tasks.BuildStepMonitor$1.perform(BuildStepMonitor.java:20)
		at hudson.model.AbstractBuild$AbstractBuildExecution.perform(AbstractBuild.java:818)
		at hudson.model.Build$BuildExecution.build(Build.java:199)
		at hudson.model.Build$BuildExecution.doRun(Build.java:164)
		at hudson.model.AbstractBuild$AbstractBuildExecution.run(AbstractBuild.java:527)
		at hudson.model.Run.execute(Run.java:1833)
		at hudson.model.FreeStyleBuild.run(FreeStyleBuild.java:44)
		at hudson.model.ResourceController.execute(ResourceController.java:101)
		at hudson.model.Executor.run(Executor.java:446)
Caused: java.io.IOException: Cannot run program "mvn" (in directory "<https://ci-builds.apache.org/job/Juneau/job/Juneau-Java-17/ws/")>: error=2, No such file or directory
	at java.base/java.lang.ProcessBuilder.start(ProcessBuilder.java:1143)
	at java.base/java.lang.ProcessBuilder.start(ProcessBuilder.java:1073)
	at hudson.Proc$LocalProc.<init>(Proc.java:252)
	at hudson.Proc$LocalProc.<init>(Proc.java:221)
	at hudson.Launcher$LocalLauncher.launch(Launcher.java:994)
	at hudson.Launcher$ProcStarter.start(Launcher.java:506)
	at hudson.Launcher$RemoteLaunchCallable.call(Launcher.java:1395)
	at hudson.Launcher$RemoteLaunchCallable.call(Launcher.java:1337)
	at hudson.remoting.UserRequest.perform(UserRequest.java:225)
	at hudson.remoting.UserRequest.perform(UserRequest.java:50)
	at hudson.remoting.Request$2.run(Request.java:391)
	at hudson.remoting.InterceptingExecutorService.lambda$wrap$0(InterceptingExecutorService.java:81)
	at java.base/java.util.concurrent.FutureTask.run(FutureTask.java:264)
	at java.base/java.util.concurrent.ThreadPoolExecutor.runWorker(ThreadPoolExecutor.java:1136)
	at java.base/java.util.concurrent.ThreadPoolExecutor$Worker.run(ThreadPoolExecutor.java:635)
	at java.base/java.lang.Thread.run(Thread.java:840)
Build step 'Invoke top-level Maven targets' marked build as failure
Recording test results
[Checks API] No suitable checks publisher found.

Build failed in Jenkins: Juneau » Juneau-Java-17 #2694

Posted by Apache Jenkins Server <je...@builds.apache.org>.
See <https://ci-builds.apache.org/job/Juneau/job/Juneau-Java-17/2694/display/redirect?page=changes>

Changes:

[James Bognar] Split dual-use page-layout APIs (WORK-J0531): migrate example page bodies onto ViewSlot.envelope plus JuneauViews.regions.mount({ table }), and classify ViewTable/RegionDef/RegionTable factories as HTML renderers rather than page-body APIs.


------------------------------------------
Started by an SCM change
Running as SYSTEM
[EnvInject] - Loading node environment variables.
Building remotely on builds33 (ubuntu) in workspace <https://ci-builds.apache.org/job/Juneau/job/Juneau-Java-17/ws/>
The recommended git tool is: NONE
No credentials specified
 > git rev-parse --resolve-git-dir <https://ci-builds.apache.org/job/Juneau/job/Juneau-Java-17/ws/.git> # timeout=10
Fetching changes from the remote Git repository
 > git config remote.origin.url https://github.com/apache/juneau.git # timeout=10
Fetching upstream changes from https://github.com/apache/juneau.git
 > git --version # timeout=10
 > git --version # 'git version 2.34.1'
 > git fetch --tags --force --progress -- https://github.com/apache/juneau.git +refs/heads/*:refs/remotes/origin/* # timeout=10
 > git rev-parse refs/remotes/origin/master^{commit} # timeout=10
Checking out Revision df81f656b9e52d494b4f9a51b63fbb25da9f3283 (refs/remotes/origin/master)
 > git config core.sparsecheckout # timeout=10
 > git checkout -f df81f656b9e52d494b4f9a51b63fbb25da9f3283 # timeout=10
Commit message: "Split dual-use page-layout APIs (WORK-J0531): migrate example page bodies onto ViewSlot.envelope plus JuneauViews.regions.mount({ table }), and classify ViewTable/RegionDef/RegionTable factories as HTML renderers rather than page-body APIs."
 > git rev-list --no-walk d56a07c5ce693ad992be31bd17b9387a9cb8b944 # timeout=10
[Juneau-Java-17] $ mvn clean install deploy javadoc:aggregate
FATAL: command execution failed
java.io.IOException: error=2, No such file or directory
	at java.base/java.lang.ProcessImpl.forkAndExec(Native Method)
	at java.base/java.lang.ProcessImpl.<init>(ProcessImpl.java:314)
	at java.base/java.lang.ProcessImpl.start(ProcessImpl.java:244)
	at java.base/java.lang.ProcessBuilder.start(ProcessBuilder.java:1110)
Also:   hudson.remoting.Channel$CallSiteStackTrace: Remote call to builds33
		at hudson.remoting.Channel.attachCallSiteStackTrace(Channel.java:1923)
		at hudson.remoting.UserRequest$ExceptionResponse.retrieve(UserRequest.java:384)
		at hudson.remoting.Channel.call(Channel.java:1112)
		at hudson.Launcher$RemoteLauncher.launch(Launcher.java:1121)
		at hudson.Launcher$ProcStarter.start(Launcher.java:506)
		at hudson.Launcher$ProcStarter.join(Launcher.java:517)
		at hudson.tasks.Maven.perform(Maven.java:368)
		at hudson.tasks.BuildStepMonitor$1.perform(BuildStepMonitor.java:20)
		at hudson.model.AbstractBuild$AbstractBuildExecution.perform(AbstractBuild.java:818)
		at hudson.model.Build$BuildExecution.build(Build.java:199)
		at hudson.model.Build$BuildExecution.doRun(Build.java:164)
		at hudson.model.AbstractBuild$AbstractBuildExecution.run(AbstractBuild.java:527)
		at hudson.model.Run.execute(Run.java:1833)
		at hudson.model.FreeStyleBuild.run(FreeStyleBuild.java:44)
		at hudson.model.ResourceController.execute(ResourceController.java:101)
		at hudson.model.Executor.run(Executor.java:446)
Caused: java.io.IOException: Cannot run program "mvn" (in directory "<https://ci-builds.apache.org/job/Juneau/job/Juneau-Java-17/ws/")>: error=2, No such file or directory
	at java.base/java.lang.ProcessBuilder.start(ProcessBuilder.java:1143)
	at java.base/java.lang.ProcessBuilder.start(ProcessBuilder.java:1073)
	at hudson.Proc$LocalProc.<init>(Proc.java:252)
	at hudson.Proc$LocalProc.<init>(Proc.java:221)
	at hudson.Launcher$LocalLauncher.launch(Launcher.java:994)
	at hudson.Launcher$ProcStarter.start(Launcher.java:506)
	at hudson.Launcher$RemoteLaunchCallable.call(Launcher.java:1395)
	at hudson.Launcher$RemoteLaunchCallable.call(Launcher.java:1337)
	at hudson.remoting.UserRequest.perform(UserRequest.java:225)
	at hudson.remoting.UserRequest.perform(UserRequest.java:50)
	at hudson.remoting.Request$2.run(Request.java:391)
	at hudson.remoting.InterceptingExecutorService.lambda$wrap$0(InterceptingExecutorService.java:81)
	at java.base/java.util.concurrent.FutureTask.run(FutureTask.java:264)
	at java.base/java.util.concurrent.ThreadPoolExecutor.runWorker(ThreadPoolExecutor.java:1136)
	at java.base/java.util.concurrent.ThreadPoolExecutor$Worker.run(ThreadPoolExecutor.java:635)
	at java.base/java.lang.Thread.run(Thread.java:840)
Build step 'Invoke top-level Maven targets' marked build as failure
Recording test results
ERROR: Step ‘Publish JUnit test result report’ failed: No test report files were found. Configuration error?

Build failed in Jenkins: Juneau » Juneau-Java-17 #2693

Posted by Apache Jenkins Server <je...@builds.apache.org>.
See <https://ci-builds.apache.org/job/Juneau/job/Juneau-Java-17/2693/display/redirect?page=changes>

Changes:

[James Bognar] Add a Chromium SlotDetailChevron canary that clicks the first-column chevron and asserts the cloned child has a header and real height, covering the Gacks blank-panel tpl.content split that Node's DOM shim misses.


------------------------------------------
Started by an SCM change
Running as SYSTEM
[EnvInject] - Loading node environment variables.
Building remotely on builds33 (ubuntu) in workspace <https://ci-builds.apache.org/job/Juneau/job/Juneau-Java-17/ws/>
The recommended git tool is: NONE
No credentials specified
 > git rev-parse --resolve-git-dir <https://ci-builds.apache.org/job/Juneau/job/Juneau-Java-17/ws/.git> # timeout=10
Fetching changes from the remote Git repository
 > git config remote.origin.url https://github.com/apache/juneau.git # timeout=10
Fetching upstream changes from https://github.com/apache/juneau.git
 > git --version # timeout=10
 > git --version # 'git version 2.34.1'
 > git fetch --tags --force --progress -- https://github.com/apache/juneau.git +refs/heads/*:refs/remotes/origin/* # timeout=10
 > git rev-parse refs/remotes/origin/master^{commit} # timeout=10
Checking out Revision d56a07c5ce693ad992be31bd17b9387a9cb8b944 (refs/remotes/origin/master)
 > git config core.sparsecheckout # timeout=10
 > git checkout -f d56a07c5ce693ad992be31bd17b9387a9cb8b944 # timeout=10
Commit message: "Add a Chromium SlotDetailChevron canary that clicks the first-column chevron and asserts the cloned child has a header and real height, covering the Gacks blank-panel tpl.content split that Node's DOM shim misses."
 > git rev-list --no-walk a89cb215a30ef07b6b006458bee9e3c12e6f0eea # timeout=10
[Juneau-Java-17] $ mvn clean install deploy javadoc:aggregate
FATAL: command execution failed
java.io.IOException: error=2, No such file or directory
	at java.base/java.lang.ProcessImpl.forkAndExec(Native Method)
	at java.base/java.lang.ProcessImpl.<init>(ProcessImpl.java:314)
	at java.base/java.lang.ProcessImpl.start(ProcessImpl.java:244)
	at java.base/java.lang.ProcessBuilder.start(ProcessBuilder.java:1110)
Also:   hudson.remoting.Channel$CallSiteStackTrace: Remote call to builds33
		at hudson.remoting.Channel.attachCallSiteStackTrace(Channel.java:1923)
		at hudson.remoting.UserRequest$ExceptionResponse.retrieve(UserRequest.java:384)
		at hudson.remoting.Channel.call(Channel.java:1112)
		at hudson.Launcher$RemoteLauncher.launch(Launcher.java:1121)
		at hudson.Launcher$ProcStarter.start(Launcher.java:506)
		at hudson.Launcher$ProcStarter.join(Launcher.java:517)
		at hudson.tasks.Maven.perform(Maven.java:368)
		at hudson.tasks.BuildStepMonitor$1.perform(BuildStepMonitor.java:20)
		at hudson.model.AbstractBuild$AbstractBuildExecution.perform(AbstractBuild.java:818)
		at hudson.model.Build$BuildExecution.build(Build.java:199)
		at hudson.model.Build$BuildExecution.doRun(Build.java:164)
		at hudson.model.AbstractBuild$AbstractBuildExecution.run(AbstractBuild.java:527)
		at hudson.model.Run.execute(Run.java:1833)
		at hudson.model.FreeStyleBuild.run(FreeStyleBuild.java:44)
		at hudson.model.ResourceController.execute(ResourceController.java:101)
		at hudson.model.Executor.run(Executor.java:446)
Caused: java.io.IOException: Cannot run program "mvn" (in directory "<https://ci-builds.apache.org/job/Juneau/job/Juneau-Java-17/ws/")>: error=2, No such file or directory
	at java.base/java.lang.ProcessBuilder.start(ProcessBuilder.java:1143)
	at java.base/java.lang.ProcessBuilder.start(ProcessBuilder.java:1073)
	at hudson.Proc$LocalProc.<init>(Proc.java:252)
	at hudson.Proc$LocalProc.<init>(Proc.java:221)
	at hudson.Launcher$LocalLauncher.launch(Launcher.java:994)
	at hudson.Launcher$ProcStarter.start(Launcher.java:506)
	at hudson.Launcher$RemoteLaunchCallable.call(Launcher.java:1395)
	at hudson.Launcher$RemoteLaunchCallable.call(Launcher.java:1337)
	at hudson.remoting.UserRequest.perform(UserRequest.java:225)
	at hudson.remoting.UserRequest.perform(UserRequest.java:50)
	at hudson.remoting.Request$2.run(Request.java:391)
	at hudson.remoting.InterceptingExecutorService.lambda$wrap$0(InterceptingExecutorService.java:81)
	at java.base/java.util.concurrent.FutureTask.run(FutureTask.java:264)
	at java.base/java.util.concurrent.ThreadPoolExecutor.runWorker(ThreadPoolExecutor.java:1136)
	at java.base/java.util.concurrent.ThreadPoolExecutor$Worker.run(ThreadPoolExecutor.java:635)
	at java.base/java.lang.Thread.run(Thread.java:840)
Build step 'Invoke top-level Maven targets' marked build as failure
Recording test results
ERROR: Step ‘Publish JUnit test result report’ failed: No test report files were found. Configuration error?

Build failed in Jenkins: Juneau » Juneau-Java-17 #2692

Posted by Apache Jenkins Server <je...@builds.apache.org>.
See <https://ci-builds.apache.org/job/Juneau/job/Juneau-Java-17/2692/display/redirect>

Changes:


------------------------------------------
Started by user James Bognar
Running as SYSTEM
[EnvInject] - Loading node environment variables.
Building remotely on builds33 (ubuntu) in workspace <https://ci-builds.apache.org/job/Juneau/job/Juneau-Java-17/ws/>
The recommended git tool is: NONE
No credentials specified
Cloning the remote Git repository
Cloning repository https://github.com/apache/juneau.git
 > git init <https://ci-builds.apache.org/job/Juneau/job/Juneau-Java-17/ws/> # timeout=10
Fetching upstream changes from https://github.com/apache/juneau.git
 > git --version # timeout=10
 > git --version # 'git version 2.34.1'
 > git fetch --tags --force --progress -- https://github.com/apache/juneau.git +refs/heads/*:refs/remotes/origin/* # timeout=10
 > git config remote.origin.url https://github.com/apache/juneau.git # timeout=10
 > git config --add remote.origin.fetch +refs/heads/*:refs/remotes/origin/* # timeout=10
Avoid second fetch
 > git rev-parse refs/remotes/origin/master^{commit} # timeout=10
Checking out Revision a89cb215a30ef07b6b006458bee9e3c12e6f0eea (refs/remotes/origin/master)
 > git config core.sparsecheckout # timeout=10
 > git checkout -f a89cb215a30ef07b6b006458bee9e3c12e6f0eea # timeout=10
Commit message: "Append detail chrome into template.content so chevron expand clones a populated fragment (Gacks blank panel)."
 > git rev-list --no-walk a89cb215a30ef07b6b006458bee9e3c12e6f0eea # timeout=10
[Juneau-Java-17] $ mvn clean install deploy javadoc:aggregate
FATAL: command execution failed
java.io.IOException: error=2, No such file or directory
	at java.base/java.lang.ProcessImpl.forkAndExec(Native Method)
	at java.base/java.lang.ProcessImpl.<init>(ProcessImpl.java:314)
	at java.base/java.lang.ProcessImpl.start(ProcessImpl.java:244)
	at java.base/java.lang.ProcessBuilder.start(ProcessBuilder.java:1110)
Also:   hudson.remoting.Channel$CallSiteStackTrace: Remote call to builds33
		at hudson.remoting.Channel.attachCallSiteStackTrace(Channel.java:1923)
		at hudson.remoting.UserRequest$ExceptionResponse.retrieve(UserRequest.java:384)
		at hudson.remoting.Channel.call(Channel.java:1112)
		at hudson.Launcher$RemoteLauncher.launch(Launcher.java:1121)
		at hudson.Launcher$ProcStarter.start(Launcher.java:506)
		at hudson.Launcher$ProcStarter.join(Launcher.java:517)
		at hudson.tasks.Maven.perform(Maven.java:368)
		at hudson.tasks.BuildStepMonitor$1.perform(BuildStepMonitor.java:20)
		at hudson.model.AbstractBuild$AbstractBuildExecution.perform(AbstractBuild.java:818)
		at hudson.model.Build$BuildExecution.build(Build.java:199)
		at hudson.model.Build$BuildExecution.doRun(Build.java:164)
		at hudson.model.AbstractBuild$AbstractBuildExecution.run(AbstractBuild.java:527)
		at hudson.model.Run.execute(Run.java:1833)
		at hudson.model.FreeStyleBuild.run(FreeStyleBuild.java:44)
		at hudson.model.ResourceController.execute(ResourceController.java:101)
		at hudson.model.Executor.run(Executor.java:446)
Caused: java.io.IOException: Cannot run program "mvn" (in directory "<https://ci-builds.apache.org/job/Juneau/job/Juneau-Java-17/ws/")>: error=2, No such file or directory
	at java.base/java.lang.ProcessBuilder.start(ProcessBuilder.java:1143)
	at java.base/java.lang.ProcessBuilder.start(ProcessBuilder.java:1073)
	at hudson.Proc$LocalProc.<init>(Proc.java:252)
	at hudson.Proc$LocalProc.<init>(Proc.java:221)
	at hudson.Launcher$LocalLauncher.launch(Launcher.java:994)
	at hudson.Launcher$ProcStarter.start(Launcher.java:506)
	at hudson.Launcher$RemoteLaunchCallable.call(Launcher.java:1395)
	at hudson.Launcher$RemoteLaunchCallable.call(Launcher.java:1337)
	at hudson.remoting.UserRequest.perform(UserRequest.java:225)
	at hudson.remoting.UserRequest.perform(UserRequest.java:50)
	at hudson.remoting.Request$2.run(Request.java:391)
	at hudson.remoting.InterceptingExecutorService.lambda$wrap$0(InterceptingExecutorService.java:81)
	at java.base/java.util.concurrent.FutureTask.run(FutureTask.java:264)
	at java.base/java.util.concurrent.ThreadPoolExecutor.runWorker(ThreadPoolExecutor.java:1136)
	at java.base/java.util.concurrent.ThreadPoolExecutor$Worker.run(ThreadPoolExecutor.java:635)
	at java.base/java.lang.Thread.run(Thread.java:840)
Build step 'Invoke top-level Maven targets' marked build as failure
Recording test results
ERROR: Step ‘Publish JUnit test result report’ failed: No test report files were found. Configuration error?

Build failed in Jenkins: Juneau » Juneau-Java-17 #2691

Posted by Apache Jenkins Server <je...@builds.apache.org>.
See <https://ci-builds.apache.org/job/Juneau/job/Juneau-Java-17/2691/display/redirect?page=changes>

Changes:

[James Bognar] Append detail chrome into template.content so chevron expand clones a populated fragment (Gacks blank panel).


------------------------------------------
Started by an SCM change
Running as SYSTEM
[EnvInject] - Loading node environment variables.
Building remotely on builds33 (ubuntu) in workspace <https://ci-builds.apache.org/job/Juneau/job/Juneau-Java-17/ws/>
The recommended git tool is: NONE
No credentials specified
 > git rev-parse --resolve-git-dir <https://ci-builds.apache.org/job/Juneau/job/Juneau-Java-17/ws/.git> # timeout=10
Fetching changes from the remote Git repository
 > git config remote.origin.url https://github.com/apache/juneau.git # timeout=10
Fetching upstream changes from https://github.com/apache/juneau.git
 > git --version # timeout=10
 > git --version # 'git version 2.34.1'
 > git fetch --tags --force --progress -- https://github.com/apache/juneau.git +refs/heads/*:refs/remotes/origin/* # timeout=10
 > git rev-parse refs/remotes/origin/master^{commit} # timeout=10
Checking out Revision a89cb215a30ef07b6b006458bee9e3c12e6f0eea (refs/remotes/origin/master)
 > git config core.sparsecheckout # timeout=10
 > git checkout -f a89cb215a30ef07b6b006458bee9e3c12e6f0eea # timeout=10
Commit message: "Append detail chrome into template.content so chevron expand clones a populated fragment (Gacks blank panel)."
 > git rev-list --no-walk d837a04a41fbe5aac55aef17a51225e5cc119a4b # timeout=10
[Juneau-Java-17] $ mvn clean install deploy javadoc:aggregate
FATAL: command execution failed
java.io.IOException: error=2, No such file or directory
	at java.base/java.lang.ProcessImpl.forkAndExec(Native Method)
	at java.base/java.lang.ProcessImpl.<init>(ProcessImpl.java:314)
	at java.base/java.lang.ProcessImpl.start(ProcessImpl.java:244)
	at java.base/java.lang.ProcessBuilder.start(ProcessBuilder.java:1110)
Also:   hudson.remoting.Channel$CallSiteStackTrace: Remote call to builds33
		at hudson.remoting.Channel.attachCallSiteStackTrace(Channel.java:1923)
		at hudson.remoting.UserRequest$ExceptionResponse.retrieve(UserRequest.java:384)
		at hudson.remoting.Channel.call(Channel.java:1112)
		at hudson.Launcher$RemoteLauncher.launch(Launcher.java:1121)
		at hudson.Launcher$ProcStarter.start(Launcher.java:506)
		at hudson.Launcher$ProcStarter.join(Launcher.java:517)
		at hudson.tasks.Maven.perform(Maven.java:368)
		at hudson.tasks.BuildStepMonitor$1.perform(BuildStepMonitor.java:20)
		at hudson.model.AbstractBuild$AbstractBuildExecution.perform(AbstractBuild.java:818)
		at hudson.model.Build$BuildExecution.build(Build.java:199)
		at hudson.model.Build$BuildExecution.doRun(Build.java:164)
		at hudson.model.AbstractBuild$AbstractBuildExecution.run(AbstractBuild.java:527)
		at hudson.model.Run.execute(Run.java:1833)
		at hudson.model.FreeStyleBuild.run(FreeStyleBuild.java:44)
		at hudson.model.ResourceController.execute(ResourceController.java:101)
		at hudson.model.Executor.run(Executor.java:446)
Caused: java.io.IOException: Cannot run program "mvn" (in directory "<https://ci-builds.apache.org/job/Juneau/job/Juneau-Java-17/ws/")>: error=2, No such file or directory
	at java.base/java.lang.ProcessBuilder.start(ProcessBuilder.java:1143)
	at java.base/java.lang.ProcessBuilder.start(ProcessBuilder.java:1073)
	at hudson.Proc$LocalProc.<init>(Proc.java:252)
	at hudson.Proc$LocalProc.<init>(Proc.java:221)
	at hudson.Launcher$LocalLauncher.launch(Launcher.java:994)
	at hudson.Launcher$ProcStarter.start(Launcher.java:506)
	at hudson.Launcher$RemoteLaunchCallable.call(Launcher.java:1395)
	at hudson.Launcher$RemoteLaunchCallable.call(Launcher.java:1337)
	at hudson.remoting.UserRequest.perform(UserRequest.java:225)
	at hudson.remoting.UserRequest.perform(UserRequest.java:50)
	at hudson.remoting.Request$2.run(Request.java:391)
	at hudson.remoting.InterceptingExecutorService.lambda$wrap$0(InterceptingExecutorService.java:81)
	at java.base/java.util.concurrent.FutureTask.run(FutureTask.java:264)
	at java.base/java.util.concurrent.ThreadPoolExecutor.runWorker(ThreadPoolExecutor.java:1136)
	at java.base/java.util.concurrent.ThreadPoolExecutor$Worker.run(ThreadPoolExecutor.java:635)
	at java.base/java.lang.Thread.run(Thread.java:840)
Build step 'Invoke top-level Maven targets' marked build as failure
Recording test results
[Checks API] No suitable checks publisher found.

Build failed in Jenkins: Juneau » Juneau-Java-17 #2690

Posted by Apache Jenkins Server <je...@builds.apache.org>.
See <https://ci-builds.apache.org/job/Juneau/job/Juneau-Java-17/2690/display/redirect?page=changes>

Changes:

[James Bognar] Add ViewDef JSON table-in-slot (WORK-J0532): ViewSlot.envelope with SLOT_META 1 wrapping VIEW_META 4, JuneauViews.regions.mount({ table }), chevron/detail expander DOM plus declared {dataUrl} only, CSRF from a shell ancestor, and retarget source-shape handshake pins from beginInitTable to initTableFromDef.


------------------------------------------
Started by an SCM change
Running as SYSTEM
[EnvInject] - Loading node environment variables.
Building remotely on builds58 (ubuntu ubuntu-avx) in workspace <https://ci-builds.apache.org/job/Juneau/job/Juneau-Java-17/ws/>
The recommended git tool is: NONE
No credentials specified
 > git rev-parse --resolve-git-dir <https://ci-builds.apache.org/job/Juneau/job/Juneau-Java-17/ws/.git> # timeout=10
Fetching changes from the remote Git repository
 > git config remote.origin.url https://github.com/apache/juneau.git # timeout=10
Fetching upstream changes from https://github.com/apache/juneau.git
 > git --version # timeout=10
 > git --version # 'git version 2.34.1'
 > git fetch --tags --force --progress -- https://github.com/apache/juneau.git +refs/heads/*:refs/remotes/origin/* # timeout=10
 > git rev-parse refs/remotes/origin/master^{commit} # timeout=10
Checking out Revision d837a04a41fbe5aac55aef17a51225e5cc119a4b (refs/remotes/origin/master)
 > git config core.sparsecheckout # timeout=10
 > git checkout -f d837a04a41fbe5aac55aef17a51225e5cc119a4b # timeout=10
Commit message: "Add ViewDef JSON table-in-slot (WORK-J0532): ViewSlot.envelope with SLOT_META 1 wrapping VIEW_META 4, JuneauViews.regions.mount({ table }), chevron/detail expander DOM plus declared {dataUrl} only, CSRF from a shell ancestor, and retarget source-shape handshake pins from beginInitTable to initTableFromDef."
 > git rev-list --no-walk ce47ffd0b2a6cb74b86d17d02b1cfddd974e607e # timeout=10
[Juneau-Java-17] $ mvn clean install deploy javadoc:aggregate
FATAL: command execution failed
java.io.IOException: error=2, No such file or directory
	at java.base/java.lang.ProcessImpl.forkAndExec(Native Method)
	at java.base/java.lang.ProcessImpl.<init>(ProcessImpl.java:314)
	at java.base/java.lang.ProcessImpl.start(ProcessImpl.java:244)
	at java.base/java.lang.ProcessBuilder.start(ProcessBuilder.java:1110)
Also:   hudson.remoting.Channel$CallSiteStackTrace: Remote call to builds58
		at hudson.remoting.Channel.attachCallSiteStackTrace(Channel.java:1923)
		at hudson.remoting.UserRequest$ExceptionResponse.retrieve(UserRequest.java:384)
		at hudson.remoting.Channel.call(Channel.java:1112)
		at hudson.Launcher$RemoteLauncher.launch(Launcher.java:1121)
		at hudson.Launcher$ProcStarter.start(Launcher.java:506)
		at hudson.Launcher$ProcStarter.join(Launcher.java:517)
		at hudson.tasks.Maven.perform(Maven.java:368)
		at hudson.tasks.BuildStepMonitor$1.perform(BuildStepMonitor.java:20)
		at hudson.model.AbstractBuild$AbstractBuildExecution.perform(AbstractBuild.java:818)
		at hudson.model.Build$BuildExecution.build(Build.java:199)
		at hudson.model.Build$BuildExecution.doRun(Build.java:164)
		at hudson.model.AbstractBuild$AbstractBuildExecution.run(AbstractBuild.java:527)
		at hudson.model.Run.execute(Run.java:1833)
		at hudson.model.FreeStyleBuild.run(FreeStyleBuild.java:44)
		at hudson.model.ResourceController.execute(ResourceController.java:101)
		at hudson.model.Executor.run(Executor.java:446)
Caused: java.io.IOException: Cannot run program "mvn" (in directory "<https://ci-builds.apache.org/job/Juneau/job/Juneau-Java-17/ws/")>: error=2, No such file or directory
	at java.base/java.lang.ProcessBuilder.start(ProcessBuilder.java:1143)
	at java.base/java.lang.ProcessBuilder.start(ProcessBuilder.java:1073)
	at hudson.Proc$LocalProc.<init>(Proc.java:252)
	at hudson.Proc$LocalProc.<init>(Proc.java:221)
	at hudson.Launcher$LocalLauncher.launch(Launcher.java:994)
	at hudson.Launcher$ProcStarter.start(Launcher.java:506)
	at hudson.Launcher$RemoteLaunchCallable.call(Launcher.java:1395)
	at hudson.Launcher$RemoteLaunchCallable.call(Launcher.java:1337)
	at hudson.remoting.UserRequest.perform(UserRequest.java:225)
	at hudson.remoting.UserRequest.perform(UserRequest.java:50)
	at hudson.remoting.Request$2.run(Request.java:391)
	at hudson.remoting.InterceptingExecutorService.lambda$wrap$0(InterceptingExecutorService.java:81)
	at java.base/java.util.concurrent.FutureTask.run(FutureTask.java:264)
	at java.base/java.util.concurrent.ThreadPoolExecutor.runWorker(ThreadPoolExecutor.java:1136)
	at java.base/java.util.concurrent.ThreadPoolExecutor$Worker.run(ThreadPoolExecutor.java:635)
	at java.base/java.lang.Thread.run(Thread.java:840)
Build step 'Invoke top-level Maven targets' marked build as failure
Recording test results
[Checks API] No suitable checks publisher found.

Build failed in Jenkins: Juneau » Juneau-Java-17 #2689

Posted by Apache Jenkins Server <je...@builds.apache.org>.
See <https://ci-builds.apache.org/job/Juneau/job/Juneau-Java-17/2689/display/redirect?page=changes>

Changes:

[James Bognar] Retarget TableClipFree browser expand click to the first-column chevron after chevron-only expand.


------------------------------------------
Started by an SCM change
Running as SYSTEM
[EnvInject] - Loading node environment variables.
Building remotely on builds38 (ubuntu) in workspace <https://ci-builds.apache.org/job/Juneau/job/Juneau-Java-17/ws/>
The recommended git tool is: NONE
No credentials specified
 > git rev-parse --resolve-git-dir <https://ci-builds.apache.org/job/Juneau/job/Juneau-Java-17/ws/.git> # timeout=10
Fetching changes from the remote Git repository
 > git config remote.origin.url https://github.com/apache/juneau.git # timeout=10
Fetching upstream changes from https://github.com/apache/juneau.git
 > git --version # timeout=10
 > git --version # 'git version 2.34.1'
 > git fetch --tags --force --progress -- https://github.com/apache/juneau.git +refs/heads/*:refs/remotes/origin/* # timeout=10
 > git rev-parse refs/remotes/origin/master^{commit} # timeout=10
Checking out Revision ce47ffd0b2a6cb74b86d17d02b1cfddd974e607e (refs/remotes/origin/master)
 > git config core.sparsecheckout # timeout=10
 > git checkout -f ce47ffd0b2a6cb74b86d17d02b1cfddd974e607e # timeout=10
Commit message: "Retarget TableClipFree browser expand click to the first-column chevron after chevron-only expand."
 > git rev-list --no-walk 728ecb4c30af563c335061bf28fc12e9fe16c4a2 # timeout=10
[Juneau-Java-17] $ mvn clean install deploy javadoc:aggregate
FATAL: command execution failed
java.io.IOException: error=2, No such file or directory
	at java.base/java.lang.ProcessImpl.forkAndExec(Native Method)
	at java.base/java.lang.ProcessImpl.<init>(ProcessImpl.java:314)
	at java.base/java.lang.ProcessImpl.start(ProcessImpl.java:244)
	at java.base/java.lang.ProcessBuilder.start(ProcessBuilder.java:1110)
Also:   hudson.remoting.Channel$CallSiteStackTrace: Remote call to builds38
		at hudson.remoting.Channel.attachCallSiteStackTrace(Channel.java:1923)
		at hudson.remoting.UserRequest$ExceptionResponse.retrieve(UserRequest.java:384)
		at hudson.remoting.Channel.call(Channel.java:1112)
		at hudson.Launcher$RemoteLauncher.launch(Launcher.java:1121)
		at hudson.Launcher$ProcStarter.start(Launcher.java:506)
		at hudson.Launcher$ProcStarter.join(Launcher.java:517)
		at hudson.tasks.Maven.perform(Maven.java:368)
		at hudson.tasks.BuildStepMonitor$1.perform(BuildStepMonitor.java:20)
		at hudson.model.AbstractBuild$AbstractBuildExecution.perform(AbstractBuild.java:818)
		at hudson.model.Build$BuildExecution.build(Build.java:199)
		at hudson.model.Build$BuildExecution.doRun(Build.java:164)
		at hudson.model.AbstractBuild$AbstractBuildExecution.run(AbstractBuild.java:527)
		at hudson.model.Run.execute(Run.java:1833)
		at hudson.model.FreeStyleBuild.run(FreeStyleBuild.java:44)
		at hudson.model.ResourceController.execute(ResourceController.java:101)
		at hudson.model.Executor.run(Executor.java:446)
Caused: java.io.IOException: Cannot run program "mvn" (in directory "<https://ci-builds.apache.org/job/Juneau/job/Juneau-Java-17/ws/")>: error=2, No such file or directory
	at java.base/java.lang.ProcessBuilder.start(ProcessBuilder.java:1143)
	at java.base/java.lang.ProcessBuilder.start(ProcessBuilder.java:1073)
	at hudson.Proc$LocalProc.<init>(Proc.java:252)
	at hudson.Proc$LocalProc.<init>(Proc.java:221)
	at hudson.Launcher$LocalLauncher.launch(Launcher.java:994)
	at hudson.Launcher$ProcStarter.start(Launcher.java:506)
	at hudson.Launcher$RemoteLaunchCallable.call(Launcher.java:1395)
	at hudson.Launcher$RemoteLaunchCallable.call(Launcher.java:1337)
	at hudson.remoting.UserRequest.perform(UserRequest.java:225)
	at hudson.remoting.UserRequest.perform(UserRequest.java:50)
	at hudson.remoting.Request$2.run(Request.java:391)
	at hudson.remoting.InterceptingExecutorService.lambda$wrap$0(InterceptingExecutorService.java:81)
	at java.base/java.util.concurrent.FutureTask.run(FutureTask.java:264)
	at java.base/java.util.concurrent.ThreadPoolExecutor.runWorker(ThreadPoolExecutor.java:1136)
	at java.base/java.util.concurrent.ThreadPoolExecutor$Worker.run(ThreadPoolExecutor.java:635)
	at java.base/java.lang.Thread.run(Thread.java:840)
Build step 'Invoke top-level Maven targets' marked build as failure
Recording test results
[Checks API] No suitable checks publisher found.

Build failed in Jenkins: Juneau » Juneau-Java-17 #2688

Posted by Apache Jenkins Server <je...@builds.apache.org>.
See <https://ci-builds.apache.org/job/Juneau/job/Juneau-Java-17/2688/display/redirect?page=changes>

Changes:

[James Bognar] Restyle summary-table chrome so the first data row is the #FAFAF9 zebra stripe, drop tbody hairlines for #BBBBBB header and floor rules, paint ribbon and paging borders #CFD4D9, and expand or collapse detail rows from the first-column chevron only.


------------------------------------------
Started by an SCM change
Running as SYSTEM
[EnvInject] - Loading node environment variables.
Building remotely on builds38 (ubuntu) in workspace <https://ci-builds.apache.org/job/Juneau/job/Juneau-Java-17/ws/>
The recommended git tool is: NONE
No credentials specified
 > git rev-parse --resolve-git-dir <https://ci-builds.apache.org/job/Juneau/job/Juneau-Java-17/ws/.git> # timeout=10
Fetching changes from the remote Git repository
 > git config remote.origin.url https://github.com/apache/juneau.git # timeout=10
Fetching upstream changes from https://github.com/apache/juneau.git
 > git --version # timeout=10
 > git --version # 'git version 2.34.1'
 > git fetch --tags --force --progress -- https://github.com/apache/juneau.git +refs/heads/*:refs/remotes/origin/* # timeout=10
 > git rev-parse refs/remotes/origin/master^{commit} # timeout=10
Checking out Revision 728ecb4c30af563c335061bf28fc12e9fe16c4a2 (refs/remotes/origin/master)
 > git config core.sparsecheckout # timeout=10
 > git checkout -f 728ecb4c30af563c335061bf28fc12e9fe16c4a2 # timeout=10
Commit message: "Restyle summary-table chrome so the first data row is the #FAFAF9 zebra stripe, drop tbody hairlines for #BBBBBB header and floor rules, paint ribbon and paging borders #CFD4D9, and expand or collapse detail rows from the first-column chevron only."
 > git rev-list --no-walk 6fdea627efb811a8e50ceeb9bd5920e14625e1be # timeout=10
[Juneau-Java-17] $ mvn clean install deploy javadoc:aggregate
FATAL: command execution failed
java.io.IOException: error=2, No such file or directory
	at java.base/java.lang.ProcessImpl.forkAndExec(Native Method)
	at java.base/java.lang.ProcessImpl.<init>(ProcessImpl.java:314)
	at java.base/java.lang.ProcessImpl.start(ProcessImpl.java:244)
	at java.base/java.lang.ProcessBuilder.start(ProcessBuilder.java:1110)
Also:   hudson.remoting.Channel$CallSiteStackTrace: Remote call to builds38
		at hudson.remoting.Channel.attachCallSiteStackTrace(Channel.java:1923)
		at hudson.remoting.UserRequest$ExceptionResponse.retrieve(UserRequest.java:384)
		at hudson.remoting.Channel.call(Channel.java:1112)
		at hudson.Launcher$RemoteLauncher.launch(Launcher.java:1121)
		at hudson.Launcher$ProcStarter.start(Launcher.java:506)
		at hudson.Launcher$ProcStarter.join(Launcher.java:517)
		at hudson.tasks.Maven.perform(Maven.java:368)
		at hudson.tasks.BuildStepMonitor$1.perform(BuildStepMonitor.java:20)
		at hudson.model.AbstractBuild$AbstractBuildExecution.perform(AbstractBuild.java:818)
		at hudson.model.Build$BuildExecution.build(Build.java:199)
		at hudson.model.Build$BuildExecution.doRun(Build.java:164)
		at hudson.model.AbstractBuild$AbstractBuildExecution.run(AbstractBuild.java:527)
		at hudson.model.Run.execute(Run.java:1833)
		at hudson.model.FreeStyleBuild.run(FreeStyleBuild.java:44)
		at hudson.model.ResourceController.execute(ResourceController.java:101)
		at hudson.model.Executor.run(Executor.java:446)
Caused: java.io.IOException: Cannot run program "mvn" (in directory "<https://ci-builds.apache.org/job/Juneau/job/Juneau-Java-17/ws/")>: error=2, No such file or directory
	at java.base/java.lang.ProcessBuilder.start(ProcessBuilder.java:1143)
	at java.base/java.lang.ProcessBuilder.start(ProcessBuilder.java:1073)
	at hudson.Proc$LocalProc.<init>(Proc.java:252)
	at hudson.Proc$LocalProc.<init>(Proc.java:221)
	at hudson.Launcher$LocalLauncher.launch(Launcher.java:994)
	at hudson.Launcher$ProcStarter.start(Launcher.java:506)
	at hudson.Launcher$RemoteLaunchCallable.call(Launcher.java:1395)
	at hudson.Launcher$RemoteLaunchCallable.call(Launcher.java:1337)
	at hudson.remoting.UserRequest.perform(UserRequest.java:225)
	at hudson.remoting.UserRequest.perform(UserRequest.java:50)
	at hudson.remoting.Request$2.run(Request.java:391)
	at hudson.remoting.InterceptingExecutorService.lambda$wrap$0(InterceptingExecutorService.java:81)
	at java.base/java.util.concurrent.FutureTask.run(FutureTask.java:264)
	at java.base/java.util.concurrent.ThreadPoolExecutor.runWorker(ThreadPoolExecutor.java:1136)
	at java.base/java.util.concurrent.ThreadPoolExecutor$Worker.run(ThreadPoolExecutor.java:635)
	at java.base/java.lang.Thread.run(Thread.java:840)
Build step 'Invoke top-level Maven targets' marked build as failure
Recording test results
[Checks API] No suitable checks publisher found.

Build failed in Jenkins: Juneau » Juneau-Java-17 #2687

Posted by Apache Jenkins Server <je...@builds.apache.org>.
See <https://ci-builds.apache.org/job/Juneau/job/Juneau-Java-17/2687/display/redirect?page=changes>

Changes:

[James Bognar] Restyle HTML-slot page nav with page-nav accent/hairline/type tokens, a sticky .jc-chrome stack, and no cloud bar, match the table toolbar to IRS (wrap, 3.2px control radius, search border/placeholder, cell grid, #fafaf9 zebra excluding expander rows, no card borders), recolor Search focus with var(--jc-accent) and no #1589EE hex so the views no-palette contract holds, stamp compact .jc-tip at emit instead of native title, and let the e01 dialog tab-order expect header dismiss first.


------------------------------------------
Started by an SCM change
Running as SYSTEM
[EnvInject] - Loading node environment variables.
Building remotely on builds33 (ubuntu) in workspace <https://ci-builds.apache.org/job/Juneau/job/Juneau-Java-17/ws/>
The recommended git tool is: NONE
No credentials specified
 > git rev-parse --resolve-git-dir <https://ci-builds.apache.org/job/Juneau/job/Juneau-Java-17/ws/.git> # timeout=10
Fetching changes from the remote Git repository
 > git config remote.origin.url https://github.com/apache/juneau.git # timeout=10
Fetching upstream changes from https://github.com/apache/juneau.git
 > git --version # timeout=10
 > git --version # 'git version 2.34.1'
 > git fetch --tags --force --progress -- https://github.com/apache/juneau.git +refs/heads/*:refs/remotes/origin/* # timeout=10
 > git rev-parse refs/remotes/origin/master^{commit} # timeout=10
Checking out Revision 6fdea627efb811a8e50ceeb9bd5920e14625e1be (refs/remotes/origin/master)
 > git config core.sparsecheckout # timeout=10
 > git checkout -f 6fdea627efb811a8e50ceeb9bd5920e14625e1be # timeout=10
Commit message: "Restyle HTML-slot page nav with page-nav accent/hairline/type tokens, a sticky .jc-chrome stack, and no cloud bar, match the table toolbar to IRS (wrap, 3.2px control radius, search border/placeholder, cell grid, #fafaf9 zebra excluding expander rows, no card borders), recolor Search focus with var(--jc-accent) and no #1589EE hex so the views no-palette contract holds, stamp compact .jc-tip at emit instead of native title, and let the e01 dialog tab-order expect header dismiss first."
 > git rev-list --no-walk fbd594296ec3576c190a74fd0afe64719a1a3441 # timeout=10
[Juneau-Java-17] $ mvn clean install deploy javadoc:aggregate
FATAL: command execution failed
java.io.IOException: error=2, No such file or directory
	at java.base/java.lang.ProcessImpl.forkAndExec(Native Method)
	at java.base/java.lang.ProcessImpl.<init>(ProcessImpl.java:314)
	at java.base/java.lang.ProcessImpl.start(ProcessImpl.java:244)
	at java.base/java.lang.ProcessBuilder.start(ProcessBuilder.java:1110)
Also:   hudson.remoting.Channel$CallSiteStackTrace: Remote call to builds33
		at hudson.remoting.Channel.attachCallSiteStackTrace(Channel.java:1923)
		at hudson.remoting.UserRequest$ExceptionResponse.retrieve(UserRequest.java:384)
		at hudson.remoting.Channel.call(Channel.java:1112)
		at hudson.Launcher$RemoteLauncher.launch(Launcher.java:1121)
		at hudson.Launcher$ProcStarter.start(Launcher.java:506)
		at hudson.Launcher$ProcStarter.join(Launcher.java:517)
		at hudson.tasks.Maven.perform(Maven.java:368)
		at hudson.tasks.BuildStepMonitor$1.perform(BuildStepMonitor.java:20)
		at hudson.model.AbstractBuild$AbstractBuildExecution.perform(AbstractBuild.java:818)
		at hudson.model.Build$BuildExecution.build(Build.java:199)
		at hudson.model.Build$BuildExecution.doRun(Build.java:164)
		at hudson.model.AbstractBuild$AbstractBuildExecution.run(AbstractBuild.java:527)
		at hudson.model.Run.execute(Run.java:1833)
		at hudson.model.FreeStyleBuild.run(FreeStyleBuild.java:44)
		at hudson.model.ResourceController.execute(ResourceController.java:101)
		at hudson.model.Executor.run(Executor.java:446)
Caused: java.io.IOException: Cannot run program "mvn" (in directory "<https://ci-builds.apache.org/job/Juneau/job/Juneau-Java-17/ws/")>: error=2, No such file or directory
	at java.base/java.lang.ProcessBuilder.start(ProcessBuilder.java:1143)
	at java.base/java.lang.ProcessBuilder.start(ProcessBuilder.java:1073)
	at hudson.Proc$LocalProc.<init>(Proc.java:252)
	at hudson.Proc$LocalProc.<init>(Proc.java:221)
	at hudson.Launcher$LocalLauncher.launch(Launcher.java:994)
	at hudson.Launcher$ProcStarter.start(Launcher.java:506)
	at hudson.Launcher$RemoteLaunchCallable.call(Launcher.java:1395)
	at hudson.Launcher$RemoteLaunchCallable.call(Launcher.java:1337)
	at hudson.remoting.UserRequest.perform(UserRequest.java:225)
	at hudson.remoting.UserRequest.perform(UserRequest.java:50)
	at hudson.remoting.Request$2.run(Request.java:391)
	at hudson.remoting.InterceptingExecutorService.lambda$wrap$0(InterceptingExecutorService.java:81)
	at java.base/java.util.concurrent.FutureTask.run(FutureTask.java:264)
	at java.base/java.util.concurrent.ThreadPoolExecutor.runWorker(ThreadPoolExecutor.java:1136)
	at java.base/java.util.concurrent.ThreadPoolExecutor$Worker.run(ThreadPoolExecutor.java:635)
	at java.base/java.lang.Thread.run(Thread.java:840)
Build step 'Invoke top-level Maven targets' marked build as failure
Recording test results
[Checks API] No suitable checks publisher found.

Build failed in Jenkins: Juneau » Juneau-Java-17 #2686

Posted by Apache Jenkins Server <je...@builds.apache.org>.
See <https://ci-builds.apache.org/job/Juneau/job/Juneau-Java-17/2686/display/redirect?page=changes>

Changes:

[James Bognar] Add HTML-slot page first landing: region mount, author-marked page nav, and deprecate page-only Card/Page types, and narrow the expander url( test (WORK-J0530).


------------------------------------------
Started by an SCM change
Running as SYSTEM
[EnvInject] - Loading node environment variables.
Building remotely on builds33 (ubuntu) in workspace <https://ci-builds.apache.org/job/Juneau/job/Juneau-Java-17/ws/>
The recommended git tool is: NONE
No credentials specified
 > git rev-parse --resolve-git-dir <https://ci-builds.apache.org/job/Juneau/job/Juneau-Java-17/ws/.git> # timeout=10
Fetching changes from the remote Git repository
 > git config remote.origin.url https://github.com/apache/juneau.git # timeout=10
Fetching upstream changes from https://github.com/apache/juneau.git
 > git --version # timeout=10
 > git --version # 'git version 2.34.1'
 > git fetch --tags --force --progress -- https://github.com/apache/juneau.git +refs/heads/*:refs/remotes/origin/* # timeout=10
 > git rev-parse refs/remotes/origin/master^{commit} # timeout=10
Checking out Revision fbd594296ec3576c190a74fd0afe64719a1a3441 (refs/remotes/origin/master)
 > git config core.sparsecheckout # timeout=10
 > git checkout -f fbd594296ec3576c190a74fd0afe64719a1a3441 # timeout=10
Commit message: "Add HTML-slot page first landing: region mount, author-marked page nav, and deprecate page-only Card/Page types, and narrow the expander url( test (WORK-J0530)."
 > git rev-list --no-walk 35adff36bdea647234f01539ca97ecdfa18c6444 # timeout=10
[Juneau-Java-17] $ mvn clean install deploy javadoc:aggregate
FATAL: command execution failed
java.io.IOException: error=2, No such file or directory
	at java.base/java.lang.ProcessImpl.forkAndExec(Native Method)
	at java.base/java.lang.ProcessImpl.<init>(ProcessImpl.java:314)
	at java.base/java.lang.ProcessImpl.start(ProcessImpl.java:244)
	at java.base/java.lang.ProcessBuilder.start(ProcessBuilder.java:1110)
Also:   hudson.remoting.Channel$CallSiteStackTrace: Remote call to builds33
		at hudson.remoting.Channel.attachCallSiteStackTrace(Channel.java:1923)
		at hudson.remoting.UserRequest$ExceptionResponse.retrieve(UserRequest.java:384)
		at hudson.remoting.Channel.call(Channel.java:1112)
		at hudson.Launcher$RemoteLauncher.launch(Launcher.java:1121)
		at hudson.Launcher$ProcStarter.start(Launcher.java:506)
		at hudson.Launcher$ProcStarter.join(Launcher.java:517)
		at hudson.tasks.Maven.perform(Maven.java:368)
		at hudson.tasks.BuildStepMonitor$1.perform(BuildStepMonitor.java:20)
		at hudson.model.AbstractBuild$AbstractBuildExecution.perform(AbstractBuild.java:818)
		at hudson.model.Build$BuildExecution.build(Build.java:199)
		at hudson.model.Build$BuildExecution.doRun(Build.java:164)
		at hudson.model.AbstractBuild$AbstractBuildExecution.run(AbstractBuild.java:527)
		at hudson.model.Run.execute(Run.java:1833)
		at hudson.model.FreeStyleBuild.run(FreeStyleBuild.java:44)
		at hudson.model.ResourceController.execute(ResourceController.java:101)
		at hudson.model.Executor.run(Executor.java:446)
Caused: java.io.IOException: Cannot run program "mvn" (in directory "<https://ci-builds.apache.org/job/Juneau/job/Juneau-Java-17/ws/")>: error=2, No such file or directory
	at java.base/java.lang.ProcessBuilder.start(ProcessBuilder.java:1143)
	at java.base/java.lang.ProcessBuilder.start(ProcessBuilder.java:1073)
	at hudson.Proc$LocalProc.<init>(Proc.java:252)
	at hudson.Proc$LocalProc.<init>(Proc.java:221)
	at hudson.Launcher$LocalLauncher.launch(Launcher.java:994)
	at hudson.Launcher$ProcStarter.start(Launcher.java:506)
	at hudson.Launcher$RemoteLaunchCallable.call(Launcher.java:1395)
	at hudson.Launcher$RemoteLaunchCallable.call(Launcher.java:1337)
	at hudson.remoting.UserRequest.perform(UserRequest.java:225)
	at hudson.remoting.UserRequest.perform(UserRequest.java:50)
	at hudson.remoting.Request$2.run(Request.java:391)
	at hudson.remoting.InterceptingExecutorService.lambda$wrap$0(InterceptingExecutorService.java:81)
	at java.base/java.util.concurrent.FutureTask.run(FutureTask.java:264)
	at java.base/java.util.concurrent.ThreadPoolExecutor.runWorker(ThreadPoolExecutor.java:1136)
	at java.base/java.util.concurrent.ThreadPoolExecutor$Worker.run(ThreadPoolExecutor.java:635)
	at java.base/java.lang.Thread.run(Thread.java:840)
Build step 'Invoke top-level Maven targets' marked build as failure
Recording test results
[Checks API] No suitable checks publisher found.

Build failed in Jenkins: Juneau » Juneau-Java-17 #2685

Posted by Apache Jenkins Server <je...@builds.apache.org>.
See <https://ci-builds.apache.org/job/Juneau/job/Juneau-Java-17/2685/display/redirect?page=changes>

Changes:

[James Bognar] Restyle the views dialog with a header figure/dismiss row and themed form controls, paint paging-pill hover on the outer outline like ribbon, extend instant cursor tips to helper button rows, and spend --jc-chrome-font-size-3 on dialog form-row inputs so the chrome-scale contract scan stays green.


------------------------------------------
Started by an SCM change
Running as SYSTEM
[EnvInject] - Loading node environment variables.
Building remotely on builds38 (ubuntu) in workspace <https://ci-builds.apache.org/job/Juneau/job/Juneau-Java-17/ws/>
The recommended git tool is: NONE
No credentials specified
 > git rev-parse --resolve-git-dir <https://ci-builds.apache.org/job/Juneau/job/Juneau-Java-17/ws/.git> # timeout=10
Fetching changes from the remote Git repository
 > git config remote.origin.url https://github.com/apache/juneau.git # timeout=10
Fetching upstream changes from https://github.com/apache/juneau.git
 > git --version # timeout=10
 > git --version # 'git version 2.34.1'
 > git fetch --tags --force --progress -- https://github.com/apache/juneau.git +refs/heads/*:refs/remotes/origin/* # timeout=10
 > git rev-parse refs/remotes/origin/master^{commit} # timeout=10
Checking out Revision 35adff36bdea647234f01539ca97ecdfa18c6444 (refs/remotes/origin/master)
 > git config core.sparsecheckout # timeout=10
 > git checkout -f 35adff36bdea647234f01539ca97ecdfa18c6444 # timeout=10
Commit message: "Restyle the views dialog with a header figure/dismiss row and themed form controls, paint paging-pill hover on the outer outline like ribbon, extend instant cursor tips to helper button rows, and spend --jc-chrome-font-size-3 on dialog form-row inputs so the chrome-scale contract scan stays green."
 > git rev-list --no-walk 185ade2920518dae646bc115b90465221c214def # timeout=10
[Juneau-Java-17] $ mvn clean install deploy javadoc:aggregate
FATAL: command execution failed
java.io.IOException: error=2, No such file or directory
	at java.base/java.lang.ProcessImpl.forkAndExec(Native Method)
	at java.base/java.lang.ProcessImpl.<init>(ProcessImpl.java:314)
	at java.base/java.lang.ProcessImpl.start(ProcessImpl.java:244)
	at java.base/java.lang.ProcessBuilder.start(ProcessBuilder.java:1110)
Also:   hudson.remoting.Channel$CallSiteStackTrace: Remote call to builds38
		at hudson.remoting.Channel.attachCallSiteStackTrace(Channel.java:1923)
		at hudson.remoting.UserRequest$ExceptionResponse.retrieve(UserRequest.java:384)
		at hudson.remoting.Channel.call(Channel.java:1112)
		at hudson.Launcher$RemoteLauncher.launch(Launcher.java:1121)
		at hudson.Launcher$ProcStarter.start(Launcher.java:506)
		at hudson.Launcher$ProcStarter.join(Launcher.java:517)
		at hudson.tasks.Maven.perform(Maven.java:368)
		at hudson.tasks.BuildStepMonitor$1.perform(BuildStepMonitor.java:20)
		at hudson.model.AbstractBuild$AbstractBuildExecution.perform(AbstractBuild.java:818)
		at hudson.model.Build$BuildExecution.build(Build.java:199)
		at hudson.model.Build$BuildExecution.doRun(Build.java:164)
		at hudson.model.AbstractBuild$AbstractBuildExecution.run(AbstractBuild.java:527)
		at hudson.model.Run.execute(Run.java:1833)
		at hudson.model.FreeStyleBuild.run(FreeStyleBuild.java:44)
		at hudson.model.ResourceController.execute(ResourceController.java:101)
		at hudson.model.Executor.run(Executor.java:446)
Caused: java.io.IOException: Cannot run program "mvn" (in directory "<https://ci-builds.apache.org/job/Juneau/job/Juneau-Java-17/ws/")>: error=2, No such file or directory
	at java.base/java.lang.ProcessBuilder.start(ProcessBuilder.java:1143)
	at java.base/java.lang.ProcessBuilder.start(ProcessBuilder.java:1073)
	at hudson.Proc$LocalProc.<init>(Proc.java:252)
	at hudson.Proc$LocalProc.<init>(Proc.java:221)
	at hudson.Launcher$LocalLauncher.launch(Launcher.java:994)
	at hudson.Launcher$ProcStarter.start(Launcher.java:506)
	at hudson.Launcher$RemoteLaunchCallable.call(Launcher.java:1395)
	at hudson.Launcher$RemoteLaunchCallable.call(Launcher.java:1337)
	at hudson.remoting.UserRequest.perform(UserRequest.java:225)
	at hudson.remoting.UserRequest.perform(UserRequest.java:50)
	at hudson.remoting.Request$2.run(Request.java:391)
	at hudson.remoting.InterceptingExecutorService.lambda$wrap$0(InterceptingExecutorService.java:81)
	at java.base/java.util.concurrent.FutureTask.run(FutureTask.java:264)
	at java.base/java.util.concurrent.ThreadPoolExecutor.runWorker(ThreadPoolExecutor.java:1136)
	at java.base/java.util.concurrent.ThreadPoolExecutor$Worker.run(ThreadPoolExecutor.java:635)
	at java.base/java.lang.Thread.run(Thread.java:840)
Build step 'Invoke top-level Maven targets' marked build as failure
Recording test results
[Checks API] No suitable checks publisher found.

Build failed in Jenkins: Juneau » Juneau-Java-17 #2684

Posted by Apache Jenkins Server <je...@builds.apache.org>.
See <https://ci-builds.apache.org/job/Juneau/job/Juneau-Java-17/2684/display/redirect?page=changes>

Changes:

[James Bognar] WORK-J0529: add editable detail-field leaf and toast helpers, plus icon-only ribbon appearance and accent-border hover on paging/toolbar so inline edits and chrome hover match IRS.


------------------------------------------
Started by an SCM change
Running as SYSTEM
[EnvInject] - Loading node environment variables.
Building remotely on builds33 (ubuntu) in workspace <https://ci-builds.apache.org/job/Juneau/job/Juneau-Java-17/ws/>
The recommended git tool is: NONE
No credentials specified
 > git rev-parse --resolve-git-dir <https://ci-builds.apache.org/job/Juneau/job/Juneau-Java-17/ws/.git> # timeout=10
Fetching changes from the remote Git repository
 > git config remote.origin.url https://github.com/apache/juneau.git # timeout=10
Fetching upstream changes from https://github.com/apache/juneau.git
 > git --version # timeout=10
 > git --version # 'git version 2.34.1'
 > git fetch --tags --force --progress -- https://github.com/apache/juneau.git +refs/heads/*:refs/remotes/origin/* # timeout=10
 > git rev-parse refs/remotes/origin/master^{commit} # timeout=10
Checking out Revision 185ade2920518dae646bc115b90465221c214def (refs/remotes/origin/master)
 > git config core.sparsecheckout # timeout=10
 > git checkout -f 185ade2920518dae646bc115b90465221c214def # timeout=10
Commit message: "WORK-J0529: add editable detail-field leaf and toast helpers, plus icon-only ribbon appearance and accent-border hover on paging/toolbar so inline edits and chrome hover match IRS."
 > git rev-list --no-walk 95aa51ece9443a5865dbd7fa1c5b2009d74cd324 # timeout=10
[Juneau-Java-17] $ mvn clean install deploy javadoc:aggregate
FATAL: command execution failed
java.io.IOException: error=2, No such file or directory
	at java.base/java.lang.ProcessImpl.forkAndExec(Native Method)
	at java.base/java.lang.ProcessImpl.<init>(ProcessImpl.java:314)
	at java.base/java.lang.ProcessImpl.start(ProcessImpl.java:244)
	at java.base/java.lang.ProcessBuilder.start(ProcessBuilder.java:1110)
Also:   hudson.remoting.Channel$CallSiteStackTrace: Remote call to builds33
		at hudson.remoting.Channel.attachCallSiteStackTrace(Channel.java:1923)
		at hudson.remoting.UserRequest$ExceptionResponse.retrieve(UserRequest.java:384)
		at hudson.remoting.Channel.call(Channel.java:1112)
		at hudson.Launcher$RemoteLauncher.launch(Launcher.java:1121)
		at hudson.Launcher$ProcStarter.start(Launcher.java:506)
		at hudson.Launcher$ProcStarter.join(Launcher.java:517)
		at hudson.tasks.Maven.perform(Maven.java:368)
		at hudson.tasks.BuildStepMonitor$1.perform(BuildStepMonitor.java:20)
		at hudson.model.AbstractBuild$AbstractBuildExecution.perform(AbstractBuild.java:818)
		at hudson.model.Build$BuildExecution.build(Build.java:199)
		at hudson.model.Build$BuildExecution.doRun(Build.java:164)
		at hudson.model.AbstractBuild$AbstractBuildExecution.run(AbstractBuild.java:527)
		at hudson.model.Run.execute(Run.java:1833)
		at hudson.model.FreeStyleBuild.run(FreeStyleBuild.java:44)
		at hudson.model.ResourceController.execute(ResourceController.java:101)
		at hudson.model.Executor.run(Executor.java:446)
Caused: java.io.IOException: Cannot run program "mvn" (in directory "<https://ci-builds.apache.org/job/Juneau/job/Juneau-Java-17/ws/")>: error=2, No such file or directory
	at java.base/java.lang.ProcessBuilder.start(ProcessBuilder.java:1143)
	at java.base/java.lang.ProcessBuilder.start(ProcessBuilder.java:1073)
	at hudson.Proc$LocalProc.<init>(Proc.java:252)
	at hudson.Proc$LocalProc.<init>(Proc.java:221)
	at hudson.Launcher$LocalLauncher.launch(Launcher.java:994)
	at hudson.Launcher$ProcStarter.start(Launcher.java:506)
	at hudson.Launcher$RemoteLaunchCallable.call(Launcher.java:1395)
	at hudson.Launcher$RemoteLaunchCallable.call(Launcher.java:1337)
	at hudson.remoting.UserRequest.perform(UserRequest.java:225)
	at hudson.remoting.UserRequest.perform(UserRequest.java:50)
	at hudson.remoting.Request$2.run(Request.java:391)
	at hudson.remoting.InterceptingExecutorService.lambda$wrap$0(InterceptingExecutorService.java:81)
	at java.base/java.util.concurrent.FutureTask.run(FutureTask.java:264)
	at java.base/java.util.concurrent.ThreadPoolExecutor.runWorker(ThreadPoolExecutor.java:1136)
	at java.base/java.util.concurrent.ThreadPoolExecutor$Worker.run(ThreadPoolExecutor.java:635)
	at java.base/java.lang.Thread.run(Thread.java:840)
Build step 'Invoke top-level Maven targets' marked build as failure
Recording test results
[Checks API] No suitable checks publisher found.

Build failed in Jenkins: Juneau » Juneau-Java-17 #2683

Posted by Apache Jenkins Server <je...@builds.apache.org>.
See <https://ci-builds.apache.org/job/Juneau/job/Juneau-Java-17/2683/display/redirect?page=changes>

Changes:

[James Bognar] Add an instant cursor tooltip for ribbon and paging icons so Next page shows a light-grey bubble immediately instead of the delayed native title.


------------------------------------------
Started by an SCM change
Running as SYSTEM
[EnvInject] - Loading node environment variables.
Building remotely on builds33 (ubuntu) in workspace <https://ci-builds.apache.org/job/Juneau/job/Juneau-Java-17/ws/>
The recommended git tool is: NONE
No credentials specified
 > git rev-parse --resolve-git-dir <https://ci-builds.apache.org/job/Juneau/job/Juneau-Java-17/ws/.git> # timeout=10
Fetching changes from the remote Git repository
 > git config remote.origin.url https://github.com/apache/juneau.git # timeout=10
Fetching upstream changes from https://github.com/apache/juneau.git
 > git --version # timeout=10
 > git --version # 'git version 2.34.1'
 > git fetch --tags --force --progress -- https://github.com/apache/juneau.git +refs/heads/*:refs/remotes/origin/* # timeout=10
 > git rev-parse refs/remotes/origin/master^{commit} # timeout=10
Checking out Revision 95aa51ece9443a5865dbd7fa1c5b2009d74cd324 (refs/remotes/origin/master)
 > git config core.sparsecheckout # timeout=10
 > git checkout -f 95aa51ece9443a5865dbd7fa1c5b2009d74cd324 # timeout=10
Commit message: "Add an instant cursor tooltip for ribbon and paging icons so Next page shows a light-grey bubble immediately instead of the delayed native title."
 > git rev-list --no-walk 0e6926a145655ad78649b0ac449dd74993cbfcb2 # timeout=10
[Juneau-Java-17] $ mvn clean install deploy javadoc:aggregate
FATAL: command execution failed
java.io.IOException: error=2, No such file or directory
	at java.base/java.lang.ProcessImpl.forkAndExec(Native Method)
	at java.base/java.lang.ProcessImpl.<init>(ProcessImpl.java:314)
	at java.base/java.lang.ProcessImpl.start(ProcessImpl.java:244)
	at java.base/java.lang.ProcessBuilder.start(ProcessBuilder.java:1110)
Also:   hudson.remoting.Channel$CallSiteStackTrace: Remote call to builds33
		at hudson.remoting.Channel.attachCallSiteStackTrace(Channel.java:1923)
		at hudson.remoting.UserRequest$ExceptionResponse.retrieve(UserRequest.java:384)
		at hudson.remoting.Channel.call(Channel.java:1112)
		at hudson.Launcher$RemoteLauncher.launch(Launcher.java:1121)
		at hudson.Launcher$ProcStarter.start(Launcher.java:506)
		at hudson.Launcher$ProcStarter.join(Launcher.java:517)
		at hudson.tasks.Maven.perform(Maven.java:368)
		at hudson.tasks.BuildStepMonitor$1.perform(BuildStepMonitor.java:20)
		at hudson.model.AbstractBuild$AbstractBuildExecution.perform(AbstractBuild.java:818)
		at hudson.model.Build$BuildExecution.build(Build.java:199)
		at hudson.model.Build$BuildExecution.doRun(Build.java:164)
		at hudson.model.AbstractBuild$AbstractBuildExecution.run(AbstractBuild.java:527)
		at hudson.model.Run.execute(Run.java:1833)
		at hudson.model.FreeStyleBuild.run(FreeStyleBuild.java:44)
		at hudson.model.ResourceController.execute(ResourceController.java:101)
		at hudson.model.Executor.run(Executor.java:446)
Caused: java.io.IOException: Cannot run program "mvn" (in directory "<https://ci-builds.apache.org/job/Juneau/job/Juneau-Java-17/ws/")>: error=2, No such file or directory
	at java.base/java.lang.ProcessBuilder.start(ProcessBuilder.java:1143)
	at java.base/java.lang.ProcessBuilder.start(ProcessBuilder.java:1073)
	at hudson.Proc$LocalProc.<init>(Proc.java:252)
	at hudson.Proc$LocalProc.<init>(Proc.java:221)
	at hudson.Launcher$LocalLauncher.launch(Launcher.java:994)
	at hudson.Launcher$ProcStarter.start(Launcher.java:506)
	at hudson.Launcher$RemoteLaunchCallable.call(Launcher.java:1395)
	at hudson.Launcher$RemoteLaunchCallable.call(Launcher.java:1337)
	at hudson.remoting.UserRequest.perform(UserRequest.java:225)
	at hudson.remoting.UserRequest.perform(UserRequest.java:50)
	at hudson.remoting.Request$2.run(Request.java:391)
	at hudson.remoting.InterceptingExecutorService.lambda$wrap$0(InterceptingExecutorService.java:81)
	at java.base/java.util.concurrent.FutureTask.run(FutureTask.java:264)
	at java.base/java.util.concurrent.ThreadPoolExecutor.runWorker(ThreadPoolExecutor.java:1136)
	at java.base/java.util.concurrent.ThreadPoolExecutor$Worker.run(ThreadPoolExecutor.java:635)
	at java.base/java.lang.Thread.run(Thread.java:840)
Build step 'Invoke top-level Maven targets' marked build as failure
Recording test results
[Checks API] No suitable checks publisher found.

Build failed in Jenkins: Juneau » Juneau-Java-17 #2682

Posted by Apache Jenkins Server <je...@builds.apache.org>.
See <https://ci-builds.apache.org/job/Juneau/job/Juneau-Java-17/2682/display/redirect?page=changes>

Changes:

[James Bognar] Match toolbar Search border to ribbon controls: neutralize macOS UA input chrome (appearance:none) and paint ribbon/paging/search from shared --jc-control-border.


------------------------------------------
Started by an SCM change
Running as SYSTEM
[EnvInject] - Loading node environment variables.
Building remotely on builds40 (ubuntu) in workspace <https://ci-builds.apache.org/job/Juneau/job/Juneau-Java-17/ws/>
The recommended git tool is: NONE
No credentials specified
 > git rev-parse --resolve-git-dir <https://ci-builds.apache.org/job/Juneau/job/Juneau-Java-17/ws/.git> # timeout=10
Fetching changes from the remote Git repository
 > git config remote.origin.url https://github.com/apache/juneau.git # timeout=10
Fetching upstream changes from https://github.com/apache/juneau.git
 > git --version # timeout=10
 > git --version # 'git version 2.34.1'
 > git fetch --tags --force --progress -- https://github.com/apache/juneau.git +refs/heads/*:refs/remotes/origin/* # timeout=10
 > git rev-parse refs/remotes/origin/master^{commit} # timeout=10
Checking out Revision 0e6926a145655ad78649b0ac449dd74993cbfcb2 (refs/remotes/origin/master)
 > git config core.sparsecheckout # timeout=10
 > git checkout -f 0e6926a145655ad78649b0ac449dd74993cbfcb2 # timeout=10
Commit message: "Match toolbar Search border to ribbon controls: neutralize macOS UA input chrome (appearance:none) and paint ribbon/paging/search from shared --jc-control-border."
 > git rev-list --no-walk f950cae8581ee04531ea184c4d2a74a9274b351b # timeout=10
[Juneau-Java-17] $ mvn clean install deploy javadoc:aggregate
FATAL: command execution failed
java.io.IOException: error=2, No such file or directory
	at java.base/java.lang.ProcessImpl.forkAndExec(Native Method)
	at java.base/java.lang.ProcessImpl.<init>(ProcessImpl.java:314)
	at java.base/java.lang.ProcessImpl.start(ProcessImpl.java:244)
	at java.base/java.lang.ProcessBuilder.start(ProcessBuilder.java:1110)
Also:   hudson.remoting.Channel$CallSiteStackTrace: Remote call to builds40
		at hudson.remoting.Channel.attachCallSiteStackTrace(Channel.java:1923)
		at hudson.remoting.UserRequest$ExceptionResponse.retrieve(UserRequest.java:384)
		at hudson.remoting.Channel.call(Channel.java:1112)
		at hudson.Launcher$RemoteLauncher.launch(Launcher.java:1121)
		at hudson.Launcher$ProcStarter.start(Launcher.java:506)
		at hudson.Launcher$ProcStarter.join(Launcher.java:517)
		at hudson.tasks.Maven.perform(Maven.java:368)
		at hudson.tasks.BuildStepMonitor$1.perform(BuildStepMonitor.java:20)
		at hudson.model.AbstractBuild$AbstractBuildExecution.perform(AbstractBuild.java:818)
		at hudson.model.Build$BuildExecution.build(Build.java:199)
		at hudson.model.Build$BuildExecution.doRun(Build.java:164)
		at hudson.model.AbstractBuild$AbstractBuildExecution.run(AbstractBuild.java:527)
		at hudson.model.Run.execute(Run.java:1833)
		at hudson.model.FreeStyleBuild.run(FreeStyleBuild.java:44)
		at hudson.model.ResourceController.execute(ResourceController.java:101)
		at hudson.model.Executor.run(Executor.java:446)
Caused: java.io.IOException: Cannot run program "mvn" (in directory "<https://ci-builds.apache.org/job/Juneau/job/Juneau-Java-17/ws/")>: error=2, No such file or directory
	at java.base/java.lang.ProcessBuilder.start(ProcessBuilder.java:1143)
	at java.base/java.lang.ProcessBuilder.start(ProcessBuilder.java:1073)
	at hudson.Proc$LocalProc.<init>(Proc.java:252)
	at hudson.Proc$LocalProc.<init>(Proc.java:221)
	at hudson.Launcher$LocalLauncher.launch(Launcher.java:994)
	at hudson.Launcher$ProcStarter.start(Launcher.java:506)
	at hudson.Launcher$RemoteLaunchCallable.call(Launcher.java:1395)
	at hudson.Launcher$RemoteLaunchCallable.call(Launcher.java:1337)
	at hudson.remoting.UserRequest.perform(UserRequest.java:225)
	at hudson.remoting.UserRequest.perform(UserRequest.java:50)
	at hudson.remoting.Request$2.run(Request.java:391)
	at hudson.remoting.InterceptingExecutorService.lambda$wrap$0(InterceptingExecutorService.java:81)
	at java.base/java.util.concurrent.FutureTask.run(FutureTask.java:264)
	at java.base/java.util.concurrent.ThreadPoolExecutor.runWorker(ThreadPoolExecutor.java:1136)
	at java.base/java.util.concurrent.ThreadPoolExecutor$Worker.run(ThreadPoolExecutor.java:635)
	at java.base/java.lang.Thread.run(Thread.java:840)
Build step 'Invoke top-level Maven targets' marked build as failure
Recording test results
[Checks API] No suitable checks publisher found.

Build failed in Jenkins: Juneau » Juneau-Java-17 #2681

Posted by Apache Jenkins Server <je...@builds.apache.org>.
See <https://ci-builds.apache.org/job/Juneau/job/Juneau-Java-17/2681/display/redirect?page=changes>

Changes:

[James Bognar] Datatable IRS parity: body cell line-height 1.5 (Bootstrap body row height) and linked key-column font-weight 600 (one step under IRS .table-key bold).


------------------------------------------
Started by an SCM change
Running as SYSTEM
[EnvInject] - Loading node environment variables.
Building remotely on builds33 (ubuntu) in workspace <https://ci-builds.apache.org/job/Juneau/job/Juneau-Java-17/ws/>
The recommended git tool is: NONE
No credentials specified
 > git rev-parse --resolve-git-dir <https://ci-builds.apache.org/job/Juneau/job/Juneau-Java-17/ws/.git> # timeout=10
Fetching changes from the remote Git repository
 > git config remote.origin.url https://github.com/apache/juneau.git # timeout=10
Fetching upstream changes from https://github.com/apache/juneau.git
 > git --version # timeout=10
 > git --version # 'git version 2.34.1'
 > git fetch --tags --force --progress -- https://github.com/apache/juneau.git +refs/heads/*:refs/remotes/origin/* # timeout=10
 > git rev-parse refs/remotes/origin/master^{commit} # timeout=10
Checking out Revision f950cae8581ee04531ea184c4d2a74a9274b351b (refs/remotes/origin/master)
 > git config core.sparsecheckout # timeout=10
 > git checkout -f f950cae8581ee04531ea184c4d2a74a9274b351b # timeout=10
Commit message: "Datatable IRS parity: body cell line-height 1.5 (Bootstrap body row height) and linked key-column font-weight 600 (one step under IRS .table-key bold)."
 > git rev-list --no-walk b3ffb273e026466bcd3e10b35a1af9175a3d29de # timeout=10
[Juneau-Java-17] $ mvn clean install deploy javadoc:aggregate
FATAL: command execution failed
java.io.IOException: error=2, No such file or directory
	at java.base/java.lang.ProcessImpl.forkAndExec(Native Method)
	at java.base/java.lang.ProcessImpl.<init>(ProcessImpl.java:314)
	at java.base/java.lang.ProcessImpl.start(ProcessImpl.java:244)
	at java.base/java.lang.ProcessBuilder.start(ProcessBuilder.java:1110)
Also:   hudson.remoting.Channel$CallSiteStackTrace: Remote call to builds33
		at hudson.remoting.Channel.attachCallSiteStackTrace(Channel.java:1923)
		at hudson.remoting.UserRequest$ExceptionResponse.retrieve(UserRequest.java:384)
		at hudson.remoting.Channel.call(Channel.java:1112)
		at hudson.Launcher$RemoteLauncher.launch(Launcher.java:1121)
		at hudson.Launcher$ProcStarter.start(Launcher.java:506)
		at hudson.Launcher$ProcStarter.join(Launcher.java:517)
		at hudson.tasks.Maven.perform(Maven.java:368)
		at hudson.tasks.BuildStepMonitor$1.perform(BuildStepMonitor.java:20)
		at hudson.model.AbstractBuild$AbstractBuildExecution.perform(AbstractBuild.java:818)
		at hudson.model.Build$BuildExecution.build(Build.java:199)
		at hudson.model.Build$BuildExecution.doRun(Build.java:164)
		at hudson.model.AbstractBuild$AbstractBuildExecution.run(AbstractBuild.java:527)
		at hudson.model.Run.execute(Run.java:1833)
		at hudson.model.FreeStyleBuild.run(FreeStyleBuild.java:44)
		at hudson.model.ResourceController.execute(ResourceController.java:101)
		at hudson.model.Executor.run(Executor.java:446)
Caused: java.io.IOException: Cannot run program "mvn" (in directory "<https://ci-builds.apache.org/job/Juneau/job/Juneau-Java-17/ws/")>: error=2, No such file or directory
	at java.base/java.lang.ProcessBuilder.start(ProcessBuilder.java:1143)
	at java.base/java.lang.ProcessBuilder.start(ProcessBuilder.java:1073)
	at hudson.Proc$LocalProc.<init>(Proc.java:252)
	at hudson.Proc$LocalProc.<init>(Proc.java:221)
	at hudson.Launcher$LocalLauncher.launch(Launcher.java:994)
	at hudson.Launcher$ProcStarter.start(Launcher.java:506)
	at hudson.Launcher$RemoteLaunchCallable.call(Launcher.java:1395)
	at hudson.Launcher$RemoteLaunchCallable.call(Launcher.java:1337)
	at hudson.remoting.UserRequest.perform(UserRequest.java:225)
	at hudson.remoting.UserRequest.perform(UserRequest.java:50)
	at hudson.remoting.Request$2.run(Request.java:391)
	at hudson.remoting.InterceptingExecutorService.lambda$wrap$0(InterceptingExecutorService.java:81)
	at java.base/java.util.concurrent.FutureTask.run(FutureTask.java:264)
	at java.base/java.util.concurrent.ThreadPoolExecutor.runWorker(ThreadPoolExecutor.java:1136)
	at java.base/java.util.concurrent.ThreadPoolExecutor$Worker.run(ThreadPoolExecutor.java:635)
	at java.base/java.lang.Thread.run(Thread.java:840)
Build step 'Invoke top-level Maven targets' marked build as failure
Recording test results
[Checks API] No suitable checks publisher found.

Build failed in Jenkins: Juneau » Juneau-Java-17 #2680

Posted by Apache Jenkins Server <je...@builds.apache.org>.
See <https://ci-builds.apache.org/job/Juneau/job/Juneau-Java-17/2680/display/redirect?page=changes>

Changes:

[James Bognar] Datatable IRS parity: white column headers (table-header-bg → white), lighter disabled paging glyphs (#a3a3a3 composite of IRS #666@0.6), and search border #ced4da.


------------------------------------------
Started by an SCM change
Running as SYSTEM
[EnvInject] - Loading node environment variables.
Building remotely on builds33 (ubuntu) in workspace <https://ci-builds.apache.org/job/Juneau/job/Juneau-Java-17/ws/>
The recommended git tool is: NONE
No credentials specified
 > git rev-parse --resolve-git-dir <https://ci-builds.apache.org/job/Juneau/job/Juneau-Java-17/ws/.git> # timeout=10
Fetching changes from the remote Git repository
 > git config remote.origin.url https://github.com/apache/juneau.git # timeout=10
Fetching upstream changes from https://github.com/apache/juneau.git
 > git --version # timeout=10
 > git --version # 'git version 2.34.1'
 > git fetch --tags --force --progress -- https://github.com/apache/juneau.git +refs/heads/*:refs/remotes/origin/* # timeout=10
 > git rev-parse refs/remotes/origin/master^{commit} # timeout=10
Checking out Revision b3ffb273e026466bcd3e10b35a1af9175a3d29de (refs/remotes/origin/master)
 > git config core.sparsecheckout # timeout=10
 > git checkout -f b3ffb273e026466bcd3e10b35a1af9175a3d29de # timeout=10
Commit message: "Datatable IRS parity: white column headers (table-header-bg → white), lighter disabled paging glyphs (#a3a3a3 composite of IRS #666@0.6), and search border #ced4da."
 > git rev-list --no-walk 6ccf0719eb8226afffc858a79b7421597b7f6d31 # timeout=10
[Juneau-Java-17] $ mvn clean install deploy javadoc:aggregate
FATAL: command execution failed
java.io.IOException: error=2, No such file or directory
	at java.base/java.lang.ProcessImpl.forkAndExec(Native Method)
	at java.base/java.lang.ProcessImpl.<init>(ProcessImpl.java:314)
	at java.base/java.lang.ProcessImpl.start(ProcessImpl.java:244)
	at java.base/java.lang.ProcessBuilder.start(ProcessBuilder.java:1110)
Also:   hudson.remoting.Channel$CallSiteStackTrace: Remote call to builds33
		at hudson.remoting.Channel.attachCallSiteStackTrace(Channel.java:1923)
		at hudson.remoting.UserRequest$ExceptionResponse.retrieve(UserRequest.java:384)
		at hudson.remoting.Channel.call(Channel.java:1112)
		at hudson.Launcher$RemoteLauncher.launch(Launcher.java:1121)
		at hudson.Launcher$ProcStarter.start(Launcher.java:506)
		at hudson.Launcher$ProcStarter.join(Launcher.java:517)
		at hudson.tasks.Maven.perform(Maven.java:368)
		at hudson.tasks.BuildStepMonitor$1.perform(BuildStepMonitor.java:20)
		at hudson.model.AbstractBuild$AbstractBuildExecution.perform(AbstractBuild.java:818)
		at hudson.model.Build$BuildExecution.build(Build.java:199)
		at hudson.model.Build$BuildExecution.doRun(Build.java:164)
		at hudson.model.AbstractBuild$AbstractBuildExecution.run(AbstractBuild.java:527)
		at hudson.model.Run.execute(Run.java:1833)
		at hudson.model.FreeStyleBuild.run(FreeStyleBuild.java:44)
		at hudson.model.ResourceController.execute(ResourceController.java:101)
		at hudson.model.Executor.run(Executor.java:446)
Caused: java.io.IOException: Cannot run program "mvn" (in directory "<https://ci-builds.apache.org/job/Juneau/job/Juneau-Java-17/ws/")>: error=2, No such file or directory
	at java.base/java.lang.ProcessBuilder.start(ProcessBuilder.java:1143)
	at java.base/java.lang.ProcessBuilder.start(ProcessBuilder.java:1073)
	at hudson.Proc$LocalProc.<init>(Proc.java:252)
	at hudson.Proc$LocalProc.<init>(Proc.java:221)
	at hudson.Launcher$LocalLauncher.launch(Launcher.java:994)
	at hudson.Launcher$ProcStarter.start(Launcher.java:506)
	at hudson.Launcher$RemoteLaunchCallable.call(Launcher.java:1395)
	at hudson.Launcher$RemoteLaunchCallable.call(Launcher.java:1337)
	at hudson.remoting.UserRequest.perform(UserRequest.java:225)
	at hudson.remoting.UserRequest.perform(UserRequest.java:50)
	at hudson.remoting.Request$2.run(Request.java:391)
	at hudson.remoting.InterceptingExecutorService.lambda$wrap$0(InterceptingExecutorService.java:81)
	at java.base/java.util.concurrent.FutureTask.run(FutureTask.java:264)
	at java.base/java.util.concurrent.ThreadPoolExecutor.runWorker(ThreadPoolExecutor.java:1136)
	at java.base/java.util.concurrent.ThreadPoolExecutor$Worker.run(ThreadPoolExecutor.java:635)
	at java.base/java.lang.Thread.run(Thread.java:840)
Build step 'Invoke top-level Maven targets' marked build as failure
Recording test results
[Checks API] No suitable checks publisher found.

Build failed in Jenkins: Juneau » Juneau-Java-17 #2679

Posted by Apache Jenkins Server <je...@builds.apache.org>.
See <https://ci-builds.apache.org/job/Juneau/job/Juneau-Java-17/2679/display/redirect?page=changes>

Changes:

[James Bognar] Datatable/ribbon IRS parity: taller header cells + white header background, first-row-inclusive zebra striping, and 31px chrome control height (ribbon/paging/toolbar/input).


------------------------------------------
Started by an SCM change
Running as SYSTEM
[EnvInject] - Loading node environment variables.
Building remotely on builds33 (ubuntu) in workspace <https://ci-builds.apache.org/job/Juneau/job/Juneau-Java-17/ws/>
The recommended git tool is: NONE
No credentials specified
 > git rev-parse --resolve-git-dir <https://ci-builds.apache.org/job/Juneau/job/Juneau-Java-17/ws/.git> # timeout=10
Fetching changes from the remote Git repository
 > git config remote.origin.url https://github.com/apache/juneau.git # timeout=10
Fetching upstream changes from https://github.com/apache/juneau.git
 > git --version # timeout=10
 > git --version # 'git version 2.34.1'
 > git fetch --tags --force --progress -- https://github.com/apache/juneau.git +refs/heads/*:refs/remotes/origin/* # timeout=10
 > git rev-parse refs/remotes/origin/master^{commit} # timeout=10
Checking out Revision 6ccf0719eb8226afffc858a79b7421597b7f6d31 (refs/remotes/origin/master)
 > git config core.sparsecheckout # timeout=10
 > git checkout -f 6ccf0719eb8226afffc858a79b7421597b7f6d31 # timeout=10
Commit message: "Datatable/ribbon IRS parity: taller header cells + white header background, first-row-inclusive zebra striping, and 31px chrome control height (ribbon/paging/toolbar/input)."
 > git rev-list --no-walk 2a100489a85991e91cafb2c0fb759cf26ef3bce4 # timeout=10
[Juneau-Java-17] $ mvn clean install deploy javadoc:aggregate
FATAL: command execution failed
java.io.IOException: error=2, No such file or directory
	at java.base/java.lang.ProcessImpl.forkAndExec(Native Method)
	at java.base/java.lang.ProcessImpl.<init>(ProcessImpl.java:314)
	at java.base/java.lang.ProcessImpl.start(ProcessImpl.java:244)
	at java.base/java.lang.ProcessBuilder.start(ProcessBuilder.java:1110)
Also:   hudson.remoting.Channel$CallSiteStackTrace: Remote call to builds33
		at hudson.remoting.Channel.attachCallSiteStackTrace(Channel.java:1923)
		at hudson.remoting.UserRequest$ExceptionResponse.retrieve(UserRequest.java:384)
		at hudson.remoting.Channel.call(Channel.java:1112)
		at hudson.Launcher$RemoteLauncher.launch(Launcher.java:1121)
		at hudson.Launcher$ProcStarter.start(Launcher.java:506)
		at hudson.Launcher$ProcStarter.join(Launcher.java:517)
		at hudson.tasks.Maven.perform(Maven.java:368)
		at hudson.tasks.BuildStepMonitor$1.perform(BuildStepMonitor.java:20)
		at hudson.model.AbstractBuild$AbstractBuildExecution.perform(AbstractBuild.java:818)
		at hudson.model.Build$BuildExecution.build(Build.java:199)
		at hudson.model.Build$BuildExecution.doRun(Build.java:164)
		at hudson.model.AbstractBuild$AbstractBuildExecution.run(AbstractBuild.java:527)
		at hudson.model.Run.execute(Run.java:1833)
		at hudson.model.FreeStyleBuild.run(FreeStyleBuild.java:44)
		at hudson.model.ResourceController.execute(ResourceController.java:101)
		at hudson.model.Executor.run(Executor.java:446)
Caused: java.io.IOException: Cannot run program "mvn" (in directory "<https://ci-builds.apache.org/job/Juneau/job/Juneau-Java-17/ws/")>: error=2, No such file or directory
	at java.base/java.lang.ProcessBuilder.start(ProcessBuilder.java:1143)
	at java.base/java.lang.ProcessBuilder.start(ProcessBuilder.java:1073)
	at hudson.Proc$LocalProc.<init>(Proc.java:252)
	at hudson.Proc$LocalProc.<init>(Proc.java:221)
	at hudson.Launcher$LocalLauncher.launch(Launcher.java:994)
	at hudson.Launcher$ProcStarter.start(Launcher.java:506)
	at hudson.Launcher$RemoteLaunchCallable.call(Launcher.java:1395)
	at hudson.Launcher$RemoteLaunchCallable.call(Launcher.java:1337)
	at hudson.remoting.UserRequest.perform(UserRequest.java:225)
	at hudson.remoting.UserRequest.perform(UserRequest.java:50)
	at hudson.remoting.Request$2.run(Request.java:391)
	at hudson.remoting.InterceptingExecutorService.lambda$wrap$0(InterceptingExecutorService.java:81)
	at java.base/java.util.concurrent.FutureTask.run(FutureTask.java:264)
	at java.base/java.util.concurrent.ThreadPoolExecutor.runWorker(ThreadPoolExecutor.java:1136)
	at java.base/java.util.concurrent.ThreadPoolExecutor$Worker.run(ThreadPoolExecutor.java:635)
	at java.base/java.lang.Thread.run(Thread.java:840)
Build step 'Invoke top-level Maven targets' marked build as failure
Recording test results
[Checks API] No suitable checks publisher found.

Build failed in Jenkins: Juneau » Juneau-Java-17 #2678

Posted by Apache Jenkins Server <je...@builds.apache.org>.
See <https://ci-builds.apache.org/job/Juneau/job/Juneau-Java-17/2678/display/redirect?page=changes>

Changes:

[James Bognar] Fix row-detail region row-id resolution, datatable/paging-ribbon styling parity, and KeychainSecretStore test hardening


------------------------------------------
Started by an SCM change
Running as SYSTEM
[EnvInject] - Loading node environment variables.
Building remotely on builds33 (ubuntu) in workspace <https://ci-builds.apache.org/job/Juneau/job/Juneau-Java-17/ws/>
The recommended git tool is: NONE
No credentials specified
 > git rev-parse --resolve-git-dir <https://ci-builds.apache.org/job/Juneau/job/Juneau-Java-17/ws/.git> # timeout=10
Fetching changes from the remote Git repository
 > git config remote.origin.url https://github.com/apache/juneau.git # timeout=10
Fetching upstream changes from https://github.com/apache/juneau.git
 > git --version # timeout=10
 > git --version # 'git version 2.34.1'
 > git fetch --tags --force --progress -- https://github.com/apache/juneau.git +refs/heads/*:refs/remotes/origin/* # timeout=10
 > git rev-parse refs/remotes/origin/master^{commit} # timeout=10
Checking out Revision 2a100489a85991e91cafb2c0fb759cf26ef3bce4 (refs/remotes/origin/master)
 > git config core.sparsecheckout # timeout=10
 > git checkout -f 2a100489a85991e91cafb2c0fb759cf26ef3bce4 # timeout=10
Commit message: "Fix row-detail region row-id resolution, datatable/paging-ribbon styling parity, and KeychainSecretStore test hardening"
 > git rev-list --no-walk 26addd1ada7ba2a97cf2113bb0cd5396532936fa # timeout=10
[Juneau-Java-17] $ mvn clean install deploy javadoc:aggregate
FATAL: command execution failed
java.io.IOException: error=2, No such file or directory
	at java.base/java.lang.ProcessImpl.forkAndExec(Native Method)
	at java.base/java.lang.ProcessImpl.<init>(ProcessImpl.java:314)
	at java.base/java.lang.ProcessImpl.start(ProcessImpl.java:244)
	at java.base/java.lang.ProcessBuilder.start(ProcessBuilder.java:1110)
Also:   hudson.remoting.Channel$CallSiteStackTrace: Remote call to builds33
		at hudson.remoting.Channel.attachCallSiteStackTrace(Channel.java:1923)
		at hudson.remoting.UserRequest$ExceptionResponse.retrieve(UserRequest.java:384)
		at hudson.remoting.Channel.call(Channel.java:1112)
		at hudson.Launcher$RemoteLauncher.launch(Launcher.java:1121)
		at hudson.Launcher$ProcStarter.start(Launcher.java:506)
		at hudson.Launcher$ProcStarter.join(Launcher.java:517)
		at hudson.tasks.Maven.perform(Maven.java:368)
		at hudson.tasks.BuildStepMonitor$1.perform(BuildStepMonitor.java:20)
		at hudson.model.AbstractBuild$AbstractBuildExecution.perform(AbstractBuild.java:818)
		at hudson.model.Build$BuildExecution.build(Build.java:199)
		at hudson.model.Build$BuildExecution.doRun(Build.java:164)
		at hudson.model.AbstractBuild$AbstractBuildExecution.run(AbstractBuild.java:527)
		at hudson.model.Run.execute(Run.java:1833)
		at hudson.model.FreeStyleBuild.run(FreeStyleBuild.java:44)
		at hudson.model.ResourceController.execute(ResourceController.java:101)
		at hudson.model.Executor.run(Executor.java:446)
Caused: java.io.IOException: Cannot run program "mvn" (in directory "<https://ci-builds.apache.org/job/Juneau/job/Juneau-Java-17/ws/")>: error=2, No such file or directory
	at java.base/java.lang.ProcessBuilder.start(ProcessBuilder.java:1143)
	at java.base/java.lang.ProcessBuilder.start(ProcessBuilder.java:1073)
	at hudson.Proc$LocalProc.<init>(Proc.java:252)
	at hudson.Proc$LocalProc.<init>(Proc.java:221)
	at hudson.Launcher$LocalLauncher.launch(Launcher.java:994)
	at hudson.Launcher$ProcStarter.start(Launcher.java:506)
	at hudson.Launcher$RemoteLaunchCallable.call(Launcher.java:1395)
	at hudson.Launcher$RemoteLaunchCallable.call(Launcher.java:1337)
	at hudson.remoting.UserRequest.perform(UserRequest.java:225)
	at hudson.remoting.UserRequest.perform(UserRequest.java:50)
	at hudson.remoting.Request$2.run(Request.java:391)
	at hudson.remoting.InterceptingExecutorService.lambda$wrap$0(InterceptingExecutorService.java:81)
	at java.base/java.util.concurrent.FutureTask.run(FutureTask.java:264)
	at java.base/java.util.concurrent.ThreadPoolExecutor.runWorker(ThreadPoolExecutor.java:1136)
	at java.base/java.util.concurrent.ThreadPoolExecutor$Worker.run(ThreadPoolExecutor.java:635)
	at java.base/java.lang.Thread.run(Thread.java:840)
Build step 'Invoke top-level Maven targets' marked build as failure
Recording test results
[Checks API] No suitable checks publisher found.

Build failed in Jenkins: Juneau » Juneau-Java-17 #2677

Posted by Apache Jenkins Server <je...@builds.apache.org>.
See <https://ci-builds.apache.org/job/Juneau/job/Juneau-Java-17/2677/display/redirect?page=changes>

Changes:

[James Bognar] WORK-J0522d follow-up: fix section 11.1a ExampleInstancesRest.instanceDetail to emit its values map under the fields key (client region readers unwrap body.fields, not body.values); tighten ExampleInstancesRegion_Test's b01 assertion to the reader-consumed key.


------------------------------------------
Started by an SCM change
Running as SYSTEM
[EnvInject] - Loading node environment variables.
Building remotely on builds33 (ubuntu) in workspace <https://ci-builds.apache.org/job/Juneau/job/Juneau-Java-17/ws/>
The recommended git tool is: NONE
No credentials specified
 > git rev-parse --resolve-git-dir <https://ci-builds.apache.org/job/Juneau/job/Juneau-Java-17/ws/.git> # timeout=10
Fetching changes from the remote Git repository
 > git config remote.origin.url https://github.com/apache/juneau.git # timeout=10
Fetching upstream changes from https://github.com/apache/juneau.git
 > git --version # timeout=10
 > git --version # 'git version 2.34.1'
 > git fetch --tags --force --progress -- https://github.com/apache/juneau.git +refs/heads/*:refs/remotes/origin/* # timeout=10
 > git rev-parse refs/remotes/origin/master^{commit} # timeout=10
Checking out Revision 26addd1ada7ba2a97cf2113bb0cd5396532936fa (refs/remotes/origin/master)
 > git config core.sparsecheckout # timeout=10
 > git checkout -f 26addd1ada7ba2a97cf2113bb0cd5396532936fa # timeout=10
Commit message: "WORK-J0522d follow-up: fix section 11.1a ExampleInstancesRest.instanceDetail to emit its values map under the fields key (client region readers unwrap body.fields, not body.values); tighten ExampleInstancesRegion_Test's b01 assertion to the reader-consumed key."
 > git rev-list --no-walk b254e470b4f4d05c6ea6db52094d93bd97d3a579 # timeout=10
[Juneau-Java-17] $ mvn clean install deploy javadoc:aggregate
FATAL: command execution failed
java.io.IOException: error=2, No such file or directory
	at java.base/java.lang.ProcessImpl.forkAndExec(Native Method)
	at java.base/java.lang.ProcessImpl.<init>(ProcessImpl.java:314)
	at java.base/java.lang.ProcessImpl.start(ProcessImpl.java:244)
	at java.base/java.lang.ProcessBuilder.start(ProcessBuilder.java:1110)
Also:   hudson.remoting.Channel$CallSiteStackTrace: Remote call to builds33
		at hudson.remoting.Channel.attachCallSiteStackTrace(Channel.java:1923)
		at hudson.remoting.UserRequest$ExceptionResponse.retrieve(UserRequest.java:384)
		at hudson.remoting.Channel.call(Channel.java:1112)
		at hudson.Launcher$RemoteLauncher.launch(Launcher.java:1121)
		at hudson.Launcher$ProcStarter.start(Launcher.java:506)
		at hudson.Launcher$ProcStarter.join(Launcher.java:517)
		at hudson.tasks.Maven.perform(Maven.java:368)
		at hudson.tasks.BuildStepMonitor$1.perform(BuildStepMonitor.java:20)
		at hudson.model.AbstractBuild$AbstractBuildExecution.perform(AbstractBuild.java:818)
		at hudson.model.Build$BuildExecution.build(Build.java:199)
		at hudson.model.Build$BuildExecution.doRun(Build.java:164)
		at hudson.model.AbstractBuild$AbstractBuildExecution.run(AbstractBuild.java:527)
		at hudson.model.Run.execute(Run.java:1833)
		at hudson.model.FreeStyleBuild.run(FreeStyleBuild.java:44)
		at hudson.model.ResourceController.execute(ResourceController.java:101)
		at hudson.model.Executor.run(Executor.java:446)
Caused: java.io.IOException: Cannot run program "mvn" (in directory "<https://ci-builds.apache.org/job/Juneau/job/Juneau-Java-17/ws/")>: error=2, No such file or directory
	at java.base/java.lang.ProcessBuilder.start(ProcessBuilder.java:1143)
	at java.base/java.lang.ProcessBuilder.start(ProcessBuilder.java:1073)
	at hudson.Proc$LocalProc.<init>(Proc.java:252)
	at hudson.Proc$LocalProc.<init>(Proc.java:221)
	at hudson.Launcher$LocalLauncher.launch(Launcher.java:994)
	at hudson.Launcher$ProcStarter.start(Launcher.java:506)
	at hudson.Launcher$RemoteLaunchCallable.call(Launcher.java:1395)
	at hudson.Launcher$RemoteLaunchCallable.call(Launcher.java:1337)
	at hudson.remoting.UserRequest.perform(UserRequest.java:225)
	at hudson.remoting.UserRequest.perform(UserRequest.java:50)
	at hudson.remoting.Request$2.run(Request.java:391)
	at hudson.remoting.InterceptingExecutorService.lambda$wrap$0(InterceptingExecutorService.java:81)
	at java.base/java.util.concurrent.FutureTask.run(FutureTask.java:264)
	at java.base/java.util.concurrent.ThreadPoolExecutor.runWorker(ThreadPoolExecutor.java:1136)
	at java.base/java.util.concurrent.ThreadPoolExecutor$Worker.run(ThreadPoolExecutor.java:635)
	at java.base/java.lang.Thread.run(Thread.java:840)
Build step 'Invoke top-level Maven targets' marked build as failure
Recording test results
[Checks API] No suitable checks publisher found.

Build failed in Jenkins: Juneau » Juneau-Java-17 #2676

Posted by Apache Jenkins Server <je...@builds.apache.org>.
See <https://ci-builds.apache.org/job/Juneau/job/Juneau-Java-17/2676/display/redirect?page=changes>

Changes:

[James Bognar] WORK-J0525: REST-layer Widget.validate() serving-path hook


------------------------------------------
Started by an SCM change
Running as SYSTEM
[EnvInject] - Loading node environment variables.
Building remotely on builds33 (ubuntu) in workspace <https://ci-builds.apache.org/job/Juneau/job/Juneau-Java-17/ws/>
The recommended git tool is: NONE
No credentials specified
 > git rev-parse --resolve-git-dir <https://ci-builds.apache.org/job/Juneau/job/Juneau-Java-17/ws/.git> # timeout=10
Fetching changes from the remote Git repository
 > git config remote.origin.url https://github.com/apache/juneau.git # timeout=10
Fetching upstream changes from https://github.com/apache/juneau.git
 > git --version # timeout=10
 > git --version # 'git version 2.34.1'
 > git fetch --tags --force --progress -- https://github.com/apache/juneau.git +refs/heads/*:refs/remotes/origin/* # timeout=10
 > git rev-parse refs/remotes/origin/master^{commit} # timeout=10
Checking out Revision b254e470b4f4d05c6ea6db52094d93bd97d3a579 (refs/remotes/origin/master)
 > git config core.sparsecheckout # timeout=10
 > git checkout -f b254e470b4f4d05c6ea6db52094d93bd97d3a579 # timeout=10
Commit message: "WORK-J0525: REST-layer Widget.validate() serving-path hook"
 > git rev-list --no-walk d9c32858f96fc53282afc746c1220170d5cac59c # timeout=10
[Juneau-Java-17] $ mvn clean install deploy javadoc:aggregate
FATAL: command execution failed
java.io.IOException: error=2, No such file or directory
	at java.base/java.lang.ProcessImpl.forkAndExec(Native Method)
	at java.base/java.lang.ProcessImpl.<init>(ProcessImpl.java:314)
	at java.base/java.lang.ProcessImpl.start(ProcessImpl.java:244)
	at java.base/java.lang.ProcessBuilder.start(ProcessBuilder.java:1110)
Also:   hudson.remoting.Channel$CallSiteStackTrace: Remote call to builds33
		at hudson.remoting.Channel.attachCallSiteStackTrace(Channel.java:1923)
		at hudson.remoting.UserRequest$ExceptionResponse.retrieve(UserRequest.java:384)
		at hudson.remoting.Channel.call(Channel.java:1112)
		at hudson.Launcher$RemoteLauncher.launch(Launcher.java:1121)
		at hudson.Launcher$ProcStarter.start(Launcher.java:506)
		at hudson.Launcher$ProcStarter.join(Launcher.java:517)
		at hudson.tasks.Maven.perform(Maven.java:368)
		at hudson.tasks.BuildStepMonitor$1.perform(BuildStepMonitor.java:20)
		at hudson.model.AbstractBuild$AbstractBuildExecution.perform(AbstractBuild.java:818)
		at hudson.model.Build$BuildExecution.build(Build.java:199)
		at hudson.model.Build$BuildExecution.doRun(Build.java:164)
		at hudson.model.AbstractBuild$AbstractBuildExecution.run(AbstractBuild.java:527)
		at hudson.model.Run.execute(Run.java:1833)
		at hudson.model.FreeStyleBuild.run(FreeStyleBuild.java:44)
		at hudson.model.ResourceController.execute(ResourceController.java:101)
		at hudson.model.Executor.run(Executor.java:446)
Caused: java.io.IOException: Cannot run program "mvn" (in directory "<https://ci-builds.apache.org/job/Juneau/job/Juneau-Java-17/ws/")>: error=2, No such file or directory
	at java.base/java.lang.ProcessBuilder.start(ProcessBuilder.java:1143)
	at java.base/java.lang.ProcessBuilder.start(ProcessBuilder.java:1073)
	at hudson.Proc$LocalProc.<init>(Proc.java:252)
	at hudson.Proc$LocalProc.<init>(Proc.java:221)
	at hudson.Launcher$LocalLauncher.launch(Launcher.java:994)
	at hudson.Launcher$ProcStarter.start(Launcher.java:506)
	at hudson.Launcher$RemoteLaunchCallable.call(Launcher.java:1395)
	at hudson.Launcher$RemoteLaunchCallable.call(Launcher.java:1337)
	at hudson.remoting.UserRequest.perform(UserRequest.java:225)
	at hudson.remoting.UserRequest.perform(UserRequest.java:50)
	at hudson.remoting.Request$2.run(Request.java:391)
	at hudson.remoting.InterceptingExecutorService.lambda$wrap$0(InterceptingExecutorService.java:81)
	at java.base/java.util.concurrent.FutureTask.run(FutureTask.java:264)
	at java.base/java.util.concurrent.ThreadPoolExecutor.runWorker(ThreadPoolExecutor.java:1136)
	at java.base/java.util.concurrent.ThreadPoolExecutor$Worker.run(ThreadPoolExecutor.java:635)
	at java.base/java.lang.Thread.run(Thread.java:840)
Build step 'Invoke top-level Maven targets' marked build as failure
Recording test results
[Checks API] No suitable checks publisher found.

Build failed in Jenkins: Juneau » Juneau-Java-17 #2675

Posted by Apache Jenkins Server <je...@builds.apache.org>.
See <https://ci-builds.apache.org/job/Juneau/job/Juneau-Java-17/2675/display/redirect?page=changes>

Changes:

[James Bognar] WORK-J0521: Write-path URL-safety hardening for RowAction.endpoint {property} substitution


------------------------------------------
Started by an SCM change
Running as SYSTEM
[EnvInject] - Loading node environment variables.
Building remotely on builds33 (ubuntu) in workspace <https://ci-builds.apache.org/job/Juneau/job/Juneau-Java-17/ws/>
The recommended git tool is: NONE
No credentials specified
 > git rev-parse --resolve-git-dir <https://ci-builds.apache.org/job/Juneau/job/Juneau-Java-17/ws/.git> # timeout=10
Fetching changes from the remote Git repository
 > git config remote.origin.url https://github.com/apache/juneau.git # timeout=10
Fetching upstream changes from https://github.com/apache/juneau.git
 > git --version # timeout=10
 > git --version # 'git version 2.34.1'
 > git fetch --tags --force --progress -- https://github.com/apache/juneau.git +refs/heads/*:refs/remotes/origin/* # timeout=10
 > git rev-parse refs/remotes/origin/master^{commit} # timeout=10
Checking out Revision d9c32858f96fc53282afc746c1220170d5cac59c (refs/remotes/origin/master)
 > git config core.sparsecheckout # timeout=10
 > git checkout -f d9c32858f96fc53282afc746c1220170d5cac59c # timeout=10
Commit message: "WORK-J0521: Write-path URL-safety hardening for RowAction.endpoint {property} substitution"
 > git rev-list --no-walk 7139e1be6cebe5c07c36c74ca3e5217389383c35 # timeout=10
[Juneau-Java-17] $ mvn clean install deploy javadoc:aggregate
FATAL: command execution failed
java.io.IOException: error=2, No such file or directory
	at java.base/java.lang.ProcessImpl.forkAndExec(Native Method)
	at java.base/java.lang.ProcessImpl.<init>(ProcessImpl.java:314)
	at java.base/java.lang.ProcessImpl.start(ProcessImpl.java:244)
	at java.base/java.lang.ProcessBuilder.start(ProcessBuilder.java:1110)
Also:   hudson.remoting.Channel$CallSiteStackTrace: Remote call to builds33
		at hudson.remoting.Channel.attachCallSiteStackTrace(Channel.java:1923)
		at hudson.remoting.UserRequest$ExceptionResponse.retrieve(UserRequest.java:384)
		at hudson.remoting.Channel.call(Channel.java:1112)
		at hudson.Launcher$RemoteLauncher.launch(Launcher.java:1121)
		at hudson.Launcher$ProcStarter.start(Launcher.java:506)
		at hudson.Launcher$ProcStarter.join(Launcher.java:517)
		at hudson.tasks.Maven.perform(Maven.java:368)
		at hudson.tasks.BuildStepMonitor$1.perform(BuildStepMonitor.java:20)
		at hudson.model.AbstractBuild$AbstractBuildExecution.perform(AbstractBuild.java:818)
		at hudson.model.Build$BuildExecution.build(Build.java:199)
		at hudson.model.Build$BuildExecution.doRun(Build.java:164)
		at hudson.model.AbstractBuild$AbstractBuildExecution.run(AbstractBuild.java:527)
		at hudson.model.Run.execute(Run.java:1833)
		at hudson.model.FreeStyleBuild.run(FreeStyleBuild.java:44)
		at hudson.model.ResourceController.execute(ResourceController.java:101)
		at hudson.model.Executor.run(Executor.java:446)
Caused: java.io.IOException: Cannot run program "mvn" (in directory "<https://ci-builds.apache.org/job/Juneau/job/Juneau-Java-17/ws/")>: error=2, No such file or directory
	at java.base/java.lang.ProcessBuilder.start(ProcessBuilder.java:1143)
	at java.base/java.lang.ProcessBuilder.start(ProcessBuilder.java:1073)
	at hudson.Proc$LocalProc.<init>(Proc.java:252)
	at hudson.Proc$LocalProc.<init>(Proc.java:221)
	at hudson.Launcher$LocalLauncher.launch(Launcher.java:994)
	at hudson.Launcher$ProcStarter.start(Launcher.java:506)
	at hudson.Launcher$RemoteLaunchCallable.call(Launcher.java:1395)
	at hudson.Launcher$RemoteLaunchCallable.call(Launcher.java:1337)
	at hudson.remoting.UserRequest.perform(UserRequest.java:225)
	at hudson.remoting.UserRequest.perform(UserRequest.java:50)
	at hudson.remoting.Request$2.run(Request.java:391)
	at hudson.remoting.InterceptingExecutorService.lambda$wrap$0(InterceptingExecutorService.java:81)
	at java.base/java.util.concurrent.FutureTask.run(FutureTask.java:264)
	at java.base/java.util.concurrent.ThreadPoolExecutor.runWorker(ThreadPoolExecutor.java:1136)
	at java.base/java.util.concurrent.ThreadPoolExecutor$Worker.run(ThreadPoolExecutor.java:635)
	at java.base/java.lang.Thread.run(Thread.java:840)
Build step 'Invoke top-level Maven targets' marked build as failure
Recording test results
[Checks API] No suitable checks publisher found.

Build failed in Jenkins: Juneau » Juneau-Java-17 #2674

Posted by Apache Jenkins Server <je...@builds.apache.org>.
See <https://ci-builds.apache.org/job/Juneau/job/Juneau-Java-17/2674/display/redirect?page=changes>

Changes:

[James Bognar] WORK-J0522d: Land the deferred emitter-surgery half - RowDetailDef.region() with SF-E staged coexistence, the region container/sidecar emitter, the shared-envelope join, the per-bean ActionRef.enabledWhen absorb, the XSS posture (emitter-purity scan + populate-button click isolation + populator-name safety), and design 11.1a stood up as a live ten-tab example.


------------------------------------------
Started by an SCM change
Running as SYSTEM
[EnvInject] - Loading node environment variables.
Building remotely on builds33 (ubuntu) in workspace <https://ci-builds.apache.org/job/Juneau/job/Juneau-Java-17/ws/>
The recommended git tool is: NONE
No credentials specified
 > git rev-parse --resolve-git-dir <https://ci-builds.apache.org/job/Juneau/job/Juneau-Java-17/ws/.git> # timeout=10
Fetching changes from the remote Git repository
 > git config remote.origin.url https://github.com/apache/juneau.git # timeout=10
Fetching upstream changes from https://github.com/apache/juneau.git
 > git --version # timeout=10
 > git --version # 'git version 2.34.1'
 > git fetch --tags --force --progress -- https://github.com/apache/juneau.git +refs/heads/*:refs/remotes/origin/* # timeout=10
 > git rev-parse refs/remotes/origin/master^{commit} # timeout=10
Checking out Revision 7139e1be6cebe5c07c36c74ca3e5217389383c35 (refs/remotes/origin/master)
 > git config core.sparsecheckout # timeout=10
 > git checkout -f 7139e1be6cebe5c07c36c74ca3e5217389383c35 # timeout=10
Commit message: "WORK-J0522d: Land the deferred emitter-surgery half - RowDetailDef.region() with SF-E staged coexistence, the region container/sidecar emitter, the shared-envelope join, the per-bean ActionRef.enabledWhen absorb, the XSS posture (emitter-purity scan + populate-button click isolation + populator-name safety), and design 11.1a stood up as a live ten-tab example."
 > git rev-list --no-walk fef7ddc26f7191b4e315049998bd3b5b5f7685cd # timeout=10
[Juneau-Java-17] $ mvn clean install deploy javadoc:aggregate
FATAL: command execution failed
java.io.IOException: error=2, No such file or directory
	at java.base/java.lang.ProcessImpl.forkAndExec(Native Method)
	at java.base/java.lang.ProcessImpl.<init>(ProcessImpl.java:314)
	at java.base/java.lang.ProcessImpl.start(ProcessImpl.java:244)
	at java.base/java.lang.ProcessBuilder.start(ProcessBuilder.java:1110)
Also:   hudson.remoting.Channel$CallSiteStackTrace: Remote call to builds33
		at hudson.remoting.Channel.attachCallSiteStackTrace(Channel.java:1923)
		at hudson.remoting.UserRequest$ExceptionResponse.retrieve(UserRequest.java:384)
		at hudson.remoting.Channel.call(Channel.java:1112)
		at hudson.Launcher$RemoteLauncher.launch(Launcher.java:1121)
		at hudson.Launcher$ProcStarter.start(Launcher.java:506)
		at hudson.Launcher$ProcStarter.join(Launcher.java:517)
		at hudson.tasks.Maven.perform(Maven.java:368)
		at hudson.tasks.BuildStepMonitor$1.perform(BuildStepMonitor.java:20)
		at hudson.model.AbstractBuild$AbstractBuildExecution.perform(AbstractBuild.java:818)
		at hudson.model.Build$BuildExecution.build(Build.java:199)
		at hudson.model.Build$BuildExecution.doRun(Build.java:164)
		at hudson.model.AbstractBuild$AbstractBuildExecution.run(AbstractBuild.java:527)
		at hudson.model.Run.execute(Run.java:1833)
		at hudson.model.FreeStyleBuild.run(FreeStyleBuild.java:44)
		at hudson.model.ResourceController.execute(ResourceController.java:101)
		at hudson.model.Executor.run(Executor.java:446)
Caused: java.io.IOException: Cannot run program "mvn" (in directory "<https://ci-builds.apache.org/job/Juneau/job/Juneau-Java-17/ws/")>: error=2, No such file or directory
	at java.base/java.lang.ProcessBuilder.start(ProcessBuilder.java:1143)
	at java.base/java.lang.ProcessBuilder.start(ProcessBuilder.java:1073)
	at hudson.Proc$LocalProc.<init>(Proc.java:252)
	at hudson.Proc$LocalProc.<init>(Proc.java:221)
	at hudson.Launcher$LocalLauncher.launch(Launcher.java:994)
	at hudson.Launcher$ProcStarter.start(Launcher.java:506)
	at hudson.Launcher$RemoteLaunchCallable.call(Launcher.java:1395)
	at hudson.Launcher$RemoteLaunchCallable.call(Launcher.java:1337)
	at hudson.remoting.UserRequest.perform(UserRequest.java:225)
	at hudson.remoting.UserRequest.perform(UserRequest.java:50)
	at hudson.remoting.Request$2.run(Request.java:391)
	at hudson.remoting.InterceptingExecutorService.lambda$wrap$0(InterceptingExecutorService.java:81)
	at java.base/java.util.concurrent.FutureTask.run(FutureTask.java:264)
	at java.base/java.util.concurrent.ThreadPoolExecutor.runWorker(ThreadPoolExecutor.java:1136)
	at java.base/java.util.concurrent.ThreadPoolExecutor$Worker.run(ThreadPoolExecutor.java:635)
	at java.base/java.lang.Thread.run(Thread.java:840)
Build step 'Invoke top-level Maven targets' marked build as failure
Recording test results
[Checks API] No suitable checks publisher found.

Build failed in Jenkins: Juneau » Juneau-Java-17 #2673

Posted by Apache Jenkins Server <je...@builds.apache.org>.
See <https://ci-builds.apache.org/job/Juneau/job/Juneau-Java-17/2673/display/redirect?page=changes>

Changes:

[James Bognar] WORK-J0522d: Wire the host enrolment walk into the real card/panel/detail callers (juneau-cards.js enhanceOneCard->regions.enrolIn, new juneau-pages.js activatePanelRegions, juneau-views.js expandDetailRow), the 5-row removal-path teardown table incl. B3 teardownTable reinit, and the barrier ready()/registerRuntime() protocol.


------------------------------------------
Started by an SCM change
Running as SYSTEM
[EnvInject] - Loading node environment variables.
Building remotely on builds33 (ubuntu) in workspace <https://ci-builds.apache.org/job/Juneau/job/Juneau-Java-17/ws/>
The recommended git tool is: NONE
No credentials specified
 > git rev-parse --resolve-git-dir <https://ci-builds.apache.org/job/Juneau/job/Juneau-Java-17/ws/.git> # timeout=10
Fetching changes from the remote Git repository
 > git config remote.origin.url https://github.com/apache/juneau.git # timeout=10
Fetching upstream changes from https://github.com/apache/juneau.git
 > git --version # timeout=10
 > git --version # 'git version 2.34.1'
 > git fetch --tags --force --progress -- https://github.com/apache/juneau.git +refs/heads/*:refs/remotes/origin/* # timeout=10
 > git rev-parse refs/remotes/origin/master^{commit} # timeout=10
Checking out Revision fef7ddc26f7191b4e315049998bd3b5b5f7685cd (refs/remotes/origin/master)
 > git config core.sparsecheckout # timeout=10
 > git checkout -f fef7ddc26f7191b4e315049998bd3b5b5f7685cd # timeout=10
Commit message: "WORK-J0522d: Wire the host enrolment walk into the real card/panel/detail callers (juneau-cards.js enhanceOneCard->regions.enrolIn, new juneau-pages.js activatePanelRegions, juneau-views.js expandDetailRow), the 5-row removal-path teardown table incl. B3 teardownTable reinit, and the barrier ready()/registerRuntime() protocol."
 > git rev-list --no-walk 767c1e11fe4bf662673ff70a38dfe9e0312b99a7 # timeout=10
[Juneau-Java-17] $ mvn clean install deploy javadoc:aggregate
FATAL: command execution failed
java.io.IOException: error=2, No such file or directory
	at java.base/java.lang.ProcessImpl.forkAndExec(Native Method)
	at java.base/java.lang.ProcessImpl.<init>(ProcessImpl.java:314)
	at java.base/java.lang.ProcessImpl.start(ProcessImpl.java:244)
	at java.base/java.lang.ProcessBuilder.start(ProcessBuilder.java:1110)
Also:   hudson.remoting.Channel$CallSiteStackTrace: Remote call to builds33
		at hudson.remoting.Channel.attachCallSiteStackTrace(Channel.java:1923)
		at hudson.remoting.UserRequest$ExceptionResponse.retrieve(UserRequest.java:384)
		at hudson.remoting.Channel.call(Channel.java:1112)
		at hudson.Launcher$RemoteLauncher.launch(Launcher.java:1121)
		at hudson.Launcher$ProcStarter.start(Launcher.java:506)
		at hudson.Launcher$ProcStarter.join(Launcher.java:517)
		at hudson.tasks.Maven.perform(Maven.java:368)
		at hudson.tasks.BuildStepMonitor$1.perform(BuildStepMonitor.java:20)
		at hudson.model.AbstractBuild$AbstractBuildExecution.perform(AbstractBuild.java:818)
		at hudson.model.Build$BuildExecution.build(Build.java:199)
		at hudson.model.Build$BuildExecution.doRun(Build.java:164)
		at hudson.model.AbstractBuild$AbstractBuildExecution.run(AbstractBuild.java:527)
		at hudson.model.Run.execute(Run.java:1833)
		at hudson.model.FreeStyleBuild.run(FreeStyleBuild.java:44)
		at hudson.model.ResourceController.execute(ResourceController.java:101)
		at hudson.model.Executor.run(Executor.java:446)
Caused: java.io.IOException: Cannot run program "mvn" (in directory "<https://ci-builds.apache.org/job/Juneau/job/Juneau-Java-17/ws/")>: error=2, No such file or directory
	at java.base/java.lang.ProcessBuilder.start(ProcessBuilder.java:1143)
	at java.base/java.lang.ProcessBuilder.start(ProcessBuilder.java:1073)
	at hudson.Proc$LocalProc.<init>(Proc.java:252)
	at hudson.Proc$LocalProc.<init>(Proc.java:221)
	at hudson.Launcher$LocalLauncher.launch(Launcher.java:994)
	at hudson.Launcher$ProcStarter.start(Launcher.java:506)
	at hudson.Launcher$RemoteLaunchCallable.call(Launcher.java:1395)
	at hudson.Launcher$RemoteLaunchCallable.call(Launcher.java:1337)
	at hudson.remoting.UserRequest.perform(UserRequest.java:225)
	at hudson.remoting.UserRequest.perform(UserRequest.java:50)
	at hudson.remoting.Request$2.run(Request.java:391)
	at hudson.remoting.InterceptingExecutorService.lambda$wrap$0(InterceptingExecutorService.java:81)
	at java.base/java.util.concurrent.FutureTask.run(FutureTask.java:264)
	at java.base/java.util.concurrent.ThreadPoolExecutor.runWorker(ThreadPoolExecutor.java:1136)
	at java.base/java.util.concurrent.ThreadPoolExecutor$Worker.run(ThreadPoolExecutor.java:635)
	at java.base/java.lang.Thread.run(Thread.java:840)
Build step 'Invoke top-level Maven targets' marked build as failure
Recording test results
[Checks API] No suitable checks publisher found.

Build failed in Jenkins: Juneau » Juneau-Java-17 #2672

Posted by Apache Jenkins Server <je...@builds.apache.org>.
See <https://ci-builds.apache.org/job/Juneau/job/Juneau-Java-17/2672/display/redirect?page=changes>

Changes:

[James Bognar] WORK-J0522c: Extend RegionDef with the declarative dataUrl/fields/renderer descriptor and built-in default populator (ctx.declared, ctx.fetchDeclared(), JuneauViews.regions.defaultPopulate); implement the R14a pre-fetch matrix and the R8.3.1 poll lifecycle (clear-then-set, skip-while-in-flight, keep-on-error); prove L12's four non-privilege properties with byte-identical-DOM (test 11) and no-DOM-ancestry (test 12) STOP-gate tests.


------------------------------------------
Started by an SCM change
Running as SYSTEM
[EnvInject] - Loading node environment variables.
Building remotely on builds33 (ubuntu) in workspace <https://ci-builds.apache.org/job/Juneau/job/Juneau-Java-17/ws/>
The recommended git tool is: NONE
No credentials specified
 > git rev-parse --resolve-git-dir <https://ci-builds.apache.org/job/Juneau/job/Juneau-Java-17/ws/.git> # timeout=10
Fetching changes from the remote Git repository
 > git config remote.origin.url https://github.com/apache/juneau.git # timeout=10
Fetching upstream changes from https://github.com/apache/juneau.git
 > git --version # timeout=10
 > git --version # 'git version 2.34.1'
 > git fetch --tags --force --progress -- https://github.com/apache/juneau.git +refs/heads/*:refs/remotes/origin/* # timeout=10
 > git rev-parse refs/remotes/origin/master^{commit} # timeout=10
Checking out Revision 767c1e11fe4bf662673ff70a38dfe9e0312b99a7 (refs/remotes/origin/master)
 > git config core.sparsecheckout # timeout=10
 > git checkout -f 767c1e11fe4bf662673ff70a38dfe9e0312b99a7 # timeout=10
Commit message: "WORK-J0522c: Extend RegionDef with the declarative dataUrl/fields/renderer descriptor and built-in default populator (ctx.declared, ctx.fetchDeclared(), JuneauViews.regions.defaultPopulate); implement the R14a pre-fetch matrix and the R8.3.1 poll lifecycle (clear-then-set, skip-while-in-flight, keep-on-error); prove L12's four non-privilege properties with byte-identical-DOM (test 11) and no-DOM-ancestry (test 12) STOP-gate tests."
 > git rev-list --no-walk 58c077700789d52bac4c76f295b57c1da75ca724 # timeout=10
[Juneau-Java-17] $ mvn clean install deploy javadoc:aggregate
FATAL: command execution failed
java.io.IOException: error=2, No such file or directory
	at java.base/java.lang.ProcessImpl.forkAndExec(Native Method)
	at java.base/java.lang.ProcessImpl.<init>(ProcessImpl.java:314)
	at java.base/java.lang.ProcessImpl.start(ProcessImpl.java:244)
	at java.base/java.lang.ProcessBuilder.start(ProcessBuilder.java:1110)
Also:   hudson.remoting.Channel$CallSiteStackTrace: Remote call to builds33
		at hudson.remoting.Channel.attachCallSiteStackTrace(Channel.java:1923)
		at hudson.remoting.UserRequest$ExceptionResponse.retrieve(UserRequest.java:384)
		at hudson.remoting.Channel.call(Channel.java:1112)
		at hudson.Launcher$RemoteLauncher.launch(Launcher.java:1121)
		at hudson.Launcher$ProcStarter.start(Launcher.java:506)
		at hudson.Launcher$ProcStarter.join(Launcher.java:517)
		at hudson.tasks.Maven.perform(Maven.java:368)
		at hudson.tasks.BuildStepMonitor$1.perform(BuildStepMonitor.java:20)
		at hudson.model.AbstractBuild$AbstractBuildExecution.perform(AbstractBuild.java:818)
		at hudson.model.Build$BuildExecution.build(Build.java:199)
		at hudson.model.Build$BuildExecution.doRun(Build.java:164)
		at hudson.model.AbstractBuild$AbstractBuildExecution.run(AbstractBuild.java:527)
		at hudson.model.Run.execute(Run.java:1833)
		at hudson.model.FreeStyleBuild.run(FreeStyleBuild.java:44)
		at hudson.model.ResourceController.execute(ResourceController.java:101)
		at hudson.model.Executor.run(Executor.java:446)
Caused: java.io.IOException: Cannot run program "mvn" (in directory "<https://ci-builds.apache.org/job/Juneau/job/Juneau-Java-17/ws/")>: error=2, No such file or directory
	at java.base/java.lang.ProcessBuilder.start(ProcessBuilder.java:1143)
	at java.base/java.lang.ProcessBuilder.start(ProcessBuilder.java:1073)
	at hudson.Proc$LocalProc.<init>(Proc.java:252)
	at hudson.Proc$LocalProc.<init>(Proc.java:221)
	at hudson.Launcher$LocalLauncher.launch(Launcher.java:994)
	at hudson.Launcher$ProcStarter.start(Launcher.java:506)
	at hudson.Launcher$RemoteLaunchCallable.call(Launcher.java:1395)
	at hudson.Launcher$RemoteLaunchCallable.call(Launcher.java:1337)
	at hudson.remoting.UserRequest.perform(UserRequest.java:225)
	at hudson.remoting.UserRequest.perform(UserRequest.java:50)
	at hudson.remoting.Request$2.run(Request.java:391)
	at hudson.remoting.InterceptingExecutorService.lambda$wrap$0(InterceptingExecutorService.java:81)
	at java.base/java.util.concurrent.FutureTask.run(FutureTask.java:264)
	at java.base/java.util.concurrent.ThreadPoolExecutor.runWorker(ThreadPoolExecutor.java:1136)
	at java.base/java.util.concurrent.ThreadPoolExecutor$Worker.run(ThreadPoolExecutor.java:635)
	at java.base/java.lang.Thread.run(Thread.java:840)
Build step 'Invoke top-level Maven targets' marked build as failure
Recording test results
[Checks API] No suitable checks publisher found.

Build failed in Jenkins: Juneau » Juneau-Java-17 #2671

Posted by Apache Jenkins Server <je...@builds.apache.org>.
See <https://ci-builds.apache.org/job/Juneau/job/Juneau-Java-17/2671/display/redirect?page=changes>

Changes:

[James Bognar] WORK-J0522b: Promote fieldGrid/kvTable/button-buttonRow/text-pill-icon convenience helpers to juneau-helpers.js; add dateRange/dropdown/filterBuilder widgets, dataPane and recordTable helpers, and a hand-enrolled ten-tab instance-detail worked example (juneau-examples-views) exercising the region-populate + tabStrip asset load-order band (AssetLoadOrderBand_Test).


------------------------------------------
Started by an SCM change
Running as SYSTEM
[EnvInject] - Loading node environment variables.
Building remotely on builds33 (ubuntu) in workspace <https://ci-builds.apache.org/job/Juneau/job/Juneau-Java-17/ws/>
The recommended git tool is: NONE
No credentials specified
 > git rev-parse --resolve-git-dir <https://ci-builds.apache.org/job/Juneau/job/Juneau-Java-17/ws/.git> # timeout=10
Fetching changes from the remote Git repository
 > git config remote.origin.url https://github.com/apache/juneau.git # timeout=10
Fetching upstream changes from https://github.com/apache/juneau.git
 > git --version # timeout=10
 > git --version # 'git version 2.34.1'
 > git fetch --tags --force --progress -- https://github.com/apache/juneau.git +refs/heads/*:refs/remotes/origin/* # timeout=10
 > git rev-parse refs/remotes/origin/master^{commit} # timeout=10
Checking out Revision 58c077700789d52bac4c76f295b57c1da75ca724 (refs/remotes/origin/master)
 > git config core.sparsecheckout # timeout=10
 > git checkout -f 58c077700789d52bac4c76f295b57c1da75ca724 # timeout=10
Commit message: "WORK-J0522b: Promote fieldGrid/kvTable/button-buttonRow/text-pill-icon convenience helpers to juneau-helpers.js; add dateRange/dropdown/filterBuilder widgets, dataPane and recordTable helpers, and a hand-enrolled ten-tab instance-detail worked example (juneau-examples-views) exercising the region-populate + tabStrip asset load-order band (AssetLoadOrderBand_Test)."
 > git rev-list --no-walk 8f4c83292a811e6c536b4389b9b26470fe9e8ed8 # timeout=10
[Juneau-Java-17] $ mvn clean install deploy javadoc:aggregate
FATAL: command execution failed
java.io.IOException: error=2, No such file or directory
	at java.base/java.lang.ProcessImpl.forkAndExec(Native Method)
	at java.base/java.lang.ProcessImpl.<init>(ProcessImpl.java:314)
	at java.base/java.lang.ProcessImpl.start(ProcessImpl.java:244)
	at java.base/java.lang.ProcessBuilder.start(ProcessBuilder.java:1110)
Also:   hudson.remoting.Channel$CallSiteStackTrace: Remote call to builds33
		at hudson.remoting.Channel.attachCallSiteStackTrace(Channel.java:1923)
		at hudson.remoting.UserRequest$ExceptionResponse.retrieve(UserRequest.java:384)
		at hudson.remoting.Channel.call(Channel.java:1112)
		at hudson.Launcher$RemoteLauncher.launch(Launcher.java:1121)
		at hudson.Launcher$ProcStarter.start(Launcher.java:506)
		at hudson.Launcher$ProcStarter.join(Launcher.java:517)
		at hudson.tasks.Maven.perform(Maven.java:368)
		at hudson.tasks.BuildStepMonitor$1.perform(BuildStepMonitor.java:20)
		at hudson.model.AbstractBuild$AbstractBuildExecution.perform(AbstractBuild.java:818)
		at hudson.model.Build$BuildExecution.build(Build.java:199)
		at hudson.model.Build$BuildExecution.doRun(Build.java:164)
		at hudson.model.AbstractBuild$AbstractBuildExecution.run(AbstractBuild.java:527)
		at hudson.model.Run.execute(Run.java:1833)
		at hudson.model.FreeStyleBuild.run(FreeStyleBuild.java:44)
		at hudson.model.ResourceController.execute(ResourceController.java:101)
		at hudson.model.Executor.run(Executor.java:446)
Caused: java.io.IOException: Cannot run program "mvn" (in directory "<https://ci-builds.apache.org/job/Juneau/job/Juneau-Java-17/ws/")>: error=2, No such file or directory
	at java.base/java.lang.ProcessBuilder.start(ProcessBuilder.java:1143)
	at java.base/java.lang.ProcessBuilder.start(ProcessBuilder.java:1073)
	at hudson.Proc$LocalProc.<init>(Proc.java:252)
	at hudson.Proc$LocalProc.<init>(Proc.java:221)
	at hudson.Launcher$LocalLauncher.launch(Launcher.java:994)
	at hudson.Launcher$ProcStarter.start(Launcher.java:506)
	at hudson.Launcher$RemoteLaunchCallable.call(Launcher.java:1395)
	at hudson.Launcher$RemoteLaunchCallable.call(Launcher.java:1337)
	at hudson.remoting.UserRequest.perform(UserRequest.java:225)
	at hudson.remoting.UserRequest.perform(UserRequest.java:50)
	at hudson.remoting.Request$2.run(Request.java:391)
	at hudson.remoting.InterceptingExecutorService.lambda$wrap$0(InterceptingExecutorService.java:81)
	at java.base/java.util.concurrent.FutureTask.run(FutureTask.java:264)
	at java.base/java.util.concurrent.ThreadPoolExecutor.runWorker(ThreadPoolExecutor.java:1136)
	at java.base/java.util.concurrent.ThreadPoolExecutor$Worker.run(ThreadPoolExecutor.java:635)
	at java.base/java.lang.Thread.run(Thread.java:840)
Build step 'Invoke top-level Maven targets' marked build as failure
Recording test results
[Checks API] No suitable checks publisher found.

Build failed in Jenkins: Juneau » Juneau-Java-17 #2670

Posted by Apache Jenkins Server <je...@builds.apache.org>.
See <https://ci-builds.apache.org/job/Juneau/job/Juneau-Java-17/2670/display/redirect?page=changes>

Changes:

[James Bognar] WORK-J0522a: Add the region populate primitive, client-side populator registry, page-scoped message bus and initial-broadcast barrier (juneau-regions.js, PopulatorAllowlist, RegionDef, ViewsMixin serving path), and fold in test-only fix for AsyncResponseProcessor h04 timeout emit race (juneau-integration-tests).


------------------------------------------
Started by an SCM change
Running as SYSTEM
[EnvInject] - Loading node environment variables.
Building remotely on builds33 (ubuntu) in workspace <https://ci-builds.apache.org/job/Juneau/job/Juneau-Java-17/ws/>
The recommended git tool is: NONE
No credentials specified
 > git rev-parse --resolve-git-dir <https://ci-builds.apache.org/job/Juneau/job/Juneau-Java-17/ws/.git> # timeout=10
Fetching changes from the remote Git repository
 > git config remote.origin.url https://github.com/apache/juneau.git # timeout=10
Fetching upstream changes from https://github.com/apache/juneau.git
 > git --version # timeout=10
 > git --version # 'git version 2.34.1'
 > git fetch --tags --force --progress -- https://github.com/apache/juneau.git +refs/heads/*:refs/remotes/origin/* # timeout=10
 > git rev-parse refs/remotes/origin/master^{commit} # timeout=10
Checking out Revision 8f4c83292a811e6c536b4389b9b26470fe9e8ed8 (refs/remotes/origin/master)
 > git config core.sparsecheckout # timeout=10
 > git checkout -f 8f4c83292a811e6c536b4389b9b26470fe9e8ed8 # timeout=10
Commit message: "WORK-J0522a: Add the region populate primitive, client-side populator registry, page-scoped message bus and initial-broadcast barrier (juneau-regions.js, PopulatorAllowlist, RegionDef, ViewsMixin serving path), and fold in test-only fix for AsyncResponseProcessor h04 timeout emit race (juneau-integration-tests)."
 > git rev-list --no-walk 0c792d897bdc0162bb60197492e8a066ab43980a # timeout=10
[Juneau-Java-17] $ mvn clean install deploy javadoc:aggregate
FATAL: command execution failed
java.io.IOException: error=2, No such file or directory
	at java.base/java.lang.ProcessImpl.forkAndExec(Native Method)
	at java.base/java.lang.ProcessImpl.<init>(ProcessImpl.java:314)
	at java.base/java.lang.ProcessImpl.start(ProcessImpl.java:244)
	at java.base/java.lang.ProcessBuilder.start(ProcessBuilder.java:1110)
Also:   hudson.remoting.Channel$CallSiteStackTrace: Remote call to builds33
		at hudson.remoting.Channel.attachCallSiteStackTrace(Channel.java:1923)
		at hudson.remoting.UserRequest$ExceptionResponse.retrieve(UserRequest.java:384)
		at hudson.remoting.Channel.call(Channel.java:1112)
		at hudson.Launcher$RemoteLauncher.launch(Launcher.java:1121)
		at hudson.Launcher$ProcStarter.start(Launcher.java:506)
		at hudson.Launcher$ProcStarter.join(Launcher.java:517)
		at hudson.tasks.Maven.perform(Maven.java:368)
		at hudson.tasks.BuildStepMonitor$1.perform(BuildStepMonitor.java:20)
		at hudson.model.AbstractBuild$AbstractBuildExecution.perform(AbstractBuild.java:818)
		at hudson.model.Build$BuildExecution.build(Build.java:199)
		at hudson.model.Build$BuildExecution.doRun(Build.java:164)
		at hudson.model.AbstractBuild$AbstractBuildExecution.run(AbstractBuild.java:527)
		at hudson.model.Run.execute(Run.java:1833)
		at hudson.model.FreeStyleBuild.run(FreeStyleBuild.java:44)
		at hudson.model.ResourceController.execute(ResourceController.java:101)
		at hudson.model.Executor.run(Executor.java:446)
Caused: java.io.IOException: Cannot run program "mvn" (in directory "<https://ci-builds.apache.org/job/Juneau/job/Juneau-Java-17/ws/")>: error=2, No such file or directory
	at java.base/java.lang.ProcessBuilder.start(ProcessBuilder.java:1143)
	at java.base/java.lang.ProcessBuilder.start(ProcessBuilder.java:1073)
	at hudson.Proc$LocalProc.<init>(Proc.java:252)
	at hudson.Proc$LocalProc.<init>(Proc.java:221)
	at hudson.Launcher$LocalLauncher.launch(Launcher.java:994)
	at hudson.Launcher$ProcStarter.start(Launcher.java:506)
	at hudson.Launcher$RemoteLaunchCallable.call(Launcher.java:1395)
	at hudson.Launcher$RemoteLaunchCallable.call(Launcher.java:1337)
	at hudson.remoting.UserRequest.perform(UserRequest.java:225)
	at hudson.remoting.UserRequest.perform(UserRequest.java:50)
	at hudson.remoting.Request$2.run(Request.java:391)
	at hudson.remoting.InterceptingExecutorService.lambda$wrap$0(InterceptingExecutorService.java:81)
	at java.base/java.util.concurrent.FutureTask.run(FutureTask.java:264)
	at java.base/java.util.concurrent.ThreadPoolExecutor.runWorker(ThreadPoolExecutor.java:1136)
	at java.base/java.util.concurrent.ThreadPoolExecutor$Worker.run(ThreadPoolExecutor.java:635)
	at java.base/java.lang.Thread.run(Thread.java:840)
Build step 'Invoke top-level Maven targets' marked build as failure
Recording test results
[Checks API] No suitable checks publisher found.

Build failed in Jenkins: Juneau » Juneau-Java-17 #2669

Posted by Apache Jenkins Server <je...@builds.apache.org>.
See <https://ci-builds.apache.org/job/Juneau/job/Juneau-Java-17/2669/display/redirect?page=changes>

Changes:

[James Bognar] WORK-J0520: Correct contractVersion fail-closed narrative in juneau-rest-server-views comments/Javadoc (sites 7-13 of the design's Sec 8.3 doc-drift list: package-info.java, juneau-views.js, ViewsJs_ContractVersion_Test.java, contract-version.cjs); comment/Javadoc-only, no behavioral change.


------------------------------------------
Started by an SCM change
Running as SYSTEM
[EnvInject] - Loading node environment variables.
Building remotely on builds33 (ubuntu) in workspace <https://ci-builds.apache.org/job/Juneau/job/Juneau-Java-17/ws/>
The recommended git tool is: NONE
No credentials specified
 > git rev-parse --resolve-git-dir <https://ci-builds.apache.org/job/Juneau/job/Juneau-Java-17/ws/.git> # timeout=10
Fetching changes from the remote Git repository
 > git config remote.origin.url https://github.com/apache/juneau.git # timeout=10
Fetching upstream changes from https://github.com/apache/juneau.git
 > git --version # timeout=10
 > git --version # 'git version 2.34.1'
 > git fetch --tags --force --progress -- https://github.com/apache/juneau.git +refs/heads/*:refs/remotes/origin/* # timeout=10
 > git rev-parse refs/remotes/origin/master^{commit} # timeout=10
Checking out Revision 0c792d897bdc0162bb60197492e8a066ab43980a (refs/remotes/origin/master)
 > git config core.sparsecheckout # timeout=10
 > git checkout -f 0c792d897bdc0162bb60197492e8a066ab43980a # timeout=10
Commit message: "WORK-J0520: Correct contractVersion fail-closed narrative in juneau-rest-server-views comments/Javadoc (sites 7-13 of the design's Sec 8.3 doc-drift list: package-info.java, juneau-views.js, ViewsJs_ContractVersion_Test.java, contract-version.cjs); comment/Javadoc-only, no behavioral change."
 > git rev-list --no-walk 83c200c19aa1d43cda27108529a7915f78d0f656 # timeout=10
[Juneau-Java-17] $ mvn clean install deploy javadoc:aggregate
FATAL: command execution failed
java.io.IOException: error=2, No such file or directory
	at java.base/java.lang.ProcessImpl.forkAndExec(Native Method)
	at java.base/java.lang.ProcessImpl.<init>(ProcessImpl.java:314)
	at java.base/java.lang.ProcessImpl.start(ProcessImpl.java:244)
	at java.base/java.lang.ProcessBuilder.start(ProcessBuilder.java:1110)
Also:   hudson.remoting.Channel$CallSiteStackTrace: Remote call to builds33
		at hudson.remoting.Channel.attachCallSiteStackTrace(Channel.java:1923)
		at hudson.remoting.UserRequest$ExceptionResponse.retrieve(UserRequest.java:384)
		at hudson.remoting.Channel.call(Channel.java:1112)
		at hudson.Launcher$RemoteLauncher.launch(Launcher.java:1121)
		at hudson.Launcher$ProcStarter.start(Launcher.java:506)
		at hudson.Launcher$ProcStarter.join(Launcher.java:517)
		at hudson.tasks.Maven.perform(Maven.java:368)
		at hudson.tasks.BuildStepMonitor$1.perform(BuildStepMonitor.java:20)
		at hudson.model.AbstractBuild$AbstractBuildExecution.perform(AbstractBuild.java:818)
		at hudson.model.Build$BuildExecution.build(Build.java:199)
		at hudson.model.Build$BuildExecution.doRun(Build.java:164)
		at hudson.model.AbstractBuild$AbstractBuildExecution.run(AbstractBuild.java:527)
		at hudson.model.Run.execute(Run.java:1833)
		at hudson.model.FreeStyleBuild.run(FreeStyleBuild.java:44)
		at hudson.model.ResourceController.execute(ResourceController.java:101)
		at hudson.model.Executor.run(Executor.java:446)
Caused: java.io.IOException: Cannot run program "mvn" (in directory "<https://ci-builds.apache.org/job/Juneau/job/Juneau-Java-17/ws/")>: error=2, No such file or directory
	at java.base/java.lang.ProcessBuilder.start(ProcessBuilder.java:1143)
	at java.base/java.lang.ProcessBuilder.start(ProcessBuilder.java:1073)
	at hudson.Proc$LocalProc.<init>(Proc.java:252)
	at hudson.Proc$LocalProc.<init>(Proc.java:221)
	at hudson.Launcher$LocalLauncher.launch(Launcher.java:994)
	at hudson.Launcher$ProcStarter.start(Launcher.java:506)
	at hudson.Launcher$RemoteLaunchCallable.call(Launcher.java:1395)
	at hudson.Launcher$RemoteLaunchCallable.call(Launcher.java:1337)
	at hudson.remoting.UserRequest.perform(UserRequest.java:225)
	at hudson.remoting.UserRequest.perform(UserRequest.java:50)
	at hudson.remoting.Request$2.run(Request.java:391)
	at hudson.remoting.InterceptingExecutorService.lambda$wrap$0(InterceptingExecutorService.java:81)
	at java.base/java.util.concurrent.FutureTask.run(FutureTask.java:264)
	at java.base/java.util.concurrent.ThreadPoolExecutor.runWorker(ThreadPoolExecutor.java:1136)
	at java.base/java.util.concurrent.ThreadPoolExecutor$Worker.run(ThreadPoolExecutor.java:635)
	at java.base/java.lang.Thread.run(Thread.java:840)
Build step 'Invoke top-level Maven targets' marked build as failure
Recording test results
[Checks API] No suitable checks publisher found.

Build failed in Jenkins: Juneau » Juneau-Java-17 #2668

Posted by Apache Jenkins Server <je...@builds.apache.org>.
See <https://ci-builds.apache.org/job/Juneau/job/Juneau-Java-17/2668/display/redirect?page=changes>

Changes:

[James Bognar] WORK-J0520: Add fail-closed field initializer for ModalDef/FormDef.contractVersion; delete checked() null-else branch


------------------------------------------
Started by an SCM change
Running as SYSTEM
[EnvInject] - Loading node environment variables.
Building remotely on builds33 (ubuntu) in workspace <https://ci-builds.apache.org/job/Juneau/job/Juneau-Java-17/ws/>
The recommended git tool is: NONE
No credentials specified
 > git rev-parse --resolve-git-dir <https://ci-builds.apache.org/job/Juneau/job/Juneau-Java-17/ws/.git> # timeout=10
Fetching changes from the remote Git repository
 > git config remote.origin.url https://github.com/apache/juneau.git # timeout=10
Fetching upstream changes from https://github.com/apache/juneau.git
 > git --version # timeout=10
 > git --version # 'git version 2.34.1'
 > git fetch --tags --force --progress -- https://github.com/apache/juneau.git +refs/heads/*:refs/remotes/origin/* # timeout=10
 > git rev-parse refs/remotes/origin/master^{commit} # timeout=10
Checking out Revision 83c200c19aa1d43cda27108529a7915f78d0f656 (refs/remotes/origin/master)
 > git config core.sparsecheckout # timeout=10
 > git checkout -f 83c200c19aa1d43cda27108529a7915f78d0f656 # timeout=10
Commit message: "WORK-J0520: Add fail-closed field initializer for ModalDef/FormDef.contractVersion; delete checked() null-else branch"
 > git rev-list --no-walk c9fa96c4a0297f513c702fbb7ba7a0b5b9b605c4 # timeout=10
[Juneau-Java-17] $ mvn clean install deploy javadoc:aggregate
FATAL: command execution failed
java.io.IOException: error=2, No such file or directory
	at java.base/java.lang.ProcessImpl.forkAndExec(Native Method)
	at java.base/java.lang.ProcessImpl.<init>(ProcessImpl.java:314)
	at java.base/java.lang.ProcessImpl.start(ProcessImpl.java:244)
	at java.base/java.lang.ProcessBuilder.start(ProcessBuilder.java:1110)
Also:   hudson.remoting.Channel$CallSiteStackTrace: Remote call to builds33
		at hudson.remoting.Channel.attachCallSiteStackTrace(Channel.java:1923)
		at hudson.remoting.UserRequest$ExceptionResponse.retrieve(UserRequest.java:384)
		at hudson.remoting.Channel.call(Channel.java:1112)
		at hudson.Launcher$RemoteLauncher.launch(Launcher.java:1121)
		at hudson.Launcher$ProcStarter.start(Launcher.java:506)
		at hudson.Launcher$ProcStarter.join(Launcher.java:517)
		at hudson.tasks.Maven.perform(Maven.java:368)
		at hudson.tasks.BuildStepMonitor$1.perform(BuildStepMonitor.java:20)
		at hudson.model.AbstractBuild$AbstractBuildExecution.perform(AbstractBuild.java:818)
		at hudson.model.Build$BuildExecution.build(Build.java:199)
		at hudson.model.Build$BuildExecution.doRun(Build.java:164)
		at hudson.model.AbstractBuild$AbstractBuildExecution.run(AbstractBuild.java:527)
		at hudson.model.Run.execute(Run.java:1833)
		at hudson.model.FreeStyleBuild.run(FreeStyleBuild.java:44)
		at hudson.model.ResourceController.execute(ResourceController.java:101)
		at hudson.model.Executor.run(Executor.java:446)
Caused: java.io.IOException: Cannot run program "mvn" (in directory "<https://ci-builds.apache.org/job/Juneau/job/Juneau-Java-17/ws/")>: error=2, No such file or directory
	at java.base/java.lang.ProcessBuilder.start(ProcessBuilder.java:1143)
	at java.base/java.lang.ProcessBuilder.start(ProcessBuilder.java:1073)
	at hudson.Proc$LocalProc.<init>(Proc.java:252)
	at hudson.Proc$LocalProc.<init>(Proc.java:221)
	at hudson.Launcher$LocalLauncher.launch(Launcher.java:994)
	at hudson.Launcher$ProcStarter.start(Launcher.java:506)
	at hudson.Launcher$RemoteLaunchCallable.call(Launcher.java:1395)
	at hudson.Launcher$RemoteLaunchCallable.call(Launcher.java:1337)
	at hudson.remoting.UserRequest.perform(UserRequest.java:225)
	at hudson.remoting.UserRequest.perform(UserRequest.java:50)
	at hudson.remoting.Request$2.run(Request.java:391)
	at hudson.remoting.InterceptingExecutorService.lambda$wrap$0(InterceptingExecutorService.java:81)
	at java.base/java.util.concurrent.FutureTask.run(FutureTask.java:264)
	at java.base/java.util.concurrent.ThreadPoolExecutor.runWorker(ThreadPoolExecutor.java:1136)
	at java.base/java.util.concurrent.ThreadPoolExecutor$Worker.run(ThreadPoolExecutor.java:635)
	at java.base/java.lang.Thread.run(Thread.java:840)
Build step 'Invoke top-level Maven targets' marked build as failure
Recording test results
[Checks API] No suitable checks publisher found.

Build failed in Jenkins: Juneau » Juneau-Java-17 #2667

Posted by Apache Jenkins Server <je...@builds.apache.org>.
See <https://ci-builds.apache.org/job/Juneau/job/Juneau-Java-17/2667/display/redirect?page=changes>

Changes:

[James Bognar] WORK-J0519: Add @Uri to AsyncJobRef.streamUrl/cancelUrl so servlet: pseudo-scheme URLs resolve per-request for browser EventSource consumers.


------------------------------------------
Started by an SCM change
Running as SYSTEM
[EnvInject] - Loading node environment variables.
Building remotely on builds33 (ubuntu) in workspace <https://ci-builds.apache.org/job/Juneau/job/Juneau-Java-17/ws/>
The recommended git tool is: NONE
No credentials specified
 > git rev-parse --resolve-git-dir <https://ci-builds.apache.org/job/Juneau/job/Juneau-Java-17/ws/.git> # timeout=10
Fetching changes from the remote Git repository
 > git config remote.origin.url https://github.com/apache/juneau.git # timeout=10
Fetching upstream changes from https://github.com/apache/juneau.git
 > git --version # timeout=10
 > git --version # 'git version 2.34.1'
 > git fetch --tags --force --progress -- https://github.com/apache/juneau.git +refs/heads/*:refs/remotes/origin/* # timeout=10
 > git rev-parse refs/remotes/origin/master^{commit} # timeout=10
Checking out Revision c9fa96c4a0297f513c702fbb7ba7a0b5b9b605c4 (refs/remotes/origin/master)
 > git config core.sparsecheckout # timeout=10
 > git checkout -f c9fa96c4a0297f513c702fbb7ba7a0b5b9b605c4 # timeout=10
Commit message: "WORK-J0519: Add @Uri to AsyncJobRef.streamUrl/cancelUrl so servlet: pseudo-scheme URLs resolve per-request for browser EventSource consumers."
 > git rev-list --no-walk cc35acd8c6ca7bf37fcfbcb3583e2c18641fdaca # timeout=10
[Juneau-Java-17] $ mvn clean install deploy javadoc:aggregate
FATAL: command execution failed
java.io.IOException: error=2, No such file or directory
	at java.base/java.lang.ProcessImpl.forkAndExec(Native Method)
	at java.base/java.lang.ProcessImpl.<init>(ProcessImpl.java:314)
	at java.base/java.lang.ProcessImpl.start(ProcessImpl.java:244)
	at java.base/java.lang.ProcessBuilder.start(ProcessBuilder.java:1110)
Also:   hudson.remoting.Channel$CallSiteStackTrace: Remote call to builds33
		at hudson.remoting.Channel.attachCallSiteStackTrace(Channel.java:1923)
		at hudson.remoting.UserRequest$ExceptionResponse.retrieve(UserRequest.java:384)
		at hudson.remoting.Channel.call(Channel.java:1112)
		at hudson.Launcher$RemoteLauncher.launch(Launcher.java:1121)
		at hudson.Launcher$ProcStarter.start(Launcher.java:506)
		at hudson.Launcher$ProcStarter.join(Launcher.java:517)
		at hudson.tasks.Maven.perform(Maven.java:368)
		at hudson.tasks.BuildStepMonitor$1.perform(BuildStepMonitor.java:20)
		at hudson.model.AbstractBuild$AbstractBuildExecution.perform(AbstractBuild.java:818)
		at hudson.model.Build$BuildExecution.build(Build.java:199)
		at hudson.model.Build$BuildExecution.doRun(Build.java:164)
		at hudson.model.AbstractBuild$AbstractBuildExecution.run(AbstractBuild.java:527)
		at hudson.model.Run.execute(Run.java:1833)
		at hudson.model.FreeStyleBuild.run(FreeStyleBuild.java:44)
		at hudson.model.ResourceController.execute(ResourceController.java:101)
		at hudson.model.Executor.run(Executor.java:446)
Caused: java.io.IOException: Cannot run program "mvn" (in directory "<https://ci-builds.apache.org/job/Juneau/job/Juneau-Java-17/ws/")>: error=2, No such file or directory
	at java.base/java.lang.ProcessBuilder.start(ProcessBuilder.java:1143)
	at java.base/java.lang.ProcessBuilder.start(ProcessBuilder.java:1073)
	at hudson.Proc$LocalProc.<init>(Proc.java:252)
	at hudson.Proc$LocalProc.<init>(Proc.java:221)
	at hudson.Launcher$LocalLauncher.launch(Launcher.java:994)
	at hudson.Launcher$ProcStarter.start(Launcher.java:506)
	at hudson.Launcher$RemoteLaunchCallable.call(Launcher.java:1395)
	at hudson.Launcher$RemoteLaunchCallable.call(Launcher.java:1337)
	at hudson.remoting.UserRequest.perform(UserRequest.java:225)
	at hudson.remoting.UserRequest.perform(UserRequest.java:50)
	at hudson.remoting.Request$2.run(Request.java:391)
	at hudson.remoting.InterceptingExecutorService.lambda$wrap$0(InterceptingExecutorService.java:81)
	at java.base/java.util.concurrent.FutureTask.run(FutureTask.java:264)
	at java.base/java.util.concurrent.ThreadPoolExecutor.runWorker(ThreadPoolExecutor.java:1136)
	at java.base/java.util.concurrent.ThreadPoolExecutor$Worker.run(ThreadPoolExecutor.java:635)
	at java.base/java.lang.Thread.run(Thread.java:840)
Build step 'Invoke top-level Maven targets' marked build as failure
Recording test results
[Checks API] No suitable checks publisher found.

Build failed in Jenkins: Juneau » Juneau-Java-17 #2666

Posted by Apache Jenkins Server <je...@builds.apache.org>.
See <https://ci-builds.apache.org/job/Juneau/job/Juneau-Java-17/2666/display/redirect?page=changes>

Changes:

[James Bognar] WORK-J0517: Extend SANITIZED_HTML real-DOM/browser coverage for entity decoding, table foster-parenting, template/noscript, and namespace/foreign-content (SVG) copier behavior.


------------------------------------------
Started by an SCM change
Running as SYSTEM
[EnvInject] - Loading node environment variables.
Building remotely on builds33 (ubuntu) in workspace <https://ci-builds.apache.org/job/Juneau/job/Juneau-Java-17/ws/>
The recommended git tool is: NONE
No credentials specified
 > git rev-parse --resolve-git-dir <https://ci-builds.apache.org/job/Juneau/job/Juneau-Java-17/ws/.git> # timeout=10
Fetching changes from the remote Git repository
 > git config remote.origin.url https://github.com/apache/juneau.git # timeout=10
Fetching upstream changes from https://github.com/apache/juneau.git
 > git --version # timeout=10
 > git --version # 'git version 2.34.1'
 > git fetch --tags --force --progress -- https://github.com/apache/juneau.git +refs/heads/*:refs/remotes/origin/* # timeout=10
 > git rev-parse refs/remotes/origin/master^{commit} # timeout=10
Checking out Revision cc35acd8c6ca7bf37fcfbcb3583e2c18641fdaca (refs/remotes/origin/master)
 > git config core.sparsecheckout # timeout=10
 > git checkout -f cc35acd8c6ca7bf37fcfbcb3583e2c18641fdaca # timeout=10
Commit message: "WORK-J0517: Extend SANITIZED_HTML real-DOM/browser coverage for entity decoding, table foster-parenting, template/noscript, and namespace/foreign-content (SVG) copier behavior."
 > git rev-list --no-walk 79ce6034fddab588b2d2318f74f3c50aadc362ef # timeout=10
[Juneau-Java-17] $ mvn clean install deploy javadoc:aggregate
FATAL: command execution failed
java.io.IOException: error=2, No such file or directory
	at java.base/java.lang.ProcessImpl.forkAndExec(Native Method)
	at java.base/java.lang.ProcessImpl.<init>(ProcessImpl.java:314)
	at java.base/java.lang.ProcessImpl.start(ProcessImpl.java:244)
	at java.base/java.lang.ProcessBuilder.start(ProcessBuilder.java:1110)
Also:   hudson.remoting.Channel$CallSiteStackTrace: Remote call to builds33
		at hudson.remoting.Channel.attachCallSiteStackTrace(Channel.java:1923)
		at hudson.remoting.UserRequest$ExceptionResponse.retrieve(UserRequest.java:384)
		at hudson.remoting.Channel.call(Channel.java:1112)
		at hudson.Launcher$RemoteLauncher.launch(Launcher.java:1121)
		at hudson.Launcher$ProcStarter.start(Launcher.java:506)
		at hudson.Launcher$ProcStarter.join(Launcher.java:517)
		at hudson.tasks.Maven.perform(Maven.java:368)
		at hudson.tasks.BuildStepMonitor$1.perform(BuildStepMonitor.java:20)
		at hudson.model.AbstractBuild$AbstractBuildExecution.perform(AbstractBuild.java:818)
		at hudson.model.Build$BuildExecution.build(Build.java:199)
		at hudson.model.Build$BuildExecution.doRun(Build.java:164)
		at hudson.model.AbstractBuild$AbstractBuildExecution.run(AbstractBuild.java:527)
		at hudson.model.Run.execute(Run.java:1833)
		at hudson.model.FreeStyleBuild.run(FreeStyleBuild.java:44)
		at hudson.model.ResourceController.execute(ResourceController.java:101)
		at hudson.model.Executor.run(Executor.java:446)
Caused: java.io.IOException: Cannot run program "mvn" (in directory "<https://ci-builds.apache.org/job/Juneau/job/Juneau-Java-17/ws/")>: error=2, No such file or directory
	at java.base/java.lang.ProcessBuilder.start(ProcessBuilder.java:1143)
	at java.base/java.lang.ProcessBuilder.start(ProcessBuilder.java:1073)
	at hudson.Proc$LocalProc.<init>(Proc.java:252)
	at hudson.Proc$LocalProc.<init>(Proc.java:221)
	at hudson.Launcher$LocalLauncher.launch(Launcher.java:994)
	at hudson.Launcher$ProcStarter.start(Launcher.java:506)
	at hudson.Launcher$RemoteLaunchCallable.call(Launcher.java:1395)
	at hudson.Launcher$RemoteLaunchCallable.call(Launcher.java:1337)
	at hudson.remoting.UserRequest.perform(UserRequest.java:225)
	at hudson.remoting.UserRequest.perform(UserRequest.java:50)
	at hudson.remoting.Request$2.run(Request.java:391)
	at hudson.remoting.InterceptingExecutorService.lambda$wrap$0(InterceptingExecutorService.java:81)
	at java.base/java.util.concurrent.FutureTask.run(FutureTask.java:264)
	at java.base/java.util.concurrent.ThreadPoolExecutor.runWorker(ThreadPoolExecutor.java:1136)
	at java.base/java.util.concurrent.ThreadPoolExecutor$Worker.run(ThreadPoolExecutor.java:635)
	at java.base/java.lang.Thread.run(Thread.java:840)
Build step 'Invoke top-level Maven targets' marked build as failure
Recording test results
[Checks API] No suitable checks publisher found.

Build failed in Jenkins: Juneau » Juneau-Java-17 #2665

Posted by Apache Jenkins Server <je...@builds.apache.org>.
See <https://ci-builds.apache.org/job/Juneau/job/Juneau-Java-17/2665/display/redirect?page=changes>

Changes:

[James Bognar] Reject protocol-relative (and obfuscated) hrefs/srcs in isSafeMarkdownHref/isSafeImageSrc (WORK-J0516)


------------------------------------------
Started by an SCM change
Running as SYSTEM
[EnvInject] - Loading node environment variables.
Building remotely on builds33 (ubuntu) in workspace <https://ci-builds.apache.org/job/Juneau/job/Juneau-Java-17/ws/>
The recommended git tool is: NONE
No credentials specified
 > git rev-parse --resolve-git-dir <https://ci-builds.apache.org/job/Juneau/job/Juneau-Java-17/ws/.git> # timeout=10
Fetching changes from the remote Git repository
 > git config remote.origin.url https://github.com/apache/juneau.git # timeout=10
Fetching upstream changes from https://github.com/apache/juneau.git
 > git --version # timeout=10
 > git --version # 'git version 2.34.1'
 > git fetch --tags --force --progress -- https://github.com/apache/juneau.git +refs/heads/*:refs/remotes/origin/* # timeout=10
 > git rev-parse refs/remotes/origin/master^{commit} # timeout=10
Checking out Revision 79ce6034fddab588b2d2318f74f3c50aadc362ef (refs/remotes/origin/master)
 > git config core.sparsecheckout # timeout=10
 > git checkout -f 79ce6034fddab588b2d2318f74f3c50aadc362ef # timeout=10
Commit message: "Reject protocol-relative (and obfuscated) hrefs/srcs in isSafeMarkdownHref/isSafeImageSrc (WORK-J0516)"
 > git rev-list --no-walk e991410d79ecc7fa760fcdb1c295f61990510728 # timeout=10
[Juneau-Java-17] $ mvn clean install deploy javadoc:aggregate
FATAL: command execution failed
java.io.IOException: error=2, No such file or directory
	at java.base/java.lang.ProcessImpl.forkAndExec(Native Method)
	at java.base/java.lang.ProcessImpl.<init>(ProcessImpl.java:314)
	at java.base/java.lang.ProcessImpl.start(ProcessImpl.java:244)
	at java.base/java.lang.ProcessBuilder.start(ProcessBuilder.java:1110)
Also:   hudson.remoting.Channel$CallSiteStackTrace: Remote call to builds33
		at hudson.remoting.Channel.attachCallSiteStackTrace(Channel.java:1923)
		at hudson.remoting.UserRequest$ExceptionResponse.retrieve(UserRequest.java:384)
		at hudson.remoting.Channel.call(Channel.java:1112)
		at hudson.Launcher$RemoteLauncher.launch(Launcher.java:1121)
		at hudson.Launcher$ProcStarter.start(Launcher.java:506)
		at hudson.Launcher$ProcStarter.join(Launcher.java:517)
		at hudson.tasks.Maven.perform(Maven.java:368)
		at hudson.tasks.BuildStepMonitor$1.perform(BuildStepMonitor.java:20)
		at hudson.model.AbstractBuild$AbstractBuildExecution.perform(AbstractBuild.java:818)
		at hudson.model.Build$BuildExecution.build(Build.java:199)
		at hudson.model.Build$BuildExecution.doRun(Build.java:164)
		at hudson.model.AbstractBuild$AbstractBuildExecution.run(AbstractBuild.java:527)
		at hudson.model.Run.execute(Run.java:1833)
		at hudson.model.FreeStyleBuild.run(FreeStyleBuild.java:44)
		at hudson.model.ResourceController.execute(ResourceController.java:101)
		at hudson.model.Executor.run(Executor.java:446)
Caused: java.io.IOException: Cannot run program "mvn" (in directory "<https://ci-builds.apache.org/job/Juneau/job/Juneau-Java-17/ws/")>: error=2, No such file or directory
	at java.base/java.lang.ProcessBuilder.start(ProcessBuilder.java:1143)
	at java.base/java.lang.ProcessBuilder.start(ProcessBuilder.java:1073)
	at hudson.Proc$LocalProc.<init>(Proc.java:252)
	at hudson.Proc$LocalProc.<init>(Proc.java:221)
	at hudson.Launcher$LocalLauncher.launch(Launcher.java:994)
	at hudson.Launcher$ProcStarter.start(Launcher.java:506)
	at hudson.Launcher$RemoteLaunchCallable.call(Launcher.java:1395)
	at hudson.Launcher$RemoteLaunchCallable.call(Launcher.java:1337)
	at hudson.remoting.UserRequest.perform(UserRequest.java:225)
	at hudson.remoting.UserRequest.perform(UserRequest.java:50)
	at hudson.remoting.Request$2.run(Request.java:391)
	at hudson.remoting.InterceptingExecutorService.lambda$wrap$0(InterceptingExecutorService.java:81)
	at java.base/java.util.concurrent.FutureTask.run(FutureTask.java:264)
	at java.base/java.util.concurrent.ThreadPoolExecutor.runWorker(ThreadPoolExecutor.java:1136)
	at java.base/java.util.concurrent.ThreadPoolExecutor$Worker.run(ThreadPoolExecutor.java:635)
	at java.base/java.lang.Thread.run(Thread.java:840)
Build step 'Invoke top-level Maven targets' marked build as failure
Recording test results
[Checks API] No suitable checks publisher found.