You are viewing a plain text version of this content. The canonical link for it is here.
Posted to builds@beam.apache.org by Apache Jenkins Server <je...@builds.apache.org> on 2019/07/26 16:50:37 UTC
Build failed in Jenkins: beam_PostCommit_Py_ValCont #3894
See <https://builds.apache.org/job/beam_PostCommit_Py_ValCont/3894/display/redirect?page=changes>
Changes:
[kenn] [Java] remove unused variable in DirectMetricsTest.java
------------------------------------------
[...truncated 38.22 KB...]
Skip updating github.com/golang/mock: commit='b3e60bcdc577185fce3cf625fc96b62857ce5574', urls=[https://github.com/golang/mock.git, git@github.com:golang/mock.git] in /home/jenkins/.gradle/go/repo/github.com/golang/mock/a5aba77edff874e2e3d9ad331994556c.
Resolving github.com/golang/mock: commit='b3e60bcdc577185fce3cf625fc96b62857ce5574', urls=[https://github.com/golang/mock.git, git@github.com:golang/mock.git]
Skip updating github.com/golang/protobuf: commit='3a3da3a4e26776cc22a79ef46d5d58477532dede', urls=[https://github.com/golang/protobuf.git, git@github.com:golang/protobuf.git] in /home/jenkins/.gradle/go/repo/github.com/golang/protobuf/76cd502133aa2c5520c2b3e1debe630b.
Resolving github.com/golang/protobuf: commit='3a3da3a4e26776cc22a79ef46d5d58477532dede', urls=[https://github.com/golang/protobuf.git, git@github.com:golang/protobuf.git]
Skip updating github.com/golang/snappy: commit='553a641470496b2327abcac10b36396bd98e45c9', urls=[https://github.com/golang/snappy.git, git@github.com:golang/snappy.git] in /home/jenkins/.gradle/go/repo/github.com/golang/snappy/96c568bbd0eca3e3f6a41e15a438261a.
Resolving github.com/golang/snappy: commit='553a641470496b2327abcac10b36396bd98e45c9', urls=[https://github.com/golang/snappy.git, git@github.com:golang/snappy.git]
Resolving cached github.com/coreos/etcd: commit='11214aa33bf5a47d3d9d8dafe0f6b97237dfe921', urls=[https://github.com/coreos/etcd.git, git@github.com:coreos/etcd.git]
Skip updating github.com/google/go-cmp: commit='3af367b6b30c263d47e8895973edcca9a49cf029', urls=[https://github.com/google/go-cmp.git, git@github.com:google/go-cmp.git] in /home/jenkins/.gradle/go/repo/github.com/google/go-cmp/0e30ce638fec37a4c0a4040d380290b4.
Resolving github.com/google/go-cmp: commit='3af367b6b30c263d47e8895973edcca9a49cf029', urls=[https://github.com/google/go-cmp.git, git@github.com:google/go-cmp.git]
Skip updating github.com/google/pprof: commit='a8f279b7952b27edbcb72e5a6c69ee9be4c8ad93', urls=[https://github.com/google/pprof.git, git@github.com:google/pprof.git] in /home/jenkins/.gradle/go/repo/github.com/google/pprof/580224cd7b76319263fe32ca011a0650.
Resolving github.com/google/pprof: commit='a8f279b7952b27edbcb72e5a6c69ee9be4c8ad93', urls=[https://github.com/google/pprof.git, git@github.com:google/pprof.git]
Skip updating github.com/googleapis/gax-go: commit='317e0006254c44a0ac427cc52a0e083ff0b9622f', urls=[https://github.com/googleapis/gax-go.git, git@github.com:googleapis/gax-go.git] in /home/jenkins/.gradle/go/repo/github.com/googleapis/gax-go/cfbdb0eaeda3f1ea6b48e4ebedd6b7ac.
Resolving github.com/googleapis/gax-go: commit='317e0006254c44a0ac427cc52a0e083ff0b9622f', urls=[https://github.com/googleapis/gax-go.git, git@github.com:googleapis/gax-go.git]
Resolving cached github.com/coreos/etcd: commit='11214aa33bf5a47d3d9d8dafe0f6b97237dfe921', urls=[https://github.com/coreos/etcd.git, git@github.com:coreos/etcd.git]
Resolving cached github.com/coreos/etcd: commit='11214aa33bf5a47d3d9d8dafe0f6b97237dfe921', urls=[https://github.com/coreos/etcd.git, git@github.com:coreos/etcd.git]
Resolving cached github.com/coreos/etcd: commit='11214aa33bf5a47d3d9d8dafe0f6b97237dfe921', urls=[https://github.com/coreos/etcd.git, git@github.com:coreos/etcd.git]
Skip updating github.com/hashicorp/hcl: commit='23c074d0eceb2b8a5bfdbb271ab780cde70f05a8', urls=[https://github.com/hashicorp/hcl.git, git@github.com:hashicorp/hcl.git] in /home/jenkins/.gradle/go/repo/github.com/hashicorp/hcl/37e0bb8b36d14da77f9f8c5babf91e48.
Resolving github.com/hashicorp/hcl: commit='23c074d0eceb2b8a5bfdbb271ab780cde70f05a8', urls=[https://github.com/hashicorp/hcl.git, git@github.com:hashicorp/hcl.git]
Skip updating github.com/ianlancetaylor/demangle: commit='4883227f66371e02c4948937d3e2be1664d9be38', urls=[https://github.com/ianlancetaylor/demangle.git, git@github.com:ianlancetaylor/demangle.git] in /home/jenkins/.gradle/go/repo/github.com/ianlancetaylor/demangle/da9250878eadca7fe1a997f2c1e465b3.
Resolving github.com/ianlancetaylor/demangle: commit='4883227f66371e02c4948937d3e2be1664d9be38', urls=[https://github.com/ianlancetaylor/demangle.git, git@github.com:ianlancetaylor/demangle.git]
Resolving cached github.com/coreos/etcd: commit='11214aa33bf5a47d3d9d8dafe0f6b97237dfe921', urls=[https://github.com/coreos/etcd.git, git@github.com:coreos/etcd.git]
Resolving cached github.com/coreos/etcd: commit='11214aa33bf5a47d3d9d8dafe0f6b97237dfe921', urls=[https://github.com/coreos/etcd.git, git@github.com:coreos/etcd.git]
Skip updating github.com/kr/fs: commit='2788f0dbd16903de03cb8186e5c7d97b69ad387b', urls=[https://github.com/kr/fs.git, git@github.com:kr/fs.git] in /home/jenkins/.gradle/go/repo/github.com/kr/fs/ef69c46d4366e9d326896066a4b027d4.
Resolving github.com/kr/fs: commit='2788f0dbd16903de03cb8186e5c7d97b69ad387b', urls=[https://github.com/kr/fs.git, git@github.com:kr/fs.git]
Resolving cached github.com/coreos/etcd: commit='11214aa33bf5a47d3d9d8dafe0f6b97237dfe921', urls=[https://github.com/coreos/etcd.git, git@github.com:coreos/etcd.git]
Skip updating github.com/magiconair/properties: commit='49d762b9817ba1c2e9d0c69183c2b4a8b8f1d934', urls=[https://github.com/magiconair/properties.git, git@github.com:magiconair/properties.git] in /home/jenkins/.gradle/go/repo/github.com/magiconair/properties/34883f6c3f37cca1c4582d137f9fc020.
Resolving github.com/magiconair/properties: commit='49d762b9817ba1c2e9d0c69183c2b4a8b8f1d934', urls=[https://github.com/magiconair/properties.git, git@github.com:magiconair/properties.git]
Resolving cached github.com/coreos/etcd: commit='11214aa33bf5a47d3d9d8dafe0f6b97237dfe921', urls=[https://github.com/coreos/etcd.git, git@github.com:coreos/etcd.git]
Resolving cached github.com/coreos/etcd: commit='11214aa33bf5a47d3d9d8dafe0f6b97237dfe921', urls=[https://github.com/coreos/etcd.git, git@github.com:coreos/etcd.git]
Skip updating github.com/mitchellh/go-homedir: commit='b8bc1bf767474819792c23f32d8286a45736f1c6', urls=[https://github.com/mitchellh/go-homedir.git, git@github.com:mitchellh/go-homedir.git] in /home/jenkins/.gradle/go/repo/github.com/mitchellh/go-homedir/11e21d791561444efcbd8f83f3617926.
Resolving github.com/mitchellh/go-homedir: commit='b8bc1bf767474819792c23f32d8286a45736f1c6', urls=[https://github.com/mitchellh/go-homedir.git, git@github.com:mitchellh/go-homedir.git]
Skip updating github.com/mitchellh/mapstructure: commit='a4e142e9c047c904fa2f1e144d9a84e6133024bc', urls=[https://github.com/mitchellh/mapstructure.git, git@github.com:mitchellh/mapstructure.git] in /home/jenkins/.gradle/go/repo/github.com/mitchellh/mapstructure/8f497225aea52894fde79ad66bc0eb05.
Resolving github.com/mitchellh/mapstructure: commit='a4e142e9c047c904fa2f1e144d9a84e6133024bc', urls=[https://github.com/mitchellh/mapstructure.git, git@github.com:mitchellh/mapstructure.git]
Resolving cached github.com/coreos/etcd: commit='11214aa33bf5a47d3d9d8dafe0f6b97237dfe921', urls=[https://github.com/coreos/etcd.git, git@github.com:coreos/etcd.git]
Skip updating github.com/openzipkin/zipkin-go: commit='3741243b287094fda649c7f0fa74bd51f37dc122', urls=[https://github.com/openzipkin/zipkin-go.git, git@github.com:openzipkin/zipkin-go.git] in /home/jenkins/.gradle/go/repo/github.com/openzipkin/zipkin-go/e53ea28b1632f7d2624f50816a45fa4e.
Resolving github.com/openzipkin/zipkin-go: commit='3741243b287094fda649c7f0fa74bd51f37dc122', urls=[https://github.com/openzipkin/zipkin-go.git, git@github.com:openzipkin/zipkin-go.git]
Skip updating github.com/pelletier/go-toml: commit='acdc4509485b587f5e675510c4f2c63e90ff68a8', urls=[https://github.com/pelletier/go-toml.git, git@github.com:pelletier/go-toml.git] in /home/jenkins/.gradle/go/repo/github.com/pelletier/go-toml/fcb4bcb69fca9eab0a7b3cb341106167.
Resolving github.com/pelletier/go-toml: commit='acdc4509485b587f5e675510c4f2c63e90ff68a8', urls=[https://github.com/pelletier/go-toml.git, git@github.com:pelletier/go-toml.git]
Resolving cached github.com/coreos/etcd: commit='11214aa33bf5a47d3d9d8dafe0f6b97237dfe921', urls=[https://github.com/coreos/etcd.git, git@github.com:coreos/etcd.git]
Skip updating github.com/pierrec/lz4: commit='ed8d4cc3b461464e69798080a0092bd028910298', urls=[https://github.com/pierrec/lz4.git, git@github.com:pierrec/lz4.git] in /home/jenkins/.gradle/go/repo/github.com/pierrec/lz4/83deb6b4d9e1d60342f2e0141ef3372c.
Resolving github.com/pierrec/lz4: commit='ed8d4cc3b461464e69798080a0092bd028910298', urls=[https://github.com/pierrec/lz4.git, git@github.com:pierrec/lz4.git]
Skip updating github.com/pierrec/xxHash: commit='a0006b13c722f7f12368c00a3d3c2ae8a999a0c6', urls=[https://github.com/pierrec/xxHash.git, git@github.com:pierrec/xxHash.git] in /home/jenkins/.gradle/go/repo/github.com/pierrec/xxHash/0aff276981c744f632693880472ff35f.
Resolving github.com/pierrec/xxHash: commit='a0006b13c722f7f12368c00a3d3c2ae8a999a0c6', urls=[https://github.com/pierrec/xxHash.git, git@github.com:pierrec/xxHash.git]
Skip updating github.com/pkg/errors: commit='30136e27e2ac8d167177e8a583aa4c3fea5be833', urls=[https://github.com/pkg/errors.git, git@github.com:pkg/errors.git] in /home/jenkins/.gradle/go/repo/github.com/pkg/errors/2e4e7e2f9086007efa2e7bd2b4aac96d.
Resolving github.com/pkg/errors: commit='30136e27e2ac8d167177e8a583aa4c3fea5be833', urls=[https://github.com/pkg/errors.git, git@github.com:pkg/errors.git]
Skip updating github.com/pkg/sftp: commit='22e9c1ccc02fc1b9fa3264572e49109b68a86947', urls=[https://github.com/pkg/sftp.git, git@github.com:pkg/sftp.git] in /home/jenkins/.gradle/go/repo/github.com/pkg/sftp/a97d32b473b1b771dd73590d425c6efa.
Resolving github.com/pkg/sftp: commit='22e9c1ccc02fc1b9fa3264572e49109b68a86947', urls=[https://github.com/pkg/sftp.git, git@github.com:pkg/sftp.git]
Skip updating github.com/prometheus/client_golang: commit='9bb6ab929dcbe1c8393cd9ef70387cb69811bd1c', urls=[https://github.com/prometheus/client_golang.git, git@github.com:prometheus/client_golang.git] in /home/jenkins/.gradle/go/repo/github.com/prometheus/client_golang/e47e9fc2682ee532aab4f916e0ba7067.
Resolving github.com/prometheus/client_golang: commit='9bb6ab929dcbe1c8393cd9ef70387cb69811bd1c', urls=[https://github.com/prometheus/client_golang.git, git@github.com:prometheus/client_golang.git]
Resolving cached github.com/coreos/etcd: commit='11214aa33bf5a47d3d9d8dafe0f6b97237dfe921', urls=[https://github.com/coreos/etcd.git, git@github.com:coreos/etcd.git]
Resolving cached github.com/coreos/etcd: commit='11214aa33bf5a47d3d9d8dafe0f6b97237dfe921', urls=[https://github.com/coreos/etcd.git, git@github.com:coreos/etcd.git]
Skip updating github.com/prometheus/procfs: commit='cb4147076ac75738c9a7d279075a253c0cc5acbd', urls=[https://github.com/prometheus/procfs.git, git@github.com:prometheus/procfs.git] in /home/jenkins/.gradle/go/repo/github.com/prometheus/procfs/520728c921fed5d680688350f35d5741.
Resolving github.com/prometheus/procfs: commit='cb4147076ac75738c9a7d279075a253c0cc5acbd', urls=[https://github.com/prometheus/procfs.git, git@github.com:prometheus/procfs.git]
Skip updating github.com/rcrowley/go-metrics: commit='8732c616f52954686704c8645fe1a9d59e9df7c1', urls=[https://github.com/rcrowley/go-metrics.git, git@github.com:rcrowley/go-metrics.git] in /home/jenkins/.gradle/go/repo/github.com/rcrowley/go-metrics/f0d8dabece2ef254f6ec08366c62d08e.
Resolving github.com/rcrowley/go-metrics: commit='8732c616f52954686704c8645fe1a9d59e9df7c1', urls=[https://github.com/rcrowley/go-metrics.git, git@github.com:rcrowley/go-metrics.git]
Skip updating github.com/cpuguy83/go-md2man: commit='dc9f53734905c233adfc09fd4f063dce63ce3daf', urls=[https://github.com/cpuguy83/go-md2man.git, git@github.com:cpuguy83/go-md2man.git] in /home/jenkins/.gradle/go/repo/github.com/cpuguy83/go-md2man/12e5b04f5fe32bdd05573f005036f2c6.
Resolving github.com/cpuguy83/go-md2man: commit='dc9f53734905c233adfc09fd4f063dce63ce3daf', urls=[https://github.com/cpuguy83/go-md2man.git, git@github.com:cpuguy83/go-md2man.git]
Resolving cached github.com/cpuguy83/go-md2man: commit='dc9f53734905c233adfc09fd4f063dce63ce3daf', urls=[https://github.com/cpuguy83/go-md2man.git, git@github.com:cpuguy83/go-md2man.git]
Resolving cached github.com/coreos/etcd: commit='11214aa33bf5a47d3d9d8dafe0f6b97237dfe921', urls=[https://github.com/coreos/etcd.git, git@github.com:coreos/etcd.git]
Resolving cached github.com/coreos/etcd: commit='11214aa33bf5a47d3d9d8dafe0f6b97237dfe921', urls=[https://github.com/coreos/etcd.git, git@github.com:coreos/etcd.git]
Skip updating github.com/spf13/afero: commit='bb8f1927f2a9d3ab41c9340aa034f6b803f4359c', urls=[https://github.com/spf13/afero.git, git@github.com:spf13/afero.git] in /home/jenkins/.gradle/go/repo/github.com/spf13/afero/0d5b43f5d5a0d64c660c5f7f85c69eba.
Resolving github.com/spf13/afero: commit='bb8f1927f2a9d3ab41c9340aa034f6b803f4359c', urls=[https://github.com/spf13/afero.git, git@github.com:spf13/afero.git]
Skip updating github.com/spf13/cast: commit='acbeb36b902d72a7a4c18e8f3241075e7ab763e4', urls=[https://github.com/spf13/cast.git, git@github.com:spf13/cast.git] in /home/jenkins/.gradle/go/repo/github.com/spf13/cast/517542251c45d58331ec1dd452bb121b.
Resolving github.com/spf13/cast: commit='acbeb36b902d72a7a4c18e8f3241075e7ab763e4', urls=[https://github.com/spf13/cast.git, git@github.com:spf13/cast.git]
Skip updating github.com/spf13/cobra: commit='93959269ad99e80983c9ba742a7e01203a4c0e4f', urls=[https://github.com/spf13/cobra.git, git@github.com:spf13/cobra.git] in /home/jenkins/.gradle/go/repo/github.com/spf13/cobra/e71e66962e88c28e97f1d24435dc7be4.
Resolving github.com/spf13/cobra: commit='93959269ad99e80983c9ba742a7e01203a4c0e4f', urls=[https://github.com/spf13/cobra.git, git@github.com:spf13/cobra.git]
Skip updating github.com/spf13/jwalterweatherman: commit='7c0cea34c8ece3fbeb2b27ab9b59511d360fb394', urls=[https://github.com/spf13/jwalterweatherman.git, git@github.com:spf13/jwalterweatherman.git] in /home/jenkins/.gradle/go/repo/github.com/spf13/jwalterweatherman/330c1f6608327a4a7166e17f6e499144.
Resolving github.com/spf13/jwalterweatherman: commit='7c0cea34c8ece3fbeb2b27ab9b59511d360fb394', urls=[https://github.com/spf13/jwalterweatherman.git, git@github.com:spf13/jwalterweatherman.git]
Resolving cached github.com/coreos/etcd: commit='11214aa33bf5a47d3d9d8dafe0f6b97237dfe921', urls=[https://github.com/coreos/etcd.git, git@github.com:coreos/etcd.git]
Skip updating github.com/spf13/viper: commit='aafc9e6bc7b7bb53ddaa75a5ef49a17d6e654be5', urls=[https://github.com/spf13/viper.git, git@github.com:spf13/viper.git] in /home/jenkins/.gradle/go/repo/github.com/spf13/viper/0646b428d96e964862ed970f8f3b1b0d.
Resolving github.com/spf13/viper: commit='aafc9e6bc7b7bb53ddaa75a5ef49a17d6e654be5', urls=[https://github.com/spf13/viper.git, git@github.com:spf13/viper.git]
Skip updating github.com/stathat/go: commit='74669b9f388d9d788c97399a0824adbfee78400e', urls=[https://github.com/stathat/go.git, git@github.com:stathat/go.git] in /home/jenkins/.gradle/go/repo/github.com/stathat/go/50bfc833dbb8ee4dc51ab0c7cc9cdadc.
Resolving github.com/stathat/go: commit='74669b9f388d9d788c97399a0824adbfee78400e', urls=[https://github.com/stathat/go.git, git@github.com:stathat/go.git]
Resolving cached github.com/coreos/etcd: commit='11214aa33bf5a47d3d9d8dafe0f6b97237dfe921', urls=[https://github.com/coreos/etcd.git, git@github.com:coreos/etcd.git]
Resolving cached github.com/coreos/etcd: commit='11214aa33bf5a47d3d9d8dafe0f6b97237dfe921', urls=[https://github.com/coreos/etcd.git, git@github.com:coreos/etcd.git]
Resolving cached github.com/coreos/etcd: commit='11214aa33bf5a47d3d9d8dafe0f6b97237dfe921', urls=[https://github.com/coreos/etcd.git, git@github.com:coreos/etcd.git]
Resolving cached github.com/coreos/etcd: commit='11214aa33bf5a47d3d9d8dafe0f6b97237dfe921', urls=[https://github.com/coreos/etcd.git, git@github.com:coreos/etcd.git]
Skip updating github.com/xordataexchange/crypt: commit='b2862e3d0a775f18c7cfe02273500ae307b61218', urls=[https://github.com/xordataexchange/crypt.git, git@github.com:xordataexchange/crypt.git] in /home/jenkins/.gradle/go/repo/github.com/xordataexchange/crypt/8e109341273400bea10f5f0413dcdd9f.
Resolving github.com/xordataexchange/crypt: commit='b2862e3d0a775f18c7cfe02273500ae307b61218', urls=[https://github.com/xordataexchange/crypt.git, git@github.com:xordataexchange/crypt.git]
Skip updating go.opencensus.io: commit='aa2b39d1618ef56ba156f27cfcdae9042f68f0bc', urls=[https://github.com/census-instrumentation/opencensus-go] in /home/jenkins/.gradle/go/repo/go.opencensus.io/fec515add58c7d1c6457c89d887bb2cd.
Resolving go.opencensus.io: commit='aa2b39d1618ef56ba156f27cfcdae9042f68f0bc', urls=[https://github.com/census-instrumentation/opencensus-go]
Skip updating golang.org/x/crypto: commit='d9133f5469342136e669e85192a26056b587f503', urls=[https://go.googlesource.com/crypto] in /home/jenkins/.gradle/go/repo/golang.org/x/crypto/2aba65426fb5ce67509b4db7a8dec732.
Resolving golang.org/x/crypto: commit='d9133f5469342136e669e85192a26056b587f503', urls=[https://go.googlesource.com/crypto]
Skip updating golang.org/x/debug: commit='95515998a8a4bd7448134b2cb5971dbeb12e0b77', urls=[https://go.googlesource.com/debug] in /home/jenkins/.gradle/go/repo/golang.org/x/debug/9043712fb350d6971269000e35dcbfbe.
Resolving golang.org/x/debug: commit='95515998a8a4bd7448134b2cb5971dbeb12e0b77', urls=[https://go.googlesource.com/debug]
Skip updating golang.org/x/net: commit='2fb46b16b8dda405028c50f7c7f0f9dd1fa6bfb1', urls=[https://go.googlesource.com/net] in /home/jenkins/.gradle/go/repo/golang.org/x/net/f47324d5ea8156d76c2bbb6ec5ebfdb6.
Resolving golang.org/x/net: commit='2fb46b16b8dda405028c50f7c7f0f9dd1fa6bfb1', urls=[https://go.googlesource.com/net]
Skip updating golang.org/x/oauth2: commit='a032972e28060ca4f5644acffae3dfc268cc09db', urls=[https://go.googlesource.com/oauth2] in /home/jenkins/.gradle/go/repo/golang.org/x/oauth2/b0090736c2a63258c64df39f8d8a4b28.
Resolving golang.org/x/oauth2: commit='a032972e28060ca4f5644acffae3dfc268cc09db', urls=[https://go.googlesource.com/oauth2]
Skip updating golang.org/x/sync: commit='fd80eb99c8f653c847d294a001bdf2a3a6f768f5', urls=[https://go.googlesource.com/sync] in /home/jenkins/.gradle/go/repo/golang.org/x/sync/bb244395f28c52df3e99060750ebb26d.
Resolving golang.org/x/sync: commit='fd80eb99c8f653c847d294a001bdf2a3a6f768f5', urls=[https://go.googlesource.com/sync]
Skip updating golang.org/x/sys: commit='37707fdb30a5b38865cfb95e5aab41707daec7fd', urls=[https://go.googlesource.com/sys] in /home/jenkins/.gradle/go/repo/golang.org/x/sys/c019fea3f060e6ac3a7ba229face9b20.
Resolving golang.org/x/sys: commit='37707fdb30a5b38865cfb95e5aab41707daec7fd', urls=[https://go.googlesource.com/sys]
Resolving cached github.com/coreos/etcd: commit='11214aa33bf5a47d3d9d8dafe0f6b97237dfe921', urls=[https://github.com/coreos/etcd.git, git@github.com:coreos/etcd.git]
Resolving cached github.com/coreos/etcd: commit='11214aa33bf5a47d3d9d8dafe0f6b97237dfe921', urls=[https://github.com/coreos/etcd.git, git@github.com:coreos/etcd.git]
Skip updating google.golang.org/api: commit='386d4e5f4f92f86e6aec85985761bba4b938a2d5', urls=[https://code.googlesource.com/google-api-go-client] in /home/jenkins/.gradle/go/repo/google.golang.org/api/e28049fb85a1109eef37826e4bbdd908.
> Task :sdks:python:sdist
Build cache key for task ':sdks:python:sdist' is b85b1bd50247fae814951db138eb52eb
Caching disabled for task ':sdks:python:sdist': Caching has not been enabled for the task
Task ':sdks:python:sdist' is not up-to-date because:
No history is available.
Custom actions are attached to task ':sdks:python:sdist'.
Starting process 'command 'sh''. Working directory: <https://builds.apache.org/job/beam_PostCommit_Py_ValCont/ws/src/sdks/python> Command: sh -c . <https://builds.apache.org/job/beam_PostCommit_Py_ValCont/ws/src/build/gradleenv/1922375555/bin/activate> && cd <https://builds.apache.org/job/beam_PostCommit_Py_ValCont/ws/src/sdks/python/build/srcs/sdks/python> && python setup.py -q sdist --formats zip,gztar --dist-dir <https://builds.apache.org/job/beam_PostCommit_Py_ValCont/ws/src/sdks/python/build>
Successfully started process 'command 'sh''
<https://builds.apache.org/job/beam_PostCommit_Py_ValCont/ws/src/build/gradleenv/1922375555/local/lib/python2.7/site-packages/setuptools/dist.py>:472: UserWarning: Normalizing '2.15.0.dev' to '2.15.0.dev0'
normalized_version,
beam_fn_api.proto: warning: Import google/protobuf/descriptor.proto but not used.
beam_fn_api.proto: warning: Import google/protobuf/wrappers.proto but not used.
DEPRECATION: Python 2.7 will reach the end of its life on January 1st, 2020. Please upgrade your Python as Python 2.7 won't be maintained after that date. A future version of pip will drop support for Python 2.7. More details about Python 2 support in pip, can be found at https://pip.pypa.io/en/latest/development/release-process/#python-2-support
Collecting future==0.16.0
Installing collected packages: future
Successfully installed future-0.16.0
root: Generating grammar tables from /usr/lib/python2.7/lib2to3/PatternGrammar.txt
root: Generating grammar tables from /usr/lib/python2.7/lib2to3/PatternGrammar.txt
root: Generating grammar tables from /usr/lib/python2.7/lib2to3/PatternGrammar.txt
root: Generating grammar tables from /usr/lib/python2.7/lib2to3/PatternGrammar.txt
root: Generating grammar tables from /usr/lib/python2.7/lib2to3/PatternGrammar.txt
root: Generating grammar tables from /usr/lib/python2.7/lib2to3/PatternGrammar.txt
root: Generating grammar tables from /usr/lib/python2.7/lib2to3/PatternGrammar.txt
root: Generating grammar tables from /usr/lib/python2.7/lib2to3/PatternGrammar.txt
root: Generating grammar tables from /usr/lib/python2.7/lib2to3/PatternGrammar.txt
root: Generating grammar tables from /usr/lib/python2.7/lib2to3/PatternGrammar.txt
root: Generating grammar tables from /usr/lib/python2.7/lib2to3/PatternGrammar.txt
root: Generating grammar tables from /usr/lib/python2.7/lib2to3/PatternGrammar.txt
RefactoringTool: Skipping optional fixer: idioms
root: Generating grammar tables from /usr/lib/python2.7/lib2to3/PatternGrammar.txt
root: Generating grammar tables from /usr/lib/python2.7/lib2to3/PatternGrammar.txt
root: Generating grammar tables from /usr/lib/python2.7/lib2to3/PatternGrammar.txt
root: Generating grammar tables from /usr/lib/python2.7/lib2to3/PatternGrammar.txt
root: Generating grammar tables from /usr/lib/python2.7/lib2to3/PatternGrammar.txt
root: Generating grammar tables from /usr/lib/python2.7/lib2to3/PatternGrammar.txt
root: Generating grammar tables from /usr/lib/python2.7/lib2to3/PatternGrammar.txt
root: Generating grammar tables from /usr/lib/python2.7/lib2to3/PatternGrammar.txt
root: Generating grammar tables from /usr/lib/python2.7/lib2to3/PatternGrammar.txt
root: Generating grammar tables from /usr/lib/python2.7/lib2to3/PatternGrammar.txt
root: Generating grammar tables from /usr/lib/python2.7/lib2to3/PatternGrammar.txt
root: Generating grammar tables from /usr/lib/python2.7/lib2to3/PatternGrammar.txt
root: Generating grammar tables from /usr/lib/python2.7/lib2to3/PatternGrammar.txt
root: Generating grammar tables from /usr/lib/python2.7/lib2to3/PatternGrammar.txt
root: Generating grammar tables from /usr/lib/python2.7/lib2to3/PatternGrammar.txt
root: Generating grammar tables from /usr/lib/python2.7/lib2to3/PatternGrammar.txt
root: Generating grammar tables from /usr/lib/python2.7/lib2to3/PatternGrammar.txt
root: Generating grammar tables from /usr/lib/python2.7/lib2to3/PatternGrammar.txt
root: Generating grammar tables from /usr/lib/python2.7/lib2to3/PatternGrammar.txt
root: Generating grammar tables from /usr/lib/python2.7/lib2to3/PatternGrammar.txt
root: Generating grammar tables from /usr/lib/python2.7/lib2to3/PatternGrammar.txt
root: Generating grammar tables from /usr/lib/python2.7/lib2to3/PatternGrammar.txt
root: Generating grammar tables from /usr/lib/python2.7/lib2to3/PatternGrammar.txt
RefactoringTool: Skipping optional fixer: ws_comma
root: Generating grammar tables from /usr/lib/python2.7/lib2to3/PatternGrammar.txt
root: Generating grammar tables from /usr/lib/python2.7/lib2to3/PatternGrammar.txt
root: Generating grammar tables from /usr/lib/python2.7/lib2to3/PatternGrammar.txt
root: Generating grammar tables from /usr/lib/python2.7/lib2to3/PatternGrammar.txt
root: Generating grammar tables from /usr/lib/python2.7/lib2to3/PatternGrammar.txt
root: Generating grammar tables from /usr/lib/python2.7/lib2to3/PatternGrammar.txt
root: Generating grammar tables from /usr/lib/python2.7/lib2to3/PatternGrammar.txt
root: Generating grammar tables from /usr/lib/python2.7/lib2to3/PatternGrammar.txt
root: Generating grammar tables from /usr/lib/python2.7/lib2to3/PatternGrammar.txt
root: Generating grammar tables from /usr/lib/python2.7/lib2to3/PatternGrammar.txt
root: Generating grammar tables from /usr/lib/python2.7/lib2to3/PatternGrammar.txt
root: Generating grammar tables from /usr/lib/python2.7/lib2to3/PatternGrammar.txt
root: Generating grammar tables from /usr/lib/python2.7/lib2to3/PatternGrammar.txt
root: Generating grammar tables from /usr/lib/python2.7/lib2to3/PatternGrammar.txt
root: Generating grammar tables from /usr/lib/python2.7/lib2to3/PatternGrammar.txt
root: Generating grammar tables from /usr/lib/python2.7/lib2to3/PatternGrammar.txt
root: Generating grammar tables from /usr/lib/python2.7/lib2to3/PatternGrammar.txt
root: Generating grammar tables from /usr/lib/python2.7/lib2to3/PatternGrammar.txt
root: Generating grammar tables from /usr/lib/python2.7/lib2to3/PatternGrammar.txt
root: Generating grammar tables from /usr/lib/python2.7/lib2to3/PatternGrammar.txt
root: Generating grammar tables from /usr/lib/python2.7/lib2to3/PatternGrammar.txt
RefactoringTool: No changes to <https://builds.apache.org/job/beam_PostCommit_Py_ValCont/ws/src/sdks/python/build/srcs/sdks/python/apache_beam/portability/api/beam_artifact_api_pb2.py>
RefactoringTool: Refactored <https://builds.apache.org/job/beam_PostCommit_Py_ValCont/ws/src/sdks/python/build/srcs/sdks/python/apache_beam/portability/api/beam_artifact_api_pb2_grpc.py>
RefactoringTool: Refactored <https://builds.apache.org/job/beam_PostCommit_Py_ValCont/ws/src/sdks/python/build/srcs/sdks/python/apache_beam/portability/api/beam_expansion_api_pb2.py>
RefactoringTool: Refactored <https://builds.apache.org/job/beam_PostCommit_Py_ValCont/ws/src/sdks/python/build/srcs/sdks/python/apache_beam/portability/api/beam_expansion_api_pb2_grpc.py>
RefactoringTool: Refactored <https://builds.apache.org/job/beam_PostCommit_Py_ValCont/ws/src/sdks/python/build/srcs/sdks/python/apache_beam/portability/api/beam_fn_api_pb2.py>
RefactoringTool: Refactored <https://builds.apache.org/job/beam_PostCommit_Py_ValCont/ws/src/sdks/python/build/srcs/sdks/python/apache_beam/portability/api/beam_fn_api_pb2_grpc.py>
RefactoringTool: Refactored <https://builds.apache.org/job/beam_PostCommit_Py_ValCont/ws/src/sdks/python/build/srcs/sdks/python/apache_beam/portability/api/beam_job_api_pb2.py>
RefactoringTool: Refactored <https://builds.apache.org/job/beam_PostCommit_Py_ValCont/ws/src/sdks/python/build/srcs/sdks/python/apache_beam/portability/api/beam_job_api_pb2_grpc.py>
RefactoringTool: No changes to <https://builds.apache.org/job/beam_PostCommit_Py_ValCont/ws/src/sdks/python/build/srcs/sdks/python/apache_beam/portability/api/beam_provision_api_pb2.py>
RefactoringTool: Refactored <https://builds.apache.org/job/beam_PostCommit_Py_ValCont/ws/src/sdks/python/build/srcs/sdks/python/apache_beam/portability/api/beam_provision_api_pb2_grpc.py>
RefactoringTool: Refactored <https://builds.apache.org/job/beam_PostCommit_Py_ValCont/ws/src/sdks/python/build/srcs/sdks/python/apache_beam/portability/api/beam_runner_api_pb2.py>
RefactoringTool: No changes to <https://builds.apache.org/job/beam_PostCommit_Py_ValCont/ws/src/sdks/python/build/srcs/sdks/python/apache_beam/portability/api/endpoints_pb2.py>
RefactoringTool: Refactored <https://builds.apache.org/job/beam_PostCommit_Py_ValCont/ws/src/sdks/python/build/srcs/sdks/python/apache_beam/portability/api/external_transforms_pb2.py>
RefactoringTool: Refactored <https://builds.apache.org/job/beam_PostCommit_Py_ValCont/ws/src/sdks/python/build/srcs/sdks/python/apache_beam/portability/api/metrics_pb2.py>
RefactoringTool: No changes to <https://builds.apache.org/job/beam_PostCommit_Py_ValCont/ws/src/sdks/python/build/srcs/sdks/python/apache_beam/portability/api/schema_pb2.py>
RefactoringTool: Refactored <https://builds.apache.org/job/beam_PostCommit_Py_ValCont/ws/src/sdks/python/build/srcs/sdks/python/apache_beam/portability/api/standard_window_fns_pb2.py>
RefactoringTool: Files that were modified:
RefactoringTool: <https://builds.apache.org/job/beam_PostCommit_Py_ValCont/ws/src/sdks/python/build/srcs/sdks/python/apache_beam/portability/api/beam_artifact_api_pb2.py>
RefactoringTool: <https://builds.apache.org/job/beam_PostCommit_Py_ValCont/ws/src/sdks/python/build/srcs/sdks/python/apache_beam/portability/api/beam_artifact_api_pb2_grpc.py>
RefactoringTool: <https://builds.apache.org/job/beam_PostCommit_Py_ValCont/ws/src/sdks/python/build/srcs/sdks/python/apache_beam/portability/api/beam_expansion_api_pb2.py>
RefactoringTool: <https://builds.apache.org/job/beam_PostCommit_Py_ValCont/ws/src/sdks/python/build/srcs/sdks/python/apache_beam/portability/api/beam_expansion_api_pb2_grpc.py>
RefactoringTool: <https://builds.apache.org/job/beam_PostCommit_Py_ValCont/ws/src/sdks/python/build/srcs/sdks/python/apache_beam/portability/api/beam_fn_api_pb2.py>
RefactoringTool: <https://builds.apache.org/job/beam_PostCommit_Py_ValCont/ws/src/sdks/python/build/srcs/sdks/python/apache_beam/portability/api/beam_fn_api_pb2_grpc.py>
RefactoringTool: <https://builds.apache.org/job/beam_PostCommit_Py_ValCont/ws/src/sdks/python/build/srcs/sdks/python/apache_beam/portability/api/beam_job_api_pb2.py>
RefactoringTool: <https://builds.apache.org/job/beam_PostCommit_Py_ValCont/ws/src/sdks/python/build/srcs/sdks/python/apache_beam/portability/api/beam_job_api_pb2_grpc.py>
RefactoringTool: <https://builds.apache.org/job/beam_PostCommit_Py_ValCont/ws/src/sdks/python/build/srcs/sdks/python/apache_beam/portability/api/beam_provision_api_pb2.py>
RefactoringTool: <https://builds.apache.org/job/beam_PostCommit_Py_ValCont/ws/src/sdks/python/build/srcs/sdks/python/apache_beam/portability/api/beam_provision_api_pb2_grpc.py>
RefactoringTool: <https://builds.apache.org/job/beam_PostCommit_Py_ValCont/ws/src/sdks/python/build/srcs/sdks/python/apache_beam/portability/api/beam_runner_api_pb2.py>
RefactoringTool: <https://builds.apache.org/job/beam_PostCommit_Py_ValCont/ws/src/sdks/python/build/srcs/sdks/python/apache_beam/portability/api/endpoints_pb2.py>
RefactoringTool: <https://builds.apache.org/job/beam_PostCommit_Py_ValCont/ws/src/sdks/python/build/srcs/sdks/python/apache_beam/portability/api/external_transforms_pb2.py>
RefactoringTool: <https://builds.apache.org/job/beam_PostCommit_Py_ValCont/ws/src/sdks/python/build/srcs/sdks/python/apache_beam/portability/api/metrics_pb2.py>
RefactoringTool: <https://builds.apache.org/job/beam_PostCommit_Py_ValCont/ws/src/sdks/python/build/srcs/sdks/python/apache_beam/portability/api/schema_pb2.py>
RefactoringTool: <https://builds.apache.org/job/beam_PostCommit_Py_ValCont/ws/src/sdks/python/build/srcs/sdks/python/apache_beam/portability/api/standard_window_fns_pb2.py>
warning: no files found matching 'README.md'
warning: no files found matching 'NOTICE'
warning: no files found matching 'LICENSE'
warning: cmd: standard file not found: should have one of README, README.rst, README.txt, README.md
:sdks:python:sdist (Thread[Execution worker for ':',5,main]) completed. Took 7.035 secs.
The message received from the daemon indicates that the daemon has disappeared.
Build request sent: Build{id=3128d0a2-526a-45d1-9c29-6eafa1af68cd, currentDir=<https://builds.apache.org/job/beam_PostCommit_Py_ValCont/ws/src}>
Attempting to read last messages from the daemon log...
Daemon pid: 1851
log file: /home/jenkins/.gradle/daemon/5.2.1/daemon-1851.out.log
----- Last 20 lines from daemon log file - daemon-1851.out.log -----
RefactoringTool: <https://builds.apache.org/job/beam_PostCommit_Py_ValCont/ws/src/sdks/python/build/srcs/sdks/python/apache_beam/portability/api/beam_job_api_pb2_grpc.py>
RefactoringTool: <https://builds.apache.org/job/beam_PostCommit_Py_ValCont/ws/src/sdks/python/build/srcs/sdks/python/apache_beam/portability/api/beam_provision_api_pb2.py>
RefactoringTool: <https://builds.apache.org/job/beam_PostCommit_Py_ValCont/ws/src/sdks/python/build/srcs/sdks/python/apache_beam/portability/api/beam_provision_api_pb2_grpc.py>
RefactoringTool: <https://builds.apache.org/job/beam_PostCommit_Py_ValCont/ws/src/sdks/python/build/srcs/sdks/python/apache_beam/portability/api/beam_runner_api_pb2.py>
RefactoringTool: <https://builds.apache.org/job/beam_PostCommit_Py_ValCont/ws/src/sdks/python/build/srcs/sdks/python/apache_beam/portability/api/endpoints_pb2.py>
RefactoringTool: <https://builds.apache.org/job/beam_PostCommit_Py_ValCont/ws/src/sdks/python/build/srcs/sdks/python/apache_beam/portability/api/external_transforms_pb2.py>
RefactoringTool: <https://builds.apache.org/job/beam_PostCommit_Py_ValCont/ws/src/sdks/python/build/srcs/sdks/python/apache_beam/portability/api/metrics_pb2.py>
RefactoringTool: <https://builds.apache.org/job/beam_PostCommit_Py_ValCont/ws/src/sdks/python/build/srcs/sdks/python/apache_beam/portability/api/schema_pb2.py>
RefactoringTool: <https://builds.apache.org/job/beam_PostCommit_Py_ValCont/ws/src/sdks/python/build/srcs/sdks/python/apache_beam/portability/api/standard_window_fns_pb2.py>
warning: no files found matching 'README.md'
warning: no files found matching 'NOTICE'
warning: no files found matching 'LICENSE'
warning: cmd: standard file not found: should have one of README, README.rst, README.txt, README.md
Resolving golang.org/x/sys: commit='37707fdb30a5b38865cfb95e5aab41707daec7fd', urls=[https://go.googlesource.com/sys]
Resolving cached github.com/coreos/etcd: commit='11214aa33bf5a47d3d9d8dafe0f6b97237dfe921', urls=[https://github.com/coreos/etcd.git, git@github.com:coreos/etcd.git]
Resolving cached github.com/coreos/etcd: commit='11214aa33bf5a47d3d9d8dafe0f6b97237dfe921', urls=[https://github.com/coreos/etcd.git, git@github.com:coreos/etcd.git]
Skip updating google.golang.org/api: commit='386d4e5f4f92f86e6aec85985761bba4b938a2d5', urls=[https://code.googlesource.com/google-api-go-client] in /home/jenkins/.gradle/go/repo/google.golang.org/api/e28049fb85a1109eef37826e4bbdd908.
:sdks:python:sdist (Thread[Execution worker for ':',5,main]) completed. Took 7.035 secs.
Daemon vm is shutting down... The daemon has exited normally or was terminated in response to a user interrupt.
----- End of the daemon log -----
FAILURE: Build failed with an exception.
* What went wrong:
Gradle build daemon disappeared unexpectedly (it may have been killed or may have crashed)
* Try:
Run with --stacktrace option to get the stack trace. Run with --debug option to get more log output. Run with --scan to get full insights.
* Get more help at https://help.gradle.org
Build step 'Execute shell' marked build as failure
---------------------------------------------------------------------
To unsubscribe, e-mail: builds-unsubscribe@beam.apache.org
For additional commands, e-mail: builds-help@beam.apache.org
Jenkins build is back to normal : beam_PostCommit_Py_ValCont #3898
Posted by Apache Jenkins Server <je...@builds.apache.org>.
See <https://builds.apache.org/job/beam_PostCommit_Py_ValCont/3898/display/redirect?page=changes>
---------------------------------------------------------------------
To unsubscribe, e-mail: builds-unsubscribe@beam.apache.org
For additional commands, e-mail: builds-help@beam.apache.org
Jenkins build is back to normal : beam_PostCommit_Py_ValCont #3897
Posted by Apache Jenkins Server <je...@builds.apache.org>.
See <https://builds.apache.org/job/beam_PostCommit_Py_ValCont/3897/display/redirect?page=changes>
---------------------------------------------------------------------
To unsubscribe, e-mail: builds-unsubscribe@beam.apache.org
For additional commands, e-mail: builds-help@beam.apache.org
Build failed in Jenkins: beam_PostCommit_Py_ValCont #3896
Posted by Apache Jenkins Server <je...@builds.apache.org>.
See <https://builds.apache.org/job/beam_PostCommit_Py_ValCont/3896/display/redirect?page=changes>
Changes:
[kenn] [BEAM-7755] adding support for nested rows and arrays in BigQuery to
------------------------------------------
[...truncated 199.80 KB...]
copying apache_beam/runners/worker/statesampler.py -> apache-beam-2.15.0.dev0/apache_beam/runners/worker
copying apache_beam/runners/worker/statesampler_fast.pxd -> apache-beam-2.15.0.dev0/apache_beam/runners/worker
copying apache_beam/runners/worker/statesampler_fast.pyx -> apache-beam-2.15.0.dev0/apache_beam/runners/worker
copying apache_beam/runners/worker/statesampler_slow.py -> apache-beam-2.15.0.dev0/apache_beam/runners/worker
copying apache_beam/runners/worker/statesampler_test.py -> apache-beam-2.15.0.dev0/apache_beam/runners/worker
copying apache_beam/runners/worker/worker_id_interceptor.py -> apache-beam-2.15.0.dev0/apache_beam/runners/worker
copying apache_beam/runners/worker/worker_id_interceptor_test.py -> apache-beam-2.15.0.dev0/apache_beam/runners/worker
copying apache_beam/testing/__init__.py -> apache-beam-2.15.0.dev0/apache_beam/testing
copying apache_beam/testing/metric_result_matchers.py -> apache-beam-2.15.0.dev0/apache_beam/testing
copying apache_beam/testing/metric_result_matchers_test.py -> apache-beam-2.15.0.dev0/apache_beam/testing
copying apache_beam/testing/pipeline_verifiers.py -> apache-beam-2.15.0.dev0/apache_beam/testing
copying apache_beam/testing/pipeline_verifiers_test.py -> apache-beam-2.15.0.dev0/apache_beam/testing
copying apache_beam/testing/synthetic_pipeline.py -> apache-beam-2.15.0.dev0/apache_beam/testing
copying apache_beam/testing/synthetic_pipeline_test.py -> apache-beam-2.15.0.dev0/apache_beam/testing
copying apache_beam/testing/test_pipeline.py -> apache-beam-2.15.0.dev0/apache_beam/testing
copying apache_beam/testing/test_pipeline_test.py -> apache-beam-2.15.0.dev0/apache_beam/testing
copying apache_beam/testing/test_stream.py -> apache-beam-2.15.0.dev0/apache_beam/testing
copying apache_beam/testing/test_stream_test.py -> apache-beam-2.15.0.dev0/apache_beam/testing
copying apache_beam/testing/test_utils.py -> apache-beam-2.15.0.dev0/apache_beam/testing
copying apache_beam/testing/test_utils_test.py -> apache-beam-2.15.0.dev0/apache_beam/testing
copying apache_beam/testing/util.py -> apache-beam-2.15.0.dev0/apache_beam/testing
copying apache_beam/testing/util_test.py -> apache-beam-2.15.0.dev0/apache_beam/testing
copying apache_beam/testing/benchmarks/__init__.py -> apache-beam-2.15.0.dev0/apache_beam/testing/benchmarks
copying apache_beam/testing/benchmarks/nexmark/__init__.py -> apache-beam-2.15.0.dev0/apache_beam/testing/benchmarks/nexmark
copying apache_beam/testing/benchmarks/nexmark/nexmark_launcher.py -> apache-beam-2.15.0.dev0/apache_beam/testing/benchmarks/nexmark
copying apache_beam/testing/benchmarks/nexmark/nexmark_util.py -> apache-beam-2.15.0.dev0/apache_beam/testing/benchmarks/nexmark
copying apache_beam/testing/benchmarks/nexmark/models/__init__.py -> apache-beam-2.15.0.dev0/apache_beam/testing/benchmarks/nexmark/models
copying apache_beam/testing/benchmarks/nexmark/models/nexmark_model.py -> apache-beam-2.15.0.dev0/apache_beam/testing/benchmarks/nexmark/models
copying apache_beam/testing/benchmarks/nexmark/queries/__init__.py -> apache-beam-2.15.0.dev0/apache_beam/testing/benchmarks/nexmark/queries
copying apache_beam/testing/benchmarks/nexmark/queries/query0.py -> apache-beam-2.15.0.dev0/apache_beam/testing/benchmarks/nexmark/queries
copying apache_beam/testing/benchmarks/nexmark/queries/query1.py -> apache-beam-2.15.0.dev0/apache_beam/testing/benchmarks/nexmark/queries
copying apache_beam/testing/benchmarks/nexmark/queries/query2.py -> apache-beam-2.15.0.dev0/apache_beam/testing/benchmarks/nexmark/queries
copying apache_beam/testing/data/trigger_transcripts.yaml -> apache-beam-2.15.0.dev0/apache_beam/testing/data
copying apache_beam/testing/load_tests/__init__.py -> apache-beam-2.15.0.dev0/apache_beam/testing/load_tests
copying apache_beam/testing/load_tests/co_group_by_key_test.py -> apache-beam-2.15.0.dev0/apache_beam/testing/load_tests
copying apache_beam/testing/load_tests/combine_test.py -> apache-beam-2.15.0.dev0/apache_beam/testing/load_tests
copying apache_beam/testing/load_tests/group_by_key_test.py -> apache-beam-2.15.0.dev0/apache_beam/testing/load_tests
copying apache_beam/testing/load_tests/load_test.py -> apache-beam-2.15.0.dev0/apache_beam/testing/load_tests
copying apache_beam/testing/load_tests/load_test_metrics_utils.py -> apache-beam-2.15.0.dev0/apache_beam/testing/load_tests
copying apache_beam/testing/load_tests/pardo_test.py -> apache-beam-2.15.0.dev0/apache_beam/testing/load_tests
copying apache_beam/testing/load_tests/sideinput_test.py -> apache-beam-2.15.0.dev0/apache_beam/testing/load_tests
copying apache_beam/tools/__init__.py -> apache-beam-2.15.0.dev0/apache_beam/tools
copying apache_beam/tools/coders_microbenchmark.py -> apache-beam-2.15.0.dev0/apache_beam/tools
copying apache_beam/tools/distribution_counter_microbenchmark.py -> apache-beam-2.15.0.dev0/apache_beam/tools
copying apache_beam/tools/map_fn_microbenchmark.py -> apache-beam-2.15.0.dev0/apache_beam/tools
copying apache_beam/tools/microbenchmarks_test.py -> apache-beam-2.15.0.dev0/apache_beam/tools
copying apache_beam/tools/sideinput_microbenchmark.py -> apache-beam-2.15.0.dev0/apache_beam/tools
copying apache_beam/tools/utils.py -> apache-beam-2.15.0.dev0/apache_beam/tools
copying apache_beam/transforms/__init__.py -> apache-beam-2.15.0.dev0/apache_beam/transforms
copying apache_beam/transforms/combiners.py -> apache-beam-2.15.0.dev0/apache_beam/transforms
copying apache_beam/transforms/combiners_test.py -> apache-beam-2.15.0.dev0/apache_beam/transforms
copying apache_beam/transforms/core.py -> apache-beam-2.15.0.dev0/apache_beam/transforms
copying apache_beam/transforms/create_source.py -> apache-beam-2.15.0.dev0/apache_beam/transforms
copying apache_beam/transforms/create_test.py -> apache-beam-2.15.0.dev0/apache_beam/transforms
copying apache_beam/transforms/cy_combiners.pxd -> apache-beam-2.15.0.dev0/apache_beam/transforms
copying apache_beam/transforms/cy_combiners.py -> apache-beam-2.15.0.dev0/apache_beam/transforms
copying apache_beam/transforms/cy_dataflow_distribution_counter.pxd -> apache-beam-2.15.0.dev0/apache_beam/transforms
copying apache_beam/transforms/cy_dataflow_distribution_counter.pyx -> apache-beam-2.15.0.dev0/apache_beam/transforms
copying apache_beam/transforms/dataflow_distribution_counter_test.py -> apache-beam-2.15.0.dev0/apache_beam/transforms
copying apache_beam/transforms/display.py -> apache-beam-2.15.0.dev0/apache_beam/transforms
copying apache_beam/transforms/display_test.py -> apache-beam-2.15.0.dev0/apache_beam/transforms
copying apache_beam/transforms/dofn_lifecycle_test.py -> apache-beam-2.15.0.dev0/apache_beam/transforms
copying apache_beam/transforms/external.py -> apache-beam-2.15.0.dev0/apache_beam/transforms
copying apache_beam/transforms/external_test.py -> apache-beam-2.15.0.dev0/apache_beam/transforms
copying apache_beam/transforms/external_test_it.py -> apache-beam-2.15.0.dev0/apache_beam/transforms
copying apache_beam/transforms/ptransform.py -> apache-beam-2.15.0.dev0/apache_beam/transforms
copying apache_beam/transforms/ptransform_test.py -> apache-beam-2.15.0.dev0/apache_beam/transforms
copying apache_beam/transforms/py_dataflow_distribution_counter.py -> apache-beam-2.15.0.dev0/apache_beam/transforms
copying apache_beam/transforms/sideinputs.py -> apache-beam-2.15.0.dev0/apache_beam/transforms
copying apache_beam/transforms/sideinputs_test.py -> apache-beam-2.15.0.dev0/apache_beam/transforms
copying apache_beam/transforms/stats.py -> apache-beam-2.15.0.dev0/apache_beam/transforms
copying apache_beam/transforms/stats_test.py -> apache-beam-2.15.0.dev0/apache_beam/transforms
copying apache_beam/transforms/timeutil.py -> apache-beam-2.15.0.dev0/apache_beam/transforms
copying apache_beam/transforms/trigger.py -> apache-beam-2.15.0.dev0/apache_beam/transforms
copying apache_beam/transforms/trigger_test.py -> apache-beam-2.15.0.dev0/apache_beam/transforms
copying apache_beam/transforms/userstate.py -> apache-beam-2.15.0.dev0/apache_beam/transforms
copying apache_beam/transforms/userstate_test.py -> apache-beam-2.15.0.dev0/apache_beam/transforms
copying apache_beam/transforms/util.py -> apache-beam-2.15.0.dev0/apache_beam/transforms
copying apache_beam/transforms/util_test.py -> apache-beam-2.15.0.dev0/apache_beam/transforms
copying apache_beam/transforms/window.py -> apache-beam-2.15.0.dev0/apache_beam/transforms
copying apache_beam/transforms/window_test.py -> apache-beam-2.15.0.dev0/apache_beam/transforms
copying apache_beam/transforms/write_ptransform_test.py -> apache-beam-2.15.0.dev0/apache_beam/transforms
copying apache_beam/typehints/__init__.py -> apache-beam-2.15.0.dev0/apache_beam/typehints
copying apache_beam/typehints/decorators.py -> apache-beam-2.15.0.dev0/apache_beam/typehints
copying apache_beam/typehints/native_type_compatibility.py -> apache-beam-2.15.0.dev0/apache_beam/typehints
copying apache_beam/typehints/native_type_compatibility_test.py -> apache-beam-2.15.0.dev0/apache_beam/typehints
copying apache_beam/typehints/opcodes.py -> apache-beam-2.15.0.dev0/apache_beam/typehints
copying apache_beam/typehints/trivial_inference.py -> apache-beam-2.15.0.dev0/apache_beam/typehints
copying apache_beam/typehints/trivial_inference_test.py -> apache-beam-2.15.0.dev0/apache_beam/typehints
copying apache_beam/typehints/typecheck.py -> apache-beam-2.15.0.dev0/apache_beam/typehints
copying apache_beam/typehints/typed_pipeline_test.py -> apache-beam-2.15.0.dev0/apache_beam/typehints
copying apache_beam/typehints/typehints.py -> apache-beam-2.15.0.dev0/apache_beam/typehints
copying apache_beam/typehints/typehints_test.py -> apache-beam-2.15.0.dev0/apache_beam/typehints
copying apache_beam/utils/__init__.py -> apache-beam-2.15.0.dev0/apache_beam/utils
copying apache_beam/utils/annotations.py -> apache-beam-2.15.0.dev0/apache_beam/utils
copying apache_beam/utils/annotations_test.py -> apache-beam-2.15.0.dev0/apache_beam/utils
copying apache_beam/utils/counters.pxd -> apache-beam-2.15.0.dev0/apache_beam/utils
copying apache_beam/utils/counters.py -> apache-beam-2.15.0.dev0/apache_beam/utils
copying apache_beam/utils/counters_test.py -> apache-beam-2.15.0.dev0/apache_beam/utils
copying apache_beam/utils/plugin.py -> apache-beam-2.15.0.dev0/apache_beam/utils
copying apache_beam/utils/processes.py -> apache-beam-2.15.0.dev0/apache_beam/utils
copying apache_beam/utils/processes_test.py -> apache-beam-2.15.0.dev0/apache_beam/utils
copying apache_beam/utils/profiler.py -> apache-beam-2.15.0.dev0/apache_beam/utils
copying apache_beam/utils/proto_utils.py -> apache-beam-2.15.0.dev0/apache_beam/utils
copying apache_beam/utils/retry.py -> apache-beam-2.15.0.dev0/apache_beam/utils
copying apache_beam/utils/retry_test.py -> apache-beam-2.15.0.dev0/apache_beam/utils
copying apache_beam/utils/timestamp.py -> apache-beam-2.15.0.dev0/apache_beam/utils
copying apache_beam/utils/timestamp_test.py -> apache-beam-2.15.0.dev0/apache_beam/utils
copying apache_beam/utils/urns.py -> apache-beam-2.15.0.dev0/apache_beam/utils
copying apache_beam/utils/windowed_value.pxd -> apache-beam-2.15.0.dev0/apache_beam/utils
copying apache_beam/utils/windowed_value.py -> apache-beam-2.15.0.dev0/apache_beam/utils
copying apache_beam/utils/windowed_value_test.py -> apache-beam-2.15.0.dev0/apache_beam/utils
Writing apache-beam-2.15.0.dev0/setup.cfg
creating dist
Creating tar archive
removing 'apache-beam-2.15.0.dev0' (and everything under it)
SDK_LOCATION=$(find dist/apache-beam-*.tar.gz)
find dist/apache-beam-*.tar.gz
# Run ValidatesRunner tests on Google Cloud Dataflow service
echo ">>> RUNNING DATAFLOW RUNNER VALIDATESCONTAINER TEST"
>>> RUNNING DATAFLOW RUNNER VALIDATESCONTAINER TEST
python setup.py nosetests \
--attr ValidatesContainer \
--nologcapture \
--processes=1 \
--process-timeout=900 \
--test-pipeline-options=" \
--runner=TestDataflowRunner \
--project=$PROJECT \
--worker_harness_container_image=$CONTAINER:$TAG \
--staging_location=$GCS_LOCATION/staging-validatesrunner-test \
--temp_location=$GCS_LOCATION/temp-validatesrunner-test \
--output=$GCS_LOCATION/output \
--sdk_location=$SDK_LOCATION \
--num_workers=1"
<https://builds.apache.org/job/beam_PostCommit_Py_ValCont/ws/src/sdks/python/container/venv/python/local/lib/python2.7/site-packages/setuptools/dist.py>:472: UserWarning: Normalizing '2.15.0.dev' to '2.15.0.dev0'
normalized_version,
running nosetests
running egg_info
<https://builds.apache.org/job/beam_PostCommit_Py_ValCont/ws/src/sdks/python/gen_protos.py>:57: UserWarning: Installing grpcio-tools is recommended for development.
warnings.warn('Installing grpcio-tools is recommended for development.')
writing requirements to apache_beam.egg-info/requires.txt
writing apache_beam.egg-info/PKG-INFO
writing top-level names to apache_beam.egg-info/top_level.txt
writing dependency_links to apache_beam.egg-info/dependency_links.txt
writing entry points to apache_beam.egg-info/entry_points.txt
reading manifest file 'apache_beam.egg-info/SOURCES.txt'
reading manifest template 'MANIFEST.in'
warning: no files found matching 'README.md'
warning: no files found matching 'NOTICE'
warning: no files found matching 'LICENSE'
writing manifest file 'apache_beam.egg-info/SOURCES.txt'
WARNING:root:Using deprecated Datastore client.
This client will be removed in Beam 3.0 (next Beam major release).
Please migrate to apache_beam.io.gcp.datastore.v1new.datastoreio.
WARNING:root:python-snappy is not installed; some tests will be skipped.
WARNING:root:Tensorflow is not installed, so skipping some tests.
test_wordcount_fnapi_it (apache_beam.examples.wordcount_it_test.WordCountIT) ... ok
WARNING:root:Discarding unparseable args: ['--output=gs://temp-storage-for-end-to-end-tests/output']
WARNING:root:Discarding unparseable args: ['--output=gs://temp-storage-for-end-to-end-tests/output']
Exception in thread Thread-2:
Traceback (most recent call last):
File "/usr/lib/python2.7/threading.py", line 801, in __bootstrap_inner
self.run()
File "/usr/lib/python2.7/threading.py", line 754, in run
self.__target(*self.__args, **self.__kwargs)
File "<https://builds.apache.org/job/beam_PostCommit_Py_ValCont/ws/src/sdks/python/apache_beam/runners/dataflow/dataflow_runner.py",> line 190, in poll_for_job_completion
job_id, page_token=page_token, start_time=last_message_time)
File "<https://builds.apache.org/job/beam_PostCommit_Py_ValCont/ws/src/sdks/python/apache_beam/utils/retry.py",> line 197, in wrapper
return fun(*args, **kwargs)
File "<https://builds.apache.org/job/beam_PostCommit_Py_ValCont/ws/src/sdks/python/apache_beam/runners/dataflow/internal/apiclient.py",> line 755, in list_messages
response = self._client.projects_locations_jobs_messages.List(request)
File "<https://builds.apache.org/job/beam_PostCommit_Py_ValCont/ws/src/sdks/python/apache_beam/runners/dataflow/internal/clients/dataflow/dataflow_v1b3_client.py",> line 553, in List
config, request, global_params=global_params)
File "<https://builds.apache.org/job/beam_PostCommit_Py_ValCont/ws/src/sdks/python/container/venv/python/local/lib/python2.7/site-packages/apitools/base/py/base_api.py",> line 731, in _RunMethod
return self.ProcessHttpResponse(method_config, http_response, request)
File "<https://builds.apache.org/job/beam_PostCommit_Py_ValCont/ws/src/sdks/python/container/venv/python/local/lib/python2.7/site-packages/apitools/base/py/base_api.py",> line 737, in ProcessHttpResponse
self.__ProcessHttpResponse(method_config, http_response, request))
File "<https://builds.apache.org/job/beam_PostCommit_Py_ValCont/ws/src/sdks/python/container/venv/python/local/lib/python2.7/site-packages/apitools/base/py/base_api.py",> line 604, in __ProcessHttpResponse
http_response, method_config=method_config, request=request)
HttpNotFoundError: HttpError accessing <https://dataflow.googleapis.com/v1b3/projects/apache-beam-testing/locations/us-central1/jobs/2019-07-26_13_37_34-10282576642668044223/messages?alt=json&startTime=2019-07-26T20%3A39%3A16.855Z>: response: <{'status': '404', 'content-length': '280', 'x-xss-protection': '0', 'x-content-type-options': 'nosniff', 'transfer-encoding': 'chunked', 'vary': 'Origin, X-Origin, Referer', 'server': 'ESF', '-content-encoding': 'gzip', 'cache-control': 'private', 'date': 'Fri, 26 Jul 2019 20:40:13 GMT', 'x-frame-options': 'SAMEORIGIN', 'content-type': 'application/json; charset=UTF-8'}>, content <{
"error": {
"code": 404,
"message": "(f9dfd22965bb704f): Information about job 2019-07-26_13_37_34-10282576642668044223 could not be found in our system. Please double check the id is correct. If it is please contact customer support.",
"status": "NOT_FOUND"
}
}
>
test_metrics_fnapi_it (apache_beam.runners.dataflow.dataflow_exercise_metrics_pipeline_test.ExerciseMetricsPipelineTest) ... FAIL
======================================================================
FAIL: test_metrics_fnapi_it (apache_beam.runners.dataflow.dataflow_exercise_metrics_pipeline_test.ExerciseMetricsPipelineTest)
----------------------------------------------------------------------
Traceback (most recent call last):
File "<https://builds.apache.org/job/beam_PostCommit_Py_ValCont/ws/src/sdks/python/apache_beam/runners/dataflow/dataflow_exercise_metrics_pipeline_test.py",> line 60, in test_metrics_fnapi_it
result = self.run_pipeline(experiment='beam_fn_api')
File "<https://builds.apache.org/job/beam_PostCommit_Py_ValCont/ws/src/sdks/python/apache_beam/runners/dataflow/dataflow_exercise_metrics_pipeline_test.py",> line 48, in run_pipeline
return dataflow_exercise_metrics_pipeline.apply_and_run(p)
File "<https://builds.apache.org/job/beam_PostCommit_Py_ValCont/ws/src/sdks/python/apache_beam/runners/dataflow/dataflow_exercise_metrics_pipeline.py",> line 197, in apply_and_run
result = pipeline.run()
File "<https://builds.apache.org/job/beam_PostCommit_Py_ValCont/ws/src/sdks/python/apache_beam/pipeline.py",> line 406, in run
self._options).run(False)
File "<https://builds.apache.org/job/beam_PostCommit_Py_ValCont/ws/src/sdks/python/apache_beam/pipeline.py",> line 419, in run
return self.runner.run_pipeline(self, self._options)
File "<https://builds.apache.org/job/beam_PostCommit_Py_ValCont/ws/src/sdks/python/apache_beam/runners/dataflow/test_dataflow_runner.py",> line 64, in run_pipeline
self.result.wait_until_finish(duration=wait_duration)
File "<https://builds.apache.org/job/beam_PostCommit_Py_ValCont/ws/src/sdks/python/apache_beam/runners/dataflow/dataflow_runner.py",> line 1330, in wait_until_finish
'Job did not reach to a terminal state after waiting indefinitely.')
AssertionError: Job did not reach to a terminal state after waiting indefinitely.
-------------------- >> begin captured stdout << ---------------------
Found: https://console.cloud.google.com/dataflow/jobsDetail/locations/us-central1/jobs/2019-07-26_13_37_34-10282576642668044223?project=apache-beam-testing.
--------------------- >> end captured stdout << ----------------------
----------------------------------------------------------------------
XML: <https://builds.apache.org/job/beam_PostCommit_Py_ValCont/ws/src/sdks/python/nosetests.xml>
----------------------------------------------------------------------
Ran 2 tests in 848.974s
FAILED (failures=1)
cleanup_container
Untagged: us.gcr.io/apache-beam-testing/jenkins/python:20190726-202242
Untagged: us.gcr.io/apache-beam-testing/jenkins/python@sha256:045dfc316a01e4b759621a5c2dd68f8e2b34f803f32c6f289ff17c755bd0c998
Deleted: sha256:f4f2b12856001771899ebe32a3dae0075ed3229509931cd370d245785312ca03
Deleted: sha256:cf7a5fd650876686b2dbc5dc6be36d890f91d773b0f5f5ce71b013298b7ace6b
Deleted: sha256:983f157e4afe8855c87223581d638f8d6b6c9e0fa32cb637fee2548c9556d51c
Deleted: sha256:a580d31565ea789e3945a5cd830d70b1bf885b7040c4ebdc0a071ae0d631d06f
Deleted: sha256:d2c6921ed5f6ef2434e9eb6687d183f1015c677a82db3f3bb0eaeaba5bfff229
Deleted: sha256:379785354867595b8d61eb947993b670b061fa43ba10876e79fbc8efcd7b6fa8
Deleted: sha256:b3cfa4e45487d7562aeeb056086667370248f56264c1c58b96bcec61cf9f73f3
Deleted: sha256:53864c55d1f815caa9297c5b3380a0f36365c0cfc9d4e37088ae939cf7e6b641
Deleted: sha256:790dba0614e1f0922612bb8e5f6a6ec62b59caee2b2f7ee3c1053405c50bcf89
Deleted: sha256:c87322a801eaffd7d6b100a8f5356ca12b015f3d0d0e232c5d51edd29527247a
Deleted: sha256:d599a05d871e684e8a1737b78e442b489906bc91bafa3fbfdafb6b4dac616ffb
Deleted: sha256:dae7aa901c94538789c276c1b4391e6269446b86cc398d785f9f1dae61ef6cd9
Deleted: sha256:fbf332705fae1f41c737406588bcff215a7e1f4e2c41405c19839d63e9235808
Deleted: sha256:e1dc14a7b7bfb8e1de799f8365ffcaf5f381bcd0e6a4f4b99dc06d1fceb70280
Digests:
- us.gcr.io/apache-beam-testing/jenkins/python@sha256:045dfc316a01e4b759621a5c2dd68f8e2b34f803f32c6f289ff17c755bd0c998
Associated tags:
- 20190726-202242
Tags:
- us.gcr.io/apache-beam-testing/jenkins/python:20190726-202242
Deleted [us.gcr.io/apache-beam-testing/jenkins/python:20190726-202242].
Deleted [us.gcr.io/apache-beam-testing/jenkins/python@sha256:045dfc316a01e4b759621a5c2dd68f8e2b34f803f32c6f289ff17c755bd0c998].
Removed the container
Build step 'Execute shell' marked build as failure
---------------------------------------------------------------------
To unsubscribe, e-mail: builds-unsubscribe@beam.apache.org
For additional commands, e-mail: builds-help@beam.apache.org
Jenkins build is back to normal : beam_PostCommit_Py_ValCont #3895
Posted by Apache Jenkins Server <je...@builds.apache.org>.
See <https://builds.apache.org/job/beam_PostCommit_Py_ValCont/3895/display/redirect>
---------------------------------------------------------------------
To unsubscribe, e-mail: builds-unsubscribe@beam.apache.org
For additional commands, e-mail: builds-help@beam.apache.org