You are viewing a plain text version of this content. The canonical link for it is here.
Posted to dev@brooklyn.apache.org by Apache Jenkins Server <je...@builds.apache.org> on 2022/11/03 12:33:01 UTC

Build failed in Jenkins: Brooklyn » Brooklyn - Server module » master #395

See <https://ci-builds.apache.org/job/Brooklyn/job/brooklyn-server/job/master/395/display/redirect>

Changes:


------------------------------------------
[...truncated 27335 lines...]
2022-11-03 12:32:42,598 INFO  o.a.b.t.s.LoggingVerboseReporter                  TESTNG PASSED CONFIGURATION: "Surefire test" - @BeforeMethod org.apache.brooklyn.core.catalog.internal.CatalogVersioningTest.setUp() finished in 2 ms
2022-11-03 12:32:42,598 INFO  o.a.b.t.s.LoggingVerboseReporter                  TESTNG INVOKING: "Surefire test" - org.apache.brooklyn.core.catalog.internal.CatalogVersioningTest.testGetLatestSkipsDisabled()
2022-11-03 12:32:42,598 INFO  o.a.b.t.s.LoggingVerboseReporter                  TESTNG PASSED: "Surefire test" - org.apache.brooklyn.core.catalog.internal.CatalogVersioningTest.testGetLatestSkipsDisabled() finished in 0 ms
2022-11-03 12:32:42,598 INFO  o.a.b.t.s.LoggingVerboseReporter                  TESTNG INVOKING CONFIGURATION: "Surefire test" - @AfterMethod org.apache.brooklyn.core.catalog.internal.CatalogVersioningTest.tearDown()
2022-11-03 12:32:42,599 INFO  o.a.b.t.s.LoggingVerboseReporter                  TESTNG PASSED CONFIGURATION: "Surefire test" - @AfterMethod org.apache.brooklyn.core.catalog.internal.CatalogVersioningTest.tearDown() finished in 1 ms
2022-11-03 12:32:42,599 INFO  o.a.b.t.s.LoggingVerboseReporter                  TESTNG INVOKING CONFIGURATION: "Surefire test" - @BeforeMethod org.apache.brooklyn.core.catalog.internal.CatalogVersioningTest.setUp()
2022-11-03 12:32:42,600 INFO  o.a.b.t.s.LoggingVerboseReporter                  TESTNG PASSED CONFIGURATION: "Surefire test" - @BeforeMethod org.apache.brooklyn.core.catalog.internal.CatalogVersioningTest.setUp() finished in 1 ms
2022-11-03 12:32:42,601 INFO  o.a.b.t.s.LoggingVerboseReporter                  TESTNG INVOKING: "Surefire test" - org.apache.brooklyn.core.catalog.internal.CatalogVersioningTest.testGetLatestStable()
2022-11-03 12:32:42,601 INFO  o.a.b.t.s.LoggingVerboseReporter                  TESTNG PASSED: "Surefire test" - org.apache.brooklyn.core.catalog.internal.CatalogVersioningTest.testGetLatestStable() finished in 0 ms
2022-11-03 12:32:42,601 INFO  o.a.b.t.s.LoggingVerboseReporter                  TESTNG INVOKING CONFIGURATION: "Surefire test" - @AfterMethod org.apache.brooklyn.core.catalog.internal.CatalogVersioningTest.tearDown()
2022-11-03 12:32:42,601 INFO  o.a.b.t.s.LoggingVerboseReporter                  TESTNG PASSED CONFIGURATION: "Surefire test" - @AfterMethod org.apache.brooklyn.core.catalog.internal.CatalogVersioningTest.tearDown() finished in 0 ms
2022-11-03 12:32:42,602 INFO  o.a.b.t.s.LoggingVerboseReporter                  TESTNG INVOKING CONFIGURATION: "Surefire test" - @BeforeMethod org.apache.brooklyn.core.catalog.internal.CatalogVersioningTest.setUp()
2022-11-03 12:32:42,603 INFO  o.a.b.t.s.LoggingVerboseReporter                  TESTNG PASSED CONFIGURATION: "Surefire test" - @BeforeMethod org.apache.brooklyn.core.catalog.internal.CatalogVersioningTest.setUp() finished in 1 ms
2022-11-03 12:32:42,603 INFO  o.a.b.t.s.LoggingVerboseReporter                  TESTNG INVOKING: "Surefire test" - org.apache.brooklyn.core.catalog.internal.CatalogVersioningTest.testLegacyParsingVersion()
2022-11-03 12:32:42,604 INFO  o.a.b.t.s.LoggingVerboseReporter                  TESTNG PASSED: "Surefire test" - org.apache.brooklyn.core.catalog.internal.CatalogVersioningTest.testLegacyParsingVersion() finished in 1 ms
2022-11-03 12:32:42,604 INFO  o.a.b.t.s.LoggingVerboseReporter                  TESTNG INVOKING CONFIGURATION: "Surefire test" - @AfterMethod org.apache.brooklyn.core.catalog.internal.CatalogVersioningTest.tearDown()
2022-11-03 12:32:42,604 INFO  o.a.b.t.s.LoggingVerboseReporter                  TESTNG PASSED CONFIGURATION: "Surefire test" - @AfterMethod org.apache.brooklyn.core.catalog.internal.CatalogVersioningTest.tearDown() finished in 0 ms
2022-11-03 12:32:42,604 INFO  o.a.b.t.s.LoggingVerboseReporter                  TESTNG INVOKING CONFIGURATION: "Surefire test" - @BeforeMethod org.apache.brooklyn.core.catalog.internal.CatalogVersioningTest.setUp()
2022-11-03 12:32:42,606 INFO  o.a.b.t.s.LoggingVerboseReporter                  TESTNG PASSED CONFIGURATION: "Surefire test" - @BeforeMethod org.apache.brooklyn.core.catalog.internal.CatalogVersioningTest.setUp() finished in 2 ms
2022-11-03 12:32:42,606 INFO  o.a.b.t.s.LoggingVerboseReporter                  TESTNG INVOKING: "Surefire test" - org.apache.brooklyn.core.catalog.internal.CatalogVersioningTest.testList()
2022-11-03 12:32:42,607 INFO  o.a.b.t.s.LoggingVerboseReporter                  TESTNG PASSED: "Surefire test" - org.apache.brooklyn.core.catalog.internal.CatalogVersioningTest.testList() finished in 1 ms
2022-11-03 12:32:42,607 INFO  o.a.b.t.s.LoggingVerboseReporter                  TESTNG INVOKING CONFIGURATION: "Surefire test" - @AfterMethod org.apache.brooklyn.core.catalog.internal.CatalogVersioningTest.tearDown()
2022-11-03 12:32:42,607 INFO  o.a.b.t.s.LoggingVerboseReporter                  TESTNG PASSED CONFIGURATION: "Surefire test" - @AfterMethod org.apache.brooklyn.core.catalog.internal.CatalogVersioningTest.tearDown() finished in 0 ms
2022-11-03 12:32:42,607 INFO  o.a.b.t.s.LoggingVerboseReporter                  TESTNG INVOKING: "Surefire test" - org.apache.brooklyn.core.catalog.internal.CatalogItemComparatorTest.testComparison()
2022-11-03 12:32:42,610 INFO  o.a.b.t.s.LoggingVerboseReporter                  TESTNG PASSED: "Surefire test" - org.apache.brooklyn.core.catalog.internal.CatalogItemComparatorTest.testComparison() finished in 3 ms
2022-11-03 12:32:42,610 INFO  o.a.b.t.s.LoggingVerboseReporter                  TESTNG INVOKING CONFIGURATION: "Surefire test" - @BeforeMethod org.apache.brooklyn.core.catalog.internal.StaticTypePlanTransformerTest.setUp()
2022-11-03 12:32:42,612 INFO  o.a.b.t.s.LoggingVerboseReporter                  TESTNG PASSED CONFIGURATION: "Surefire test" - @BeforeMethod org.apache.brooklyn.core.catalog.internal.StaticTypePlanTransformerTest.setUp() finished in 2 ms
2022-11-03 12:32:42,612 INFO  o.a.b.t.s.LoggingVerboseReporter                  TESTNG INVOKING: "Surefire test" - org.apache.brooklyn.core.catalog.internal.StaticTypePlanTransformerTest.testCreateSpec()
2022-11-03 12:32:42,612 INFO  o.a.b.t.s.LoggingVerboseReporter                  TESTNG PASSED: "Surefire test" - org.apache.brooklyn.core.catalog.internal.StaticTypePlanTransformerTest.testCreateSpec() finished in 0 ms
2022-11-03 12:32:42,613 INFO  o.a.b.t.s.LoggingVerboseReporter                  TESTNG INVOKING CONFIGURATION: "Surefire test" - @AfterMethod org.apache.brooklyn.core.catalog.internal.StaticTypePlanTransformerTest.tearDown()
2022-11-03 12:32:42,613 INFO  o.a.b.t.s.LoggingVerboseReporter                  TESTNG PASSED CONFIGURATION: "Surefire test" - @AfterMethod org.apache.brooklyn.core.catalog.internal.StaticTypePlanTransformerTest.tearDown() finished in 0 ms
2022-11-03 12:32:42,613 INFO  o.a.b.t.s.LoggingVerboseReporter                  TESTNG INVOKING CONFIGURATION: "Surefire test" - @BeforeMethod org.apache.brooklyn.core.catalog.internal.CatalogDtoTest.setUp()
2022-11-03 12:32:42,614 INFO  o.a.b.t.s.LoggingVerboseReporter                  TESTNG PASSED CONFIGURATION: "Surefire test" - @BeforeMethod org.apache.brooklyn.core.catalog.internal.CatalogDtoTest.setUp() finished in 1 ms
2022-11-03 12:32:42,614 INFO  o.a.b.t.s.LoggingVerboseReporter                  TESTNG INVOKING: "Surefire test" - org.apache.brooklyn.core.catalog.internal.CatalogDtoTest.testVersionedIdSplitter()
2022-11-03 12:32:42,614 INFO  o.a.b.t.s.LoggingVerboseReporter                  TESTNG PASSED: "Surefire test" - org.apache.brooklyn.core.catalog.internal.CatalogDtoTest.testVersionedIdSplitter() finished in 0 ms
2022-11-03 12:32:42,614 INFO  o.a.b.t.s.LoggingVerboseReporter                  TESTNG INVOKING CONFIGURATION: "Surefire test" - @AfterMethod org.apache.brooklyn.core.catalog.internal.CatalogDtoTest.tearDown()
2022-11-03 12:32:42,615 INFO  o.a.b.t.s.LoggingVerboseReporter                  TESTNG PASSED CONFIGURATION: "Surefire test" - @AfterMethod org.apache.brooklyn.core.catalog.internal.CatalogDtoTest.tearDown() finished in 1 ms
2022-11-03 12:32:42,615 INFO  o.a.b.t.s.LoggingVerboseReporter                  TESTNG INVOKING CONFIGURATION: "Surefire test" - @BeforeClass org.apache.brooklyn.core.catalog.internal.CatalogUpgradeScannerTest.setUp()
2022-11-03 12:32:42,673 INFO  o.a.b.t.s.LoggingVerboseReporter                  TESTNG PASSED CONFIGURATION: "Surefire test" - @BeforeClass org.apache.brooklyn.core.catalog.internal.CatalogUpgradeScannerTest.setUp() finished in 58 ms
2022-11-03 12:32:42,674 INFO  o.a.b.t.s.LoggingVerboseReporter                  TESTNG INVOKING: "Surefire test" - org.apache.brooklyn.core.catalog.internal.CatalogUpgradeScannerTest.whenNoUnmanagedOrManagedBundlesThenNoUpgrades()
2022-11-03 12:32:42,915 INFO  o.a.b.t.s.LoggingVerboseReporter                  TESTNG PASSED: "Surefire test" - org.apache.brooklyn.core.catalog.internal.CatalogUpgradeScannerTest.whenNoUnmanagedOrManagedBundlesThenNoUpgrades() finished in 242 ms
2022-11-03 12:32:42,915 INFO  o.a.b.t.s.LoggingVerboseReporter                  TESTNG INVOKING: "Surefire test" - org.apache.brooklyn.core.catalog.internal.CatalogUpgradeScannerTest.whenOnlyManagedBundleHasUpgradesThenNoUpgradesForUnmanagedBundles()
2022-11-03 12:32:42,932 INFO  o.a.b.t.s.LoggingVerboseReporter                  TESTNG PASSED: "Surefire test" - org.apache.brooklyn.core.catalog.internal.CatalogUpgradeScannerTest.whenOnlyManagedBundleHasUpgradesThenNoUpgradesForUnmanagedBundles() finished in 17 ms
2022-11-03 12:32:42,932 INFO  o.a.b.t.s.LoggingVerboseReporter                  TESTNG INVOKING: "Surefire test" - org.apache.brooklyn.core.catalog.internal.CatalogUpgradeScannerTest.whenOnlyManagedBundleHasUpgradesThenUpgradesForManagedBundle()
2022-11-03 12:32:42,937 INFO  o.a.b.t.s.LoggingVerboseReporter                  TESTNG PASSED: "Surefire test" - org.apache.brooklyn.core.catalog.internal.CatalogUpgradeScannerTest.whenOnlyManagedBundleHasUpgradesThenUpgradesForManagedBundle() finished in 5 ms
2022-11-03 12:32:42,937 INFO  o.a.b.t.s.LoggingVerboseReporter                  TESTNG INVOKING: "Surefire test" - org.apache.brooklyn.core.catalog.internal.CatalogUpgradeScannerTest.whenOnlyUnmanagedBundleHasUpgradesThenNoUpgradesForManagedBundles()
2022-11-03 12:32:42,940 INFO  o.a.b.t.s.LoggingVerboseReporter                  TESTNG PASSED: "Surefire test" - org.apache.brooklyn.core.catalog.internal.CatalogUpgradeScannerTest.whenOnlyUnmanagedBundleHasUpgradesThenNoUpgradesForManagedBundles() finished in 3 ms
2022-11-03 12:32:42,940 INFO  o.a.b.t.s.LoggingVerboseReporter                  TESTNG INVOKING: "Surefire test" - org.apache.brooklyn.core.catalog.internal.CatalogUpgradeScannerTest.whenOnlyUnmanagedBundleHasUpgradesThenUpgradesForUnmanagedBundle()
2022-11-03 12:32:42,942 INFO  o.a.b.t.s.LoggingVerboseReporter                  TESTNG PASSED: "Surefire test" - org.apache.brooklyn.core.catalog.internal.CatalogUpgradeScannerTest.whenOnlyUnmanagedBundleHasUpgradesThenUpgradesForUnmanagedBundle() finished in 2 ms
2022-11-03 12:32:42,942 INFO  o.a.b.t.s.LoggingVerboseReporter                  TESTNG INVOKING: "Surefire test" - org.apache.brooklyn.core.catalog.internal.CatalogUpgradeScannerTest.whenUnmanagedAndManagedBundlesWithNoUpgradesThenNoUpgrades()
2022-11-03 12:32:42,945 INFO  o.a.b.t.s.LoggingVerboseReporter                  TESTNG PASSED: "Surefire test" - org.apache.brooklyn.core.catalog.internal.CatalogUpgradeScannerTest.whenUnmanagedAndManagedBundlesWithNoUpgradesThenNoUpgrades() finished in 3 ms
2022-11-03 12:32:42,945 INFO  o.a.b.t.s.LoggingVerboseReporter                  TESTNG INVOKING: "Surefire test" - org.apache.brooklyn.core.catalog.internal.CatalogItemBuilderTest.testBuiltEntity()
2022-11-03 12:32:42,946 INFO  o.a.b.t.s.LoggingVerboseReporter                  TESTNG PASSED: "Surefire test" - org.apache.brooklyn.core.catalog.internal.CatalogItemBuilderTest.testBuiltEntity() finished in 0 ms
2022-11-03 12:32:42,946 INFO  o.a.b.t.s.LoggingVerboseReporter                  TESTNG INVOKING: "Surefire test" - org.apache.brooklyn.core.catalog.internal.CatalogItemBuilderTest.testCannotBuildWithoutName()
2022-11-03 12:32:42,946 INFO  o.a.b.t.s.LoggingVerboseReporter                  TESTNG PASSED: "Surefire test" - org.apache.brooklyn.core.catalog.internal.CatalogItemBuilderTest.testCannotBuildWithoutName() finished in 0 ms
2022-11-03 12:32:42,946 INFO  o.a.b.t.s.LoggingVerboseReporter                  TESTNG INVOKING: "Surefire test" - org.apache.brooklyn.core.catalog.internal.CatalogItemBuilderTest.testCannotBuildWithoutVersion()
2022-11-03 12:32:42,946 INFO  o.a.b.t.s.LoggingVerboseReporter                  TESTNG PASSED: "Surefire test" - org.apache.brooklyn.core.catalog.internal.CatalogItemBuilderTest.testCannotBuildWithoutVersion() finished in 0 ms
2022-11-03 12:32:42,946 INFO  o.a.b.t.s.LoggingVerboseReporter                  TESTNG INVOKING: "Surefire test" - org.apache.brooklyn.core.catalog.internal.CatalogItemBuilderTest.testEmptyLibrariesIfNotSpecified()
2022-11-03 12:32:42,947 INFO  o.a.b.t.s.LoggingVerboseReporter                  TESTNG PASSED: "Surefire test" - org.apache.brooklyn.core.catalog.internal.CatalogItemBuilderTest.testEmptyLibrariesIfNotSpecified() finished in 0 ms
2022-11-03 12:32:42,947 INFO  o.a.b.t.s.LoggingVerboseReporter                  TESTNG INVOKING: "Surefire test" - org.apache.brooklyn.core.catalog.internal.CatalogItemBuilderTest.testNewEnricherReturnCatalogEnricherItemDto()
2022-11-03 12:32:42,947 INFO  o.a.b.t.s.LoggingVerboseReporter                  TESTNG PASSED: "Surefire test" - org.apache.brooklyn.core.catalog.internal.CatalogItemBuilderTest.testNewEnricherReturnCatalogEnricherItemDto() finished in 0 ms
2022-11-03 12:32:42,947 INFO  o.a.b.t.s.LoggingVerboseReporter                  TESTNG INVOKING: "Surefire test" - org.apache.brooklyn.core.catalog.internal.CatalogItemBuilderTest.testNewEntityReturnCatalogEntityItemDto()
2022-11-03 12:32:42,947 INFO  o.a.b.t.s.LoggingVerboseReporter                  TESTNG PASSED: "Surefire test" - org.apache.brooklyn.core.catalog.internal.CatalogItemBuilderTest.testNewEntityReturnCatalogEntityItemDto() finished in 0 ms
2022-11-03 12:32:42,947 INFO  o.a.b.t.s.LoggingVerboseReporter                  TESTNG INVOKING: "Surefire test" - org.apache.brooklyn.core.catalog.internal.CatalogItemBuilderTest.testNewLocationReturnCatalogLocationItemDto()
2022-11-03 12:32:42,947 INFO  o.a.b.t.s.LoggingVerboseReporter                  TESTNG PASSED: "Surefire test" - org.apache.brooklyn.core.catalog.internal.CatalogItemBuilderTest.testNewLocationReturnCatalogLocationItemDto() finished in 0 ms
2022-11-03 12:32:42,948 INFO  o.a.b.t.s.LoggingVerboseReporter                  TESTNG INVOKING: "Surefire test" - org.apache.brooklyn.core.catalog.internal.CatalogItemBuilderTest.testNewPolicyReturnCatalogPolicyItemDto()
2022-11-03 12:32:42,948 INFO  o.a.b.t.s.LoggingVerboseReporter                  TESTNG PASSED: "Surefire test" - org.apache.brooklyn.core.catalog.internal.CatalogItemBuilderTest.testNewPolicyReturnCatalogPolicyItemDto() finished in 0 ms
2022-11-03 12:32:42,948 INFO  o.a.b.t.s.LoggingVerboseReporter                  TESTNG INVOKING: "Surefire test" - org.apache.brooklyn.core.catalog.internal.CatalogItemBuilderTest.testNewTemplateReturnCatalogTemplateItemDto()
2022-11-03 12:32:42,948 INFO  o.a.b.t.s.LoggingVerboseReporter                  TESTNG PASSED: "Surefire test" - org.apache.brooklyn.core.catalog.internal.CatalogItemBuilderTest.testNewTemplateReturnCatalogTemplateItemDto() finished in 0 ms
2022-11-03 12:32:42,948 INFO  o.a.b.t.s.LoggingVerboseReporter                  TESTNG INVOKING CONFIGURATION: "Surefire test" - @BeforeMethod org.apache.brooklyn.core.catalog.internal.CatalogTemplateTest.setUp()
2022-11-03 12:32:42,951 INFO  o.a.b.t.s.LoggingVerboseReporter                  TESTNG PASSED CONFIGURATION: "Surefire test" - @BeforeMethod org.apache.brooklyn.core.catalog.internal.CatalogTemplateTest.setUp() finished in 3 ms
2022-11-03 12:32:42,951 INFO  o.a.b.t.s.LoggingVerboseReporter                  TESTNG INVOKING: "Surefire test" - org.apache.brooklyn.core.catalog.internal.CatalogTemplateTest.testMapTemplate()
2022-11-03 12:32:42,987 INFO  o.a.b.t.s.LoggingVerboseReporter                  TESTNG PASSED: "Surefire test" - org.apache.brooklyn.core.catalog.internal.CatalogTemplateTest.testMapTemplate() finished in 36 ms
2022-11-03 12:32:42,987 INFO  o.a.b.t.s.LoggingVerboseReporter                  TESTNG INVOKING CONFIGURATION: "Surefire test" - @AfterMethod org.apache.brooklyn.core.catalog.internal.CatalogTemplateTest.tearDown()
2022-11-03 12:32:42,988 INFO  o.a.b.t.s.LoggingVerboseReporter                  TESTNG PASSED CONFIGURATION: "Surefire test" - @AfterMethod org.apache.brooklyn.core.catalog.internal.CatalogTemplateTest.tearDown() finished in 1 ms
2022-11-03 12:32:42,988 INFO  o.a.b.t.s.LoggingVerboseReporter                  TESTNG INVOKING CONFIGURATION: "Surefire test" - @BeforeMethod org.apache.brooklyn.core.catalog.internal.CatalogTemplateTest.setUp()
2022-11-03 12:32:42,990 INFO  o.a.b.t.s.LoggingVerboseReporter                  TESTNG PASSED CONFIGURATION: "Surefire test" - @BeforeMethod org.apache.brooklyn.core.catalog.internal.CatalogTemplateTest.setUp() finished in 2 ms
2022-11-03 12:32:42,990 INFO  o.a.b.t.s.LoggingVerboseReporter                  TESTNG INVOKING: "Surefire test" - org.apache.brooklyn.core.catalog.internal.CatalogTemplateTest.testMultiLineStringTemplate()
2022-11-03 12:32:43,018 INFO  o.a.b.t.s.LoggingVerboseReporter                  TESTNG PASSED: "Surefire test" - org.apache.brooklyn.core.catalog.internal.CatalogTemplateTest.testMultiLineStringTemplate() finished in 28 ms
2022-11-03 12:32:43,018 INFO  o.a.b.t.s.LoggingVerboseReporter                  TESTNG INVOKING CONFIGURATION: "Surefire test" - @AfterMethod org.apache.brooklyn.core.catalog.internal.CatalogTemplateTest.tearDown()
2022-11-03 12:32:43,019 INFO  o.a.b.t.s.LoggingVerboseReporter                  TESTNG PASSED CONFIGURATION: "Surefire test" - @AfterMethod org.apache.brooklyn.core.catalog.internal.CatalogTemplateTest.tearDown() finished in 1 ms
2022-11-03 12:32:43,019 INFO  o.a.b.t.s.LoggingVerboseReporter                  TESTNG INVOKING CONFIGURATION: "Surefire test" - @BeforeMethod org.apache.brooklyn.core.catalog.internal.CatalogTemplateTest.setUp()
2022-11-03 12:32:43,021 INFO  o.a.b.t.s.LoggingVerboseReporter                  TESTNG PASSED CONFIGURATION: "Surefire test" - @BeforeMethod org.apache.brooklyn.core.catalog.internal.CatalogTemplateTest.setUp() finished in 2 ms
2022-11-03 12:32:43,021 INFO  o.a.b.t.s.LoggingVerboseReporter                  TESTNG INVOKING: "Surefire test" - org.apache.brooklyn.core.catalog.internal.CatalogTemplateTest.testOneLineStringMapTemplate()
2022-11-03 12:32:43,050 INFO  o.a.b.t.s.LoggingVerboseReporter                  TESTNG PASSED: "Surefire test" - org.apache.brooklyn.core.catalog.internal.CatalogTemplateTest.testOneLineStringMapTemplate() finished in 29 ms
2022-11-03 12:32:43,051 INFO  o.a.b.t.s.LoggingVerboseReporter                  TESTNG INVOKING CONFIGURATION: "Surefire test" - @AfterMethod org.apache.brooklyn.core.catalog.internal.CatalogTemplateTest.tearDown()
2022-11-03 12:32:43,051 INFO  o.a.b.t.s.LoggingVerboseReporter                  TESTNG PASSED CONFIGURATION: "Surefire test" - @AfterMethod org.apache.brooklyn.core.catalog.internal.CatalogTemplateTest.tearDown() finished in 1 ms
2022-11-03 12:32:43,051 INFO  o.a.b.t.s.LoggingVerboseReporter                  TESTNG INVOKING CONFIGURATION: "Surefire test" - @BeforeMethod org.apache.brooklyn.core.catalog.internal.CatalogTemplateTest.setUp()
2022-11-03 12:32:43,053 INFO  o.a.b.t.s.LoggingVerboseReporter                  TESTNG PASSED CONFIGURATION: "Surefire test" - @BeforeMethod org.apache.brooklyn.core.catalog.internal.CatalogTemplateTest.setUp() finished in 2 ms
2022-11-03 12:32:43,053 INFO  o.a.b.t.s.LoggingVerboseReporter                  TESTNG INVOKING: "Surefire test" - org.apache.brooklyn.core.catalog.internal.CatalogTemplateTest.testOneLineStringTypeTemplate()
2022-11-03 12:32:43,081 INFO  o.a.b.t.s.LoggingVerboseReporter                  TESTNG PASSED: "Surefire test" - org.apache.brooklyn.core.catalog.internal.CatalogTemplateTest.testOneLineStringTypeTemplate() finished in 28 ms
2022-11-03 12:32:43,081 INFO  o.a.b.t.s.LoggingVerboseReporter                  TESTNG INVOKING CONFIGURATION: "Surefire test" - @AfterMethod org.apache.brooklyn.core.catalog.internal.CatalogTemplateTest.tearDown()
2022-11-03 12:32:43,082 INFO  o.a.b.t.s.LoggingVerboseReporter                  TESTNG PASSED CONFIGURATION: "Surefire test" - @AfterMethod org.apache.brooklyn.core.catalog.internal.CatalogTemplateTest.tearDown() finished in 1 ms
[GC (Allocation Failure)  338703K->123781K(754688K), 0.0400188 secs]
2022-11-03 12:32:43,430 INFO  o.a.b.t.s.LoggingVerboseReporter                  TESTNG 
===============================================
    Surefire test
    Tests run: 2593, Failures: 1, Skips: 0
===============================================
[GC (Allocation Failure)  336773K->121499K(760320K), 0.0398959 secs]
2022-11-03 12:32:45,279 INFO  o.a.b.t.s.LoggingVerboseReporter                  TESTNG RUNNING: Suite: "Surefire test" containing "0" Tests (config: null)
2022-11-03 12:32:45,361 INFO  o.a.b.t.s.LoggingVerboseReporter                  TESTNG INVOKING: "Surefire test" - org.apache.brooklyn.util.core.logbook.opensearch.OpenSearchLogStoreTest.queryWithDateTimeTo()
2022-11-03 12:32:45,367 INFO  o.a.b.t.s.LoggingVerboseReporter                  TESTNG PASSED: "Surefire test" - org.apache.brooklyn.util.core.logbook.opensearch.OpenSearchLogStoreTest.queryWithDateTimeTo() finished in 17 ms
2022-11-03 12:32:45,367 INFO  o.a.b.t.s.LoggingVerboseReporter                  TESTNG INVOKING: "Surefire test" - org.apache.brooklyn.util.core.logbook.opensearch.OpenSearchLogStoreTest.queryWithEntityId()
2022-11-03 12:32:45,367 INFO  o.a.b.t.s.LoggingVerboseReporter                  TESTNG PASSED: "Surefire test" - org.apache.brooklyn.util.core.logbook.opensearch.OpenSearchLogStoreTest.queryWithEntityId() finished in 17 ms
2022-11-03 12:32:45,367 INFO  o.a.b.t.s.LoggingVerboseReporter                  TESTNG INVOKING: "Surefire test" - org.apache.brooklyn.util.core.logbook.opensearch.OpenSearchLogStoreTest.queryWithSearchSinglePhrase()
2022-11-03 12:32:45,368 INFO  o.a.b.t.s.LoggingVerboseReporter                  TESTNG PASSED: "Surefire test" - org.apache.brooklyn.util.core.logbook.opensearch.OpenSearchLogStoreTest.queryWithSearchSinglePhrase() finished in 18 ms
2022-11-03 12:32:45,368 INFO  o.a.b.t.s.LoggingVerboseReporter                  TESTNG INVOKING: "Surefire test" - org.apache.brooklyn.util.core.logbook.opensearch.OpenSearchLogStoreTest.queryWithEntityIdAndPhrase()
2022-11-03 12:32:45,368 INFO  o.a.b.t.s.LoggingVerboseReporter                  TESTNG PASSED: "Surefire test" - org.apache.brooklyn.util.core.logbook.opensearch.OpenSearchLogStoreTest.queryWithEntityIdAndPhrase() finished in 18 ms
2022-11-03 12:32:45,368 INFO  o.a.b.t.s.LoggingVerboseReporter                  TESTNG INVOKING: "Surefire test" - org.apache.brooklyn.util.core.logbook.opensearch.OpenSearchLogStoreTest.queryWithTaskId()
2022-11-03 12:32:45,368 INFO  o.a.b.t.s.LoggingVerboseReporter                  TESTNG PASSED: "Surefire test" - org.apache.brooklyn.util.core.logbook.opensearch.OpenSearchLogStoreTest.queryWithTaskId() finished in 18 ms
2022-11-03 12:32:45,369 INFO  o.a.b.t.s.LoggingVerboseReporter                  TESTNG INVOKING: "Surefire test" - org.apache.brooklyn.util.core.logbook.opensearch.OpenSearchLogStoreTest.queryWithTimeRange()
2022-11-03 12:32:45,369 INFO  o.a.b.t.s.LoggingVerboseReporter                  TESTNG PASSED: "Surefire test" - org.apache.brooklyn.util.core.logbook.opensearch.OpenSearchLogStoreTest.queryWithTimeRange() finished in 19 ms
2022-11-03 12:32:45,369 INFO  o.a.b.t.s.LoggingVerboseReporter                  TESTNG INVOKING: "Surefire test" - org.apache.brooklyn.util.core.logbook.opensearch.OpenSearchLogStoreTest.queryWithTaskIdAndPhrase()
2022-11-03 12:32:45,369 INFO  o.a.b.t.s.LoggingVerboseReporter                  TESTNG PASSED: "Surefire test" - org.apache.brooklyn.util.core.logbook.opensearch.OpenSearchLogStoreTest.queryWithTaskIdAndPhrase() finished in 19 ms
2022-11-03 12:32:45,369 INFO  o.a.b.t.s.LoggingVerboseReporter                  TESTNG INVOKING: "Surefire test" - org.apache.brooklyn.util.core.logbook.opensearch.OpenSearchLogStoreTest.queryWithTwoLogLevel()
2022-11-03 12:32:45,371 INFO  o.a.b.t.s.LoggingVerboseReporter                  TESTNG PASSED: "Surefire test" - org.apache.brooklyn.util.core.logbook.opensearch.OpenSearchLogStoreTest.queryWithTwoLogLevel() finished in 20 ms
2022-11-03 12:32:45,371 INFO  o.a.b.t.s.LoggingVerboseReporter                  TESTNG INVOKING: "Surefire test" - org.apache.brooklyn.util.core.logbook.opensearch.OpenSearchLogStoreTest.queryWithOneLogLevelAndRange()
2022-11-03 12:32:45,371 INFO  o.a.b.t.s.LoggingVerboseReporter                  TESTNG PASSED: "Surefire test" - org.apache.brooklyn.util.core.logbook.opensearch.OpenSearchLogStoreTest.queryWithOneLogLevelAndRange() finished in 20 ms
2022-11-03 12:32:45,371 INFO  o.a.b.t.s.LoggingVerboseReporter                  TESTNG INVOKING: "Surefire test" - org.apache.brooklyn.util.core.logbook.opensearch.OpenSearchLogStoreTest.queryWithDateTimeFrom()
2022-11-03 12:32:45,371 INFO  o.a.b.t.s.LoggingVerboseReporter                  TESTNG PASSED: "Surefire test" - org.apache.brooklyn.util.core.logbook.opensearch.OpenSearchLogStoreTest.queryWithDateTimeFrom() finished in 20 ms
2022-11-03 12:32:45,372 INFO  o.a.b.t.s.LoggingVerboseReporter                  TESTNG INVOKING: "Surefire test" - org.apache.brooklyn.util.core.logbook.opensearch.OpenSearchLogStoreTest.queryWithTwoLogLevelAndRange()
2022-11-03 12:32:45,372 INFO  o.a.b.t.s.LoggingVerboseReporter                  TESTNG PASSED: "Surefire test" - org.apache.brooklyn.util.core.logbook.opensearch.OpenSearchLogStoreTest.queryWithTwoLogLevelAndRange() finished in 21 ms
2022-11-03 12:32:45,372 INFO  o.a.b.t.s.LoggingVerboseReporter                  TESTNG INVOKING: "Surefire test" - org.apache.brooklyn.util.core.logbook.opensearch.OpenSearchLogStoreTest.queryWithTailRequest()
2022-11-03 12:32:45,372 INFO  o.a.b.t.s.LoggingVerboseReporter                  TESTNG PASSED: "Surefire test" - org.apache.brooklyn.util.core.logbook.opensearch.OpenSearchLogStoreTest.queryWithTailRequest() finished in 21 ms
2022-11-03 12:32:45,377 INFO  o.a.b.t.s.LoggingVerboseReporter                  TESTNG 
===============================================
    Surefire test
    Tests run: 12, Failures: 0, Skips: 0
===============================================
Tests run: 2605, Failures: 1, Errors: 0, Skipped: 0, Time elapsed: 301.711 sec <<< FAILURE! - in TestSuite
testWorkflowInterruptedAndCanReplay(org.apache.brooklyn.core.workflow.WorkflowPersistReplayErrorsTest)  Time elapsed: 0.475 sec  <<< FAILURE!
java.lang.AssertionError: Failed org.apache.brooklyn.core.workflow.WorkflowPersistReplayErrorsTest$$Lambda$689/1162311406@4f58c47f: RUNNING
	at org.apache.brooklyn.core.workflow.WorkflowPersistReplayErrorsTest.testWorkflowInterruptedAndCanReplay(WorkflowPersistReplayErrorsTest.java:170)

2022-11-03 12:32:45,425 INFO  o.a.b.c.m.i.BrooklynShutdownHooks                 Brooklyn shutdown: stopping entities [TestEntityImpl{id=afx8vd6j52}, TestEntityImpl{id=gbfw798znu}, BlockingEntityImpl{id=toh0uesuqy}]
[GC (Allocation Failure)  331419K->122659K(750592K), 0.0320404 secs]

Results :

Failed tests: 
  WorkflowPersistReplayErrorsTest.testWorkflowInterruptedAndCanReplay:170 Failed org.apache.brooklyn.core.workflow.WorkflowPersistReplayErrorsTest$$Lambda$689/1162311406@4f58c47f: RUNNING

Tests run: 2605, Failures: 1, Errors: 0, Skipped: 0

[INFO] ------------------------------------------------------------------------
[INFO] Reactor Summary:
[INFO] 
[INFO] Brooklyn Server Root ............................... SUCCESS [  1.088 s]
[INFO] Brooklyn Parent Project ............................ SUCCESS [  2.816 s]
[INFO] Brooklyn Test Support Utilities .................... SUCCESS [  5.013 s]
[INFO] Brooklyn Logback Includable Configuration .......... SUCCESS [  0.477 s]
[INFO] Brooklyn Common Utilities .......................... SUCCESS [ 26.348 s]
[INFO] Brooklyn API ....................................... SUCCESS [  2.284 s]
[INFO] CAMP Server Parent Project ......................... SUCCESS [  0.233 s]
[INFO] CAMP Base .......................................... SUCCESS [  3.331 s]
[INFO] Brooklyn Test Support .............................. SUCCESS [  3.178 s]
[INFO] Brooklyn REST Swagger Apidoc Utilities ............. SUCCESS [  2.122 s]
[INFO] Brooklyn Logback Configuration ..................... SUCCESS [  0.290 s]
[INFO] CAMP Server ........................................ SUCCESS [  6.470 s]
[INFO] Brooklyn Felix Runtime ............................. SUCCESS [  3.502 s]
[INFO] Brooklyn Groovy Utilities .......................... SUCCESS [  2.866 s]
[INFO] Brooklyn Core ...................................... FAILURE [06:09 min]
[INFO] Brooklyn Policies .................................. SKIPPED
[INFO] Brooklyn WinRM Software Entities ................... SKIPPED
[INFO] Brooklyn Secure JMXMP Agent ........................ SKIPPED
[INFO] Brooklyn JMX RMI Agent ............................. SKIPPED
[INFO] Brooklyn Jclouds Location Targets .................. SKIPPED
[INFO] Brooklyn Software Base ............................. SKIPPED
[INFO] Brooklyn CAMP ...................................... SKIPPED
[INFO] Brooklyn Launcher Common ........................... SKIPPED
[INFO] Brooklyn REST API .................................. SKIPPED
[INFO] Brooklyn REST Resources ............................ SKIPPED
[INFO] Brooklyn REST Server ............................... SKIPPED
[INFO] Brooklyn Launcher .................................. SKIPPED
[INFO] Brooklyn Container Location Targets ................ SKIPPED
[INFO] Brooklyn Command Line Interface .................... SKIPPED
[INFO] Brooklyn Test Framework ............................ SKIPPED
[INFO] Brooklyn OSGi init ................................. SKIPPED
[INFO] Brooklyn OSGi start ................................ SKIPPED
[INFO] Brooklyn Karaf ..................................... SKIPPED
[INFO] Jetty config fragment .............................. SKIPPED
[INFO] Apache Http Component extension .................... SKIPPED
[INFO] Brooklyn Karaf Features ............................ SKIPPED
[INFO] Brooklyn Karaf Shell Commands ...................... SKIPPED
[INFO] ------------------------------------------------------------------------
[INFO] BUILD FAILURE
[INFO] ------------------------------------------------------------------------
[INFO] Total time: 07:12 min
[INFO] Finished at: 2022-11-03T12:32:46Z
[INFO] Final Memory: 84M/2602M
[INFO] ------------------------------------------------------------------------
[ERROR] Failed to execute goal org.apache.maven.plugins:maven-surefire-plugin:2.19.1:test (default-test) on project brooklyn-core: There are test failures.
[ERROR] 
[ERROR] Please refer to /home/jenkins/workspace/Brooklyn_brooklyn-server_master/core/target/surefire-reports for the individual test results.
[ERROR] -> [Help 1]
[ERROR] 
[ERROR] To see the full stack trace of the errors, re-run Maven with the -e switch.
[ERROR] Re-run Maven using the -X switch to enable full debug logging.
[ERROR] 
[ERROR] For more information about the errors and possible solutions, please read the following articles:
[ERROR] [Help 1] http://cwiki.apache.org/confluence/display/MAVEN/MojoFailureException
[ERROR] 
[ERROR] After correcting the problems, you can resume the build with the command
[ERROR]   mvn <goals> -rf :brooklyn-core
[Pipeline] }
$ docker stop --time=1 c740fcd17626e2e4813530f7b7157cef51e5da65b67b68c5548e618f05f3f2d3
$ docker rm -f c740fcd17626e2e4813530f7b7157cef51e5da65b67b68c5548e618f05f3f2d3
[Pipeline] // withDockerContainer
[Pipeline] }
[Pipeline] // stage
[Pipeline] }
[Pipeline] // withEnv
[Pipeline] }
ERROR: script returned exit code 1
[Pipeline] // catchError
[Pipeline] stage
[Pipeline] { (Publish test results)
[Pipeline] junit
Recording test results
[Checks API] No suitable checks publisher found.
[Pipeline] step
TestNG Reports Processing: START
Looking for TestNG results report in workspace using pattern: **/testng-results.xml
testng-results.xml was last modified before this build started. Ignoring it.
testng-results.xml was last modified before this build started. Ignoring it.
testng-results.xml was last modified before this build started. Ignoring it.
testng-results.xml was last modified before this build started. Ignoring it.
testng-results.xml was last modified before this build started. Ignoring it.
testng-results.xml was last modified before this build started. Ignoring it.
testng-results.xml was last modified before this build started. Ignoring it.
testng-results.xml was last modified before this build started. Ignoring it.
testng-results.xml was last modified before this build started. Ignoring it.
Saving reports...
Processing '/home/jenkins/jenkins-home/jobs/Brooklyn/jobs/brooklyn-server/branches/master/builds/395/testng/testng-results-1.xml'
Processing '/home/jenkins/jenkins-home/jobs/Brooklyn/jobs/brooklyn-server/branches/master/builds/395/testng/testng-results-2.xml'
Processing '/home/jenkins/jenkins-home/jobs/Brooklyn/jobs/brooklyn-server/branches/master/builds/395/testng/testng-results-3.xml'
Processing '/home/jenkins/jenkins-home/jobs/Brooklyn/jobs/brooklyn-server/branches/master/builds/395/testng/testng-results-4.xml'
Processing '/home/jenkins/jenkins-home/jobs/Brooklyn/jobs/brooklyn-server/branches/master/builds/395/testng/testng-results-5.xml'
Processing '/home/jenkins/jenkins-home/jobs/Brooklyn/jobs/brooklyn-server/branches/master/builds/395/testng/testng-results-6.xml'
Processing '/home/jenkins/jenkins-home/jobs/Brooklyn/jobs/brooklyn-server/branches/master/builds/395/testng/testng-results-7.xml'
Processing '/home/jenkins/jenkins-home/jobs/Brooklyn/jobs/brooklyn-server/branches/master/builds/395/testng/testng-results.xml'
0.030769% of tests failed, which exceeded threshold of 0%. Marking build as UNSTABLE
TestNG Reports Processing: FINISH
[Pipeline] }
[Pipeline] // stage
[Pipeline] stage
[Pipeline] { (Send notifications)
[Pipeline] step