You are viewing a plain text version of this content. The canonical link for it is here.
Posted to builds@solr.apache.org by Policeman Jenkins Server <je...@thetaphi.de> on 2025/08/26 03:34:04 UTC
[JENKINS] Solr-main-Linux (64bit/hotspot/jdk-23.0.2) - Build # 28137 - Still Failing!
Build: https://jenkins.thetaphi.de/job/Solr-main-Linux/28137/
Java: 64bit/hotspot/jdk-23.0.2 -XX:-UseCompressedOops -XX:+UseG1GC
3 tests failed.
FAILED: org.apache.solr.handler.component.DistributedDebugComponentTest.testTolerantSearch
Error Message:
org.apache.solr.client.solrj.SolrClient$RemoteSolrException: Error from server at http://127.0.0.1:32821/solr: org.apache.solr.client.solrj.SolrServerException: Connection refused
Stack Trace:
org.apache.solr.client.solrj.SolrClient$RemoteSolrException: Error from server at http://127.0.0.1:32821/solr: org.apache.solr.client.solrj.SolrServerException: Connection refused
at __randomizedtesting.SeedInfo.seed([203EA072C8F79C96:E6C76BAC0B3541C3]:0)
at app//org.apache.solr.client.solrj.impl.HttpSolrClient.executeMethod(HttpSolrClient.java:708)
at app//org.apache.solr.client.solrj.impl.HttpSolrClient.request(HttpSolrClient.java:250)
at app//org.apache.solr.client.solrj.impl.HttpSolrClient.request(HttpSolrClient.java:229)
at app//org.apache.solr.client.solrj.SolrRequest.process(SolrRequest.java:285)
at app//org.apache.solr.client.solrj.SolrClient.query(SolrClient.java:926)
at app//org.apache.solr.client.solrj.SolrClient.query(SolrClient.java:939)
at app//org.apache.solr.handler.component.DistributedDebugComponentTest.testTolerantSearch(DistributedDebugComponentTest.java:424)
at java.base@23.0.2/jdk.internal.reflect.DirectMethodHandleAccessor.invoke(DirectMethodHandleAccessor.java:103)
at java.base@23.0.2/java.lang.reflect.Method.invoke(Method.java:580)
at app//com.carrotsearch.randomizedtesting.RandomizedRunner.invoke(RandomizedRunner.java:1758)
at app//com.carrotsearch.randomizedtesting.RandomizedRunner$8.evaluate(RandomizedRunner.java:946)
at app//com.carrotsearch.randomizedtesting.RandomizedRunner$9.evaluate(RandomizedRunner.java:982)
at app//com.carrotsearch.randomizedtesting.RandomizedRunner$10.evaluate(RandomizedRunner.java:996)
at app//com.carrotsearch.randomizedtesting.rules.SystemPropertiesRestoreRule$1.evaluate(SystemPropertiesRestoreRule.java:80)
at app//org.junit.rules.RunRules.evaluate(RunRules.java:20)
at app//org.apache.lucene.tests.util.TestRuleSetupTeardownChained$1.evaluate(TestRuleSetupTeardownChained.java:48)
at app//org.apache.lucene.tests.util.AbstractBeforeAfterRule$1.evaluate(AbstractBeforeAfterRule.java:43)
at app//org.apache.lucene.tests.util.TestRuleThreadAndTestName$1.evaluate(TestRuleThreadAndTestName.java:45)
at app//org.apache.lucene.tests.util.TestRuleIgnoreAfterMaxFailures$1.evaluate(TestRuleIgnoreAfterMaxFailures.java:60)
at app//org.apache.lucene.tests.util.TestRuleMarkFailure$1.evaluate(TestRuleMarkFailure.java:44)
at app//org.junit.rules.RunRules.evaluate(RunRules.java:20)
at app//com.carrotsearch.randomizedtesting.rules.StatementAdapter.evaluate(StatementAdapter.java:36)
at app//com.carrotsearch.randomizedtesting.ThreadLeakControl$StatementRunner.run(ThreadLeakControl.java:390)
at app//com.carrotsearch.randomizedtesting.ThreadLeakControl.forkTimeoutingTask(ThreadLeakControl.java:843)
at app//com.carrotsearch.randomizedtesting.ThreadLeakControl$3.evaluate(ThreadLeakControl.java:490)
at app//com.carrotsearch.randomizedtesting.RandomizedRunner.runSingleTest(RandomizedRunner.java:955)
at app//com.carrotsearch.randomizedtesting.RandomizedRunner$5.evaluate(RandomizedRunner.java:840)
at app//com.carrotsearch.randomizedtesting.RandomizedRunner$6.evaluate(RandomizedRunner.java:891)
at app//com.carrotsearch.randomizedtesting.RandomizedRunner$7.evaluate(RandomizedRunner.java:902)
at app//org.junit.rules.ExternalResource$1.evaluate(ExternalResource.java:54)
at app//com.carrotsearch.randomizedtesting.rules.StatementAdapter.evaluate(StatementAdapter.java:36)
at app//com.carrotsearch.randomizedtesting.rules.StatementAdapter.evaluate(StatementAdapter.java:36)
at app//org.apache.lucene.tests.util.AbstractBeforeAfterRule$1.evaluate(AbstractBeforeAfterRule.java:43)
at app//com.carrotsearch.randomizedtesting.rules.SystemPropertiesRestoreRule$1.evaluate(SystemPropertiesRestoreRule.java:80)
at app//org.junit.rules.RunRules.evaluate(RunRules.java:20)
at app//org.apache.lucene.tests.util.AbstractBeforeAfterRule$1.evaluate(AbstractBeforeAfterRule.java:43)
at app//com.carrotsearch.randomizedtesting.rules.StatementAdapter.evaluate(StatementAdapter.java:36)
at app//org.apache.lucene.tests.util.TestRuleStoreClassName$1.evaluate(TestRuleStoreClassName.java:38)
at app//com.carrotsearch.randomizedtesting.rules.NoShadowingOrOverridesOnMethodsRule$1.evaluate(NoShadowingOrOverridesOnMethodsRule.java:40)
at app//com.carrotsearch.randomizedtesting.rules.NoShadowingOrOverridesOnMethodsRule$1.evaluate(NoShadowingOrOverridesOnMethodsRule.java:40)
at app//com.carrotsearch.randomizedtesting.rules.StatementAdapter.evaluate(StatementAdapter.java:36)
at app//com.carrotsearch.randomizedtesting.rules.StatementAdapter.evaluate(StatementAdapter.java:36)
at app//org.apache.lucene.tests.util.TestRuleAssertionsRequired$1.evaluate(TestRuleAssertionsRequired.java:53)
at app//org.apache.lucene.tests.util.AbstractBeforeAfterRule$1.evaluate(AbstractBeforeAfterRule.java:43)
at app//org.apache.lucene.tests.util.TestRuleMarkFailure$1.evaluate(TestRuleMarkFailure.java:44)
at app//org.apache.lucene.tests.util.TestRuleIgnoreAfterMaxFailures$1.evaluate(TestRuleIgnoreAfterMaxFailures.java:60)
at app//org.apache.lucene.tests.util.TestRuleIgnoreTestSuites$1.evaluate(TestRuleIgnoreTestSuites.java:47)
at app//org.junit.rules.RunRules.evaluate(RunRules.java:20)
at app//com.carrotsearch.randomizedtesting.rules.StatementAdapter.evaluate(StatementAdapter.java:36)
at app//com.carrotsearch.randomizedtesting.ThreadLeakControl$StatementRunner.run(ThreadLeakControl.java:390)
at app//com.carrotsearch.randomizedtesting.ThreadLeakControl.lambda$forkTimeoutingTask$0(ThreadLeakControl.java:850)
at java.base@23.0.2/java.lang.Thread.run(Thread.java:1575)
FAILED: org.apache.solr.cloud.TestDistribDocBasedVersion.testPullReplica
Error Message:
com.carrotsearch.randomizedtesting.UncaughtExceptionError: Captured an uncaught exception in thread: Thread[id=5631, name=updateExecutor-2997-thread-1, state=RUNNABLE, group=TGRP-TestDistribDocBasedVersion]
Stack Trace:
com.carrotsearch.randomizedtesting.UncaughtExceptionError: Captured an uncaught exception in thread: Thread[id=5631, name=updateExecutor-2997-thread-1, state=RUNNABLE, group=TGRP-TestDistribDocBasedVersion]
at __randomizedtesting.SeedInfo.seed([203EA072C8F79C96:688237BC6D25B5EF]:0)
Caused by: org.apache.solr.common.SolrException: java.util.concurrent.ExecutionException: org.apache.solr.common.cloud.ZooKeeperException:
at __randomizedtesting.SeedInfo.seed([203EA072C8F79C96]:0)
at app//org.apache.solr.update.DefaultSolrCoreState$2.run(DefaultSolrCoreState.java:356)
at app//com.codahale.metrics.InstrumentedExecutorService$InstrumentedRunnable.run(InstrumentedExecutorService.java:212)
at app//org.apache.solr.common.util.ExecutorUtil$MDCAwareThreadPoolExecutor.lambda$execute$0(ExecutorUtil.java:381)
at java.base@23.0.2/java.util.concurrent.ThreadPoolExecutor.runWorker(ThreadPoolExecutor.java:1144)
at java.base@23.0.2/java.util.concurrent.ThreadPoolExecutor$Worker.run(ThreadPoolExecutor.java:642)
at java.base@23.0.2/java.lang.Thread.run(Thread.java:1575)
Caused by: java.util.concurrent.ExecutionException: org.apache.solr.common.cloud.ZooKeeperException:
at java.base/java.util.concurrent.FutureTask.report(FutureTask.java:122)
at java.base/java.util.concurrent.FutureTask.get(FutureTask.java:191)
at org.apache.solr.update.DefaultSolrCoreState$2.run(DefaultSolrCoreState.java:351)
... 5 more
Caused by: org.apache.solr.common.cloud.ZooKeeperException:
at app//org.apache.solr.cloud.RecoveryStrategy.run(RecoveryStrategy.java:330)
at app//com.codahale.metrics.InstrumentedExecutorService$InstrumentedRunnable.run(InstrumentedExecutorService.java:212)
at java.base@23.0.2/java.util.concurrent.Executors$RunnableAdapter.call(Executors.java:572)
at java.base@23.0.2/java.util.concurrent.FutureTask.run(FutureTask.java:317)
... 4 more
Caused by: org.apache.solr.common.SolrException: SolrCore not found:collection1_shard1_replica_p5 in [control_collection_shard1_replica_n1]
at app//org.apache.solr.cloud.ReplicateFromLeader.startReplication(ReplicateFromLeader.java:75)
at app//org.apache.solr.cloud.ZkController.startReplicationFromLeader(ZkController.java:1538)
at app//org.apache.solr.cloud.RecoveryStrategy.doReplicateOnlyRecovery(RecoveryStrategy.java:431)
at app//org.apache.solr.cloud.RecoveryStrategy.doRecovery(RecoveryStrategy.java:349)
at app//org.apache.solr.cloud.RecoveryStrategy.run(RecoveryStrategy.java:323)
... 7 more
FAILED: org.apache.solr.cloud.TestDistribDocBasedVersion.testPullReplica
Error Message:
com.carrotsearch.randomizedtesting.UncaughtExceptionError: Captured an uncaught exception in thread: Thread[id=226, name=updateExecutor-19-thread-1, state=RUNNABLE, group=TGRP-TestDistribDocBasedVersion]
Stack Trace:
com.carrotsearch.randomizedtesting.UncaughtExceptionError: Captured an uncaught exception in thread: Thread[id=226, name=updateExecutor-19-thread-1, state=RUNNABLE, group=TGRP-TestDistribDocBasedVersion]
at __randomizedtesting.SeedInfo.seed([203EA072C8F79C96:688237BC6D25B5EF]:0)
Caused by: org.apache.solr.common.SolrException: java.util.concurrent.ExecutionException: org.apache.solr.common.cloud.ZooKeeperException:
at __randomizedtesting.SeedInfo.seed([203EA072C8F79C96]:0)
at app//org.apache.solr.update.DefaultSolrCoreState$2.run(DefaultSolrCoreState.java:356)
at app//com.codahale.metrics.InstrumentedExecutorService$InstrumentedRunnable.run(InstrumentedExecutorService.java:212)
at app//org.apache.solr.common.util.ExecutorUtil$MDCAwareThreadPoolExecutor.lambda$execute$0(ExecutorUtil.java:381)
at java.base@23.0.2/java.util.concurrent.ThreadPoolExecutor.runWorker(ThreadPoolExecutor.java:1144)
at java.base@23.0.2/java.util.concurrent.ThreadPoolExecutor$Worker.run(ThreadPoolExecutor.java:642)
at java.base@23.0.2/java.lang.Thread.run(Thread.java:1575)
Caused by: java.util.concurrent.ExecutionException: org.apache.solr.common.cloud.ZooKeeperException:
at java.base/java.util.concurrent.FutureTask.report(FutureTask.java:122)
at java.base/java.util.concurrent.FutureTask.get(FutureTask.java:191)
at org.apache.solr.update.DefaultSolrCoreState$2.run(DefaultSolrCoreState.java:351)
... 5 more
Caused by: org.apache.solr.common.cloud.ZooKeeperException:
at app//org.apache.solr.cloud.RecoveryStrategy.run(RecoveryStrategy.java:330)
at app//com.codahale.metrics.InstrumentedExecutorService$InstrumentedRunnable.run(InstrumentedExecutorService.java:212)
at java.base@23.0.2/java.util.concurrent.Executors$RunnableAdapter.call(Executors.java:572)
at java.base@23.0.2/java.util.concurrent.FutureTask.run(FutureTask.java:317)
... 4 more
Caused by: org.apache.solr.common.SolrException: SolrCore not found:collection1_shard1_replica_p5 in [control_collection_shard1_replica_n1]
at app//org.apache.solr.cloud.ReplicateFromLeader.startReplication(ReplicateFromLeader.java:75)
at app//org.apache.solr.cloud.ZkController.startReplicationFromLeader(ZkController.java:1538)
at app//org.apache.solr.cloud.RecoveryStrategy.doReplicateOnlyRecovery(RecoveryStrategy.java:431)
at app//org.apache.solr.cloud.RecoveryStrategy.doRecovery(RecoveryStrategy.java:349)
at app//org.apache.solr.cloud.RecoveryStrategy.run(RecoveryStrategy.java:323)
... 7 more
[JENKINS] Solr-main-Linux (64bit/hotspot/jdk-21.0.6) - Build # 28152 - Still Unstable!
Posted by Policeman Jenkins Server <je...@thetaphi.de>.
Build: https://jenkins.thetaphi.de/job/Solr-main-Linux/28152/
Java: 64bit/hotspot/jdk-21.0.6 -XX:+UseCompressedOops -XX:+UseG1GC
1 tests failed.
FAILED: org.apache.solr.cloud.BasicDistributedZk2Test.test
Error Message:
org.apache.solr.client.solrj.SolrClient$RemoteSolrException: Error from server at http://127.0.0.1:38287/solr: Cannot talk to ZooKeeper - Updates are disabled.
Stack Trace:
org.apache.solr.client.solrj.SolrClient$RemoteSolrException: Error from server at http://127.0.0.1:38287/solr: Cannot talk to ZooKeeper - Updates are disabled.
at __randomizedtesting.SeedInfo.seed([E4EC8E6FBA5ADB47:6CB8B1B514A6B6BF]:0)
at app//org.apache.solr.client.solrj.impl.HttpSolrClient.executeMethod(HttpSolrClient.java:708)
at app//org.apache.solr.client.solrj.impl.HttpSolrClient.request(HttpSolrClient.java:250)
at app//org.apache.solr.client.solrj.impl.HttpSolrClient.request(HttpSolrClient.java:229)
at app//org.apache.solr.client.solrj.impl.LBSolrClient.doRequest(LBSolrClient.java:515)
at app//org.apache.solr.client.solrj.impl.LBSolrClient.doRequest(LBSolrClient.java:497)
at app//org.apache.solr.client.solrj.impl.LBSolrClient.doRequest(LBSolrClient.java:524)
at app//org.apache.solr.client.solrj.impl.LBSolrClient.request(LBSolrClient.java:466)
at app//org.apache.solr.client.solrj.impl.CloudSolrClient.sendRequest(CloudSolrClient.java:1151)
at app//org.apache.solr.client.solrj.impl.CloudSolrClient.requestWithRetryOnStaleState(CloudSolrClient.java:844)
at app//org.apache.solr.client.solrj.impl.CloudSolrClient.request(CloudSolrClient.java:775)
at app//org.apache.solr.client.solrj.SolrRequest.process(SolrRequest.java:285)
at app//org.apache.solr.client.solrj.SolrRequest.process(SolrRequest.java:305)
at app//org.apache.solr.cloud.AbstractFullDistribZkTestBase.indexDoc(AbstractFullDistribZkTestBase.java:1098)
at app//org.apache.solr.BaseDistributedSearchTestCase.indexr(BaseDistributedSearchTestCase.java:466)
at app//org.apache.solr.cloud.AbstractBasicDistributedZk2TestBase.test(AbstractBasicDistributedZk2TestBase.java:161)
at app//org.apache.solr.cloud.BasicDistributedZk2Test.test(BasicDistributedZk2Test.java:34)
at java.base@21.0.6/jdk.internal.reflect.DirectMethodHandleAccessor.invoke(DirectMethodHandleAccessor.java:103)
at java.base@21.0.6/java.lang.reflect.Method.invoke(Method.java:580)
at app//com.carrotsearch.randomizedtesting.RandomizedRunner.invoke(RandomizedRunner.java:1758)
at app//com.carrotsearch.randomizedtesting.RandomizedRunner$8.evaluate(RandomizedRunner.java:946)
at app//com.carrotsearch.randomizedtesting.RandomizedRunner$9.evaluate(RandomizedRunner.java:982)
at app//com.carrotsearch.randomizedtesting.RandomizedRunner$10.evaluate(RandomizedRunner.java:996)
at app//org.apache.solr.BaseDistributedSearchTestCase$ShardsRepeatRule$ShardsFixedStatement.callStatement(BaseDistributedSearchTestCase.java:1066)
at app//org.apache.solr.BaseDistributedSearchTestCase$ShardsRepeatRule$ShardsStatement.evaluate(BaseDistributedSearchTestCase.java:1037)
at app//com.carrotsearch.randomizedtesting.rules.SystemPropertiesRestoreRule$1.evaluate(SystemPropertiesRestoreRule.java:80)
at app//org.junit.rules.RunRules.evaluate(RunRules.java:20)
at app//org.apache.lucene.tests.util.TestRuleSetupTeardownChained$1.evaluate(TestRuleSetupTeardownChained.java:48)
at app//org.apache.lucene.tests.util.AbstractBeforeAfterRule$1.evaluate(AbstractBeforeAfterRule.java:43)
at app//org.apache.lucene.tests.util.TestRuleThreadAndTestName$1.evaluate(TestRuleThreadAndTestName.java:45)
at app//org.apache.lucene.tests.util.TestRuleIgnoreAfterMaxFailures$1.evaluate(TestRuleIgnoreAfterMaxFailures.java:60)
at app//org.apache.lucene.tests.util.TestRuleMarkFailure$1.evaluate(TestRuleMarkFailure.java:44)
at app//org.junit.rules.RunRules.evaluate(RunRules.java:20)
at app//com.carrotsearch.randomizedtesting.rules.StatementAdapter.evaluate(StatementAdapter.java:36)
at app//com.carrotsearch.randomizedtesting.ThreadLeakControl$StatementRunner.run(ThreadLeakControl.java:390)
at app//com.carrotsearch.randomizedtesting.ThreadLeakControl.forkTimeoutingTask(ThreadLeakControl.java:843)
at app//com.carrotsearch.randomizedtesting.ThreadLeakControl$3.evaluate(ThreadLeakControl.java:490)
at app//com.carrotsearch.randomizedtesting.RandomizedRunner.runSingleTest(RandomizedRunner.java:955)
at app//com.carrotsearch.randomizedtesting.RandomizedRunner$5.evaluate(RandomizedRunner.java:840)
at app//com.carrotsearch.randomizedtesting.RandomizedRunner$6.evaluate(RandomizedRunner.java:891)
at app//com.carrotsearch.randomizedtesting.RandomizedRunner$7.evaluate(RandomizedRunner.java:902)
at app//com.carrotsearch.randomizedtesting.rules.StatementAdapter.evaluate(StatementAdapter.java:36)
at app//com.carrotsearch.randomizedtesting.rules.StatementAdapter.evaluate(StatementAdapter.java:36)
at app//org.apache.lucene.tests.util.AbstractBeforeAfterRule$1.evaluate(AbstractBeforeAfterRule.java:43)
at app//com.carrotsearch.randomizedtesting.rules.SystemPropertiesRestoreRule$1.evaluate(SystemPropertiesRestoreRule.java:80)
at app//org.junit.rules.RunRules.evaluate(RunRules.java:20)
at app//org.apache.lucene.tests.util.AbstractBeforeAfterRule$1.evaluate(AbstractBeforeAfterRule.java:43)
at app//com.carrotsearch.randomizedtesting.rules.StatementAdapter.evaluate(StatementAdapter.java:36)
at app//org.apache.lucene.tests.util.TestRuleStoreClassName$1.evaluate(TestRuleStoreClassName.java:38)
at app//com.carrotsearch.randomizedtesting.rules.NoShadowingOrOverridesOnMethodsRule$1.evaluate(NoShadowingOrOverridesOnMethodsRule.java:40)
at app//com.carrotsearch.randomizedtesting.rules.NoShadowingOrOverridesOnMethodsRule$1.evaluate(NoShadowingOrOverridesOnMethodsRule.java:40)
at app//com.carrotsearch.randomizedtesting.rules.StatementAdapter.evaluate(StatementAdapter.java:36)
at app//com.carrotsearch.randomizedtesting.rules.StatementAdapter.evaluate(StatementAdapter.java:36)
at app//org.apache.lucene.tests.util.TestRuleAssertionsRequired$1.evaluate(TestRuleAssertionsRequired.java:53)
at app//org.apache.lucene.tests.util.AbstractBeforeAfterRule$1.evaluate(AbstractBeforeAfterRule.java:43)
at app//org.apache.lucene.tests.util.TestRuleMarkFailure$1.evaluate(TestRuleMarkFailure.java:44)
at app//org.apache.lucene.tests.util.TestRuleIgnoreAfterMaxFailures$1.evaluate(TestRuleIgnoreAfterMaxFailures.java:60)
at app//org.apache.lucene.tests.util.TestRuleIgnoreTestSuites$1.evaluate(TestRuleIgnoreTestSuites.java:47)
at app//org.junit.rules.RunRules.evaluate(RunRules.java:20)
at app//com.carrotsearch.randomizedtesting.rules.StatementAdapter.evaluate(StatementAdapter.java:36)
at app//com.carrotsearch.randomizedtesting.ThreadLeakControl$StatementRunner.run(ThreadLeakControl.java:390)
at app//com.carrotsearch.randomizedtesting.ThreadLeakControl.lambda$forkTimeoutingTask$0(ThreadLeakControl.java:850)
at java.base@21.0.6/java.lang.Thread.run(Thread.java:1583)
[JENKINS] Solr-main-Linux (64bit/hotspot/jdk-24) - Build # 28151 - Still Unstable!
Posted by Policeman Jenkins Server <je...@thetaphi.de>.
Build: https://jenkins.thetaphi.de/job/Solr-main-Linux/28151/
Java: 64bit/hotspot/jdk-24 -XX:+UseCompressedOops -XX:+UseG1GC
1 tests failed.
FAILED: org.apache.solr.cloud.TestDistribDocBasedVersion.testPullReplica
Error Message:
com.carrotsearch.randomizedtesting.UncaughtExceptionError: Captured an uncaught exception in thread: Thread[id=5578, name=updateExecutor-2962-thread-1, state=RUNNABLE, group=TGRP-TestDistribDocBasedVersion]
Stack Trace:
com.carrotsearch.randomizedtesting.UncaughtExceptionError: Captured an uncaught exception in thread: Thread[id=5578, name=updateExecutor-2962-thread-1, state=RUNNABLE, group=TGRP-TestDistribDocBasedVersion]
at __randomizedtesting.SeedInfo.seed([BD218C0F1BD3BAA9:F59D1BC1BE0193D0]:0)
Caused by: org.apache.solr.common.SolrException: java.util.concurrent.ExecutionException: org.apache.solr.common.cloud.ZooKeeperException:
at __randomizedtesting.SeedInfo.seed([BD218C0F1BD3BAA9]:0)
at app//org.apache.solr.update.DefaultSolrCoreState$2.run(DefaultSolrCoreState.java:356)
at app//com.codahale.metrics.InstrumentedExecutorService$InstrumentedRunnable.run(InstrumentedExecutorService.java:212)
at app//org.apache.solr.common.util.ExecutorUtil$MDCAwareThreadPoolExecutor.lambda$execute$0(ExecutorUtil.java:381)
at java.base@24/java.util.concurrent.ThreadPoolExecutor.runWorker(ThreadPoolExecutor.java:1095)
at java.base@24/java.util.concurrent.ThreadPoolExecutor$Worker.run(ThreadPoolExecutor.java:619)
at java.base@24/java.lang.Thread.run(Thread.java:1447)
Caused by: java.util.concurrent.ExecutionException: org.apache.solr.common.cloud.ZooKeeperException:
at java.base/java.util.concurrent.FutureTask.report(FutureTask.java:124)
at java.base/java.util.concurrent.FutureTask.get(FutureTask.java:193)
at org.apache.solr.update.DefaultSolrCoreState$2.run(DefaultSolrCoreState.java:351)
... 5 more
Caused by: org.apache.solr.common.cloud.ZooKeeperException:
at app//org.apache.solr.cloud.RecoveryStrategy.run(RecoveryStrategy.java:330)
at app//com.codahale.metrics.InstrumentedExecutorService$InstrumentedRunnable.run(InstrumentedExecutorService.java:212)
at java.base@24/java.util.concurrent.Executors$RunnableAdapter.call(Executors.java:545)
at java.base@24/java.util.concurrent.FutureTask.run(FutureTask.java:328)
... 4 more
Caused by: org.apache.solr.common.SolrException: SolrCore not found:collection1_shard1_replica_p5 in [control_collection_shard1_replica_n1]
at app//org.apache.solr.cloud.ReplicateFromLeader.startReplication(ReplicateFromLeader.java:75)
at app//org.apache.solr.cloud.ZkController.startReplicationFromLeader(ZkController.java:1538)
at app//org.apache.solr.cloud.RecoveryStrategy.doReplicateOnlyRecovery(RecoveryStrategy.java:431)
at app//org.apache.solr.cloud.RecoveryStrategy.doRecovery(RecoveryStrategy.java:349)
at app//org.apache.solr.cloud.RecoveryStrategy.run(RecoveryStrategy.java:323)
... 7 more
[JENKINS] Solr-main-Linux (64bit/hotspot/jdk-21.0.6) - Build # 28150 - Still unstable!
Posted by Policeman Jenkins Server <je...@thetaphi.de>.
Build: https://jenkins.thetaphi.de/job/Solr-main-Linux/28150/
Java: 64bit/hotspot/jdk-21.0.6 -XX:+UseCompressedOops -XX:+UseParallelGC
1 tests failed.
FAILED: org.apache.solr.cloud.TestDistribDocBasedVersion.testPullReplica
Error Message:
com.carrotsearch.randomizedtesting.UncaughtExceptionError: Captured an uncaught exception in thread: Thread[id=5602, name=updateExecutor-2974-thread-1, state=RUNNABLE, group=TGRP-TestDistribDocBasedVersion]
Stack Trace:
com.carrotsearch.randomizedtesting.UncaughtExceptionError: Captured an uncaught exception in thread: Thread[id=5602, name=updateExecutor-2974-thread-1, state=RUNNABLE, group=TGRP-TestDistribDocBasedVersion]
at __randomizedtesting.SeedInfo.seed([73D3FAC565765D46:3B6F6D0BC0A4743F]:0)
Caused by: org.apache.solr.common.SolrException: java.util.concurrent.ExecutionException: org.apache.solr.common.cloud.ZooKeeperException:
at __randomizedtesting.SeedInfo.seed([73D3FAC565765D46]:0)
at app//org.apache.solr.update.DefaultSolrCoreState$2.run(DefaultSolrCoreState.java:356)
at app//com.codahale.metrics.InstrumentedExecutorService$InstrumentedRunnable.run(InstrumentedExecutorService.java:212)
at app//org.apache.solr.common.util.ExecutorUtil$MDCAwareThreadPoolExecutor.lambda$execute$0(ExecutorUtil.java:381)
at java.base@21.0.6/java.util.concurrent.ThreadPoolExecutor.runWorker(ThreadPoolExecutor.java:1144)
at java.base@21.0.6/java.util.concurrent.ThreadPoolExecutor$Worker.run(ThreadPoolExecutor.java:642)
at java.base@21.0.6/java.lang.Thread.run(Thread.java:1583)
Caused by: java.util.concurrent.ExecutionException: org.apache.solr.common.cloud.ZooKeeperException:
at java.base/java.util.concurrent.FutureTask.report(FutureTask.java:122)
at java.base/java.util.concurrent.FutureTask.get(FutureTask.java:191)
at org.apache.solr.update.DefaultSolrCoreState$2.run(DefaultSolrCoreState.java:351)
... 5 more
Caused by: org.apache.solr.common.cloud.ZooKeeperException:
at app//org.apache.solr.cloud.RecoveryStrategy.run(RecoveryStrategy.java:330)
at app//com.codahale.metrics.InstrumentedExecutorService$InstrumentedRunnable.run(InstrumentedExecutorService.java:212)
at java.base@21.0.6/java.util.concurrent.Executors$RunnableAdapter.call(Executors.java:572)
at java.base@21.0.6/java.util.concurrent.FutureTask.run(FutureTask.java:317)
... 4 more
Caused by: org.apache.solr.common.SolrException: SolrCore not found:collection1_shard1_replica_p5 in [control_collection_shard1_replica_n1]
at app//org.apache.solr.cloud.ReplicateFromLeader.startReplication(ReplicateFromLeader.java:75)
at app//org.apache.solr.cloud.ZkController.startReplicationFromLeader(ZkController.java:1538)
at app//org.apache.solr.cloud.RecoveryStrategy.doReplicateOnlyRecovery(RecoveryStrategy.java:431)
at app//org.apache.solr.cloud.RecoveryStrategy.doRecovery(RecoveryStrategy.java:349)
at app//org.apache.solr.cloud.RecoveryStrategy.run(RecoveryStrategy.java:323)
... 7 more
[JENKINS] Solr-main-Linux (64bit/hotspot/jdk-24) - Build # 28149 - Still Failing!
Posted by Policeman Jenkins Server <je...@thetaphi.de>.
Build: https://jenkins.thetaphi.de/job/Solr-main-Linux/28149/
Java: 64bit/hotspot/jdk-24 -XX:-UseCompressedOops -XX:+UseG1GC
All tests passed
[JENKINS] Solr-main-Linux (64bit/hotspot/jdk-25-rc+35) - Build # 28148 - Still Failing!
Posted by Policeman Jenkins Server <je...@thetaphi.de>.
Build: https://jenkins.thetaphi.de/job/Solr-main-Linux/28148/
Java: 64bit/hotspot/jdk-25-rc+35 -XX:+UseCompressedOops -XX:+UseParallelGC
All tests passed
[JENKINS-EA] Solr-main-Linux (64bit/hotspot/jdk-26-ea+10) - Build # 28147 - Still Failing!
Posted by Policeman Jenkins Server <je...@thetaphi.de>.
Build: https://jenkins.thetaphi.de/job/Solr-main-Linux/28147/
Java: 64bit/hotspot/jdk-26-ea+10 -XX:+UseCompressedOops -XX:+UseG1GC
1 tests failed.
FAILED: org.apache.solr.cloud.TestDistribDocBasedVersion.testPullReplica
Error Message:
com.carrotsearch.randomizedtesting.UncaughtExceptionError: Captured an uncaught exception in thread: Thread[id=5451, name=updateExecutor-2794-thread-1, state=RUNNABLE, group=TGRP-TestDistribDocBasedVersion]
Stack Trace:
com.carrotsearch.randomizedtesting.UncaughtExceptionError: Captured an uncaught exception in thread: Thread[id=5451, name=updateExecutor-2794-thread-1, state=RUNNABLE, group=TGRP-TestDistribDocBasedVersion]
at __randomizedtesting.SeedInfo.seed([2BF4C0F0DF1EDF0B:6348573E7ACCF672]:0)
Caused by: org.apache.solr.common.SolrException: java.util.concurrent.ExecutionException: org.apache.solr.common.cloud.ZooKeeperException:
at __randomizedtesting.SeedInfo.seed([2BF4C0F0DF1EDF0B]:0)
at app//org.apache.solr.update.DefaultSolrCoreState$2.run(DefaultSolrCoreState.java:356)
at app//com.codahale.metrics.InstrumentedExecutorService$InstrumentedRunnable.run(InstrumentedExecutorService.java:212)
at app//org.apache.solr.common.util.ExecutorUtil$MDCAwareThreadPoolExecutor.lambda$execute$0(ExecutorUtil.java:381)
at java.base@26-ea/java.util.concurrent.ThreadPoolExecutor.runWorker(ThreadPoolExecutor.java:1090)
at java.base@26-ea/java.util.concurrent.ThreadPoolExecutor$Worker.run(ThreadPoolExecutor.java:614)
at java.base@26-ea/java.lang.Thread.run(Thread.java:1474)
Caused by: java.util.concurrent.ExecutionException: org.apache.solr.common.cloud.ZooKeeperException:
at java.base/java.util.concurrent.FutureTask.report(FutureTask.java:124)
at java.base/java.util.concurrent.FutureTask.get(FutureTask.java:193)
at org.apache.solr.update.DefaultSolrCoreState$2.run(DefaultSolrCoreState.java:351)
... 5 more
Caused by: org.apache.solr.common.cloud.ZooKeeperException:
at app//org.apache.solr.cloud.RecoveryStrategy.run(RecoveryStrategy.java:330)
at app//com.codahale.metrics.InstrumentedExecutorService$InstrumentedRunnable.run(InstrumentedExecutorService.java:212)
at java.base@26-ea/java.util.concurrent.Executors$RunnableAdapter.call(Executors.java:545)
at java.base@26-ea/java.util.concurrent.FutureTask.run(FutureTask.java:330)
... 4 more
Caused by: org.apache.solr.common.SolrException: SolrCore not found:collection1_shard1_replica_p5 in [control_collection_shard1_replica_n1]
at app//org.apache.solr.cloud.ReplicateFromLeader.startReplication(ReplicateFromLeader.java:75)
at app//org.apache.solr.cloud.ZkController.startReplicationFromLeader(ZkController.java:1538)
at app//org.apache.solr.cloud.RecoveryStrategy.doReplicateOnlyRecovery(RecoveryStrategy.java:431)
at app//org.apache.solr.cloud.RecoveryStrategy.doRecovery(RecoveryStrategy.java:349)
at app//org.apache.solr.cloud.RecoveryStrategy.run(RecoveryStrategy.java:323)
... 7 more
[JENKINS] Solr-main-Linux (64bit/hotspot/jdk-25-rc+35) - Build # 28146 - Still Failing!
Posted by Policeman Jenkins Server <je...@thetaphi.de>.
Build: https://jenkins.thetaphi.de/job/Solr-main-Linux/28146/
Java: 64bit/hotspot/jdk-25-rc+35 -XX:+UseCompressedOops -XX:+UseSerialGC
All tests passed
[JENKINS-EA] Solr-main-Linux (64bit/hotspot/jdk-26-ea+10) - Build # 28145 - Still Failing!
Posted by Policeman Jenkins Server <je...@thetaphi.de>.
Build: https://jenkins.thetaphi.de/job/Solr-main-Linux/28145/
Java: 64bit/hotspot/jdk-26-ea+10 -XX:+UseCompressedOops -XX:+UseG1GC
2 tests failed.
FAILED: org.apache.solr.handler.component.DistributedDebugComponentTest.testTolerantSearch
Error Message:
org.apache.solr.client.solrj.SolrClient$RemoteSolrException: Error from server at http://127.0.0.1:33175/solr: org.apache.solr.client.solrj.SolrServerException: Connection refused
Stack Trace:
org.apache.solr.client.solrj.SolrClient$RemoteSolrException: Error from server at http://127.0.0.1:33175/solr: org.apache.solr.client.solrj.SolrServerException: Connection refused
at __randomizedtesting.SeedInfo.seed([5E97B5EEE52D3DED:986E7E3026EFE0B8]:0)
at app//org.apache.solr.client.solrj.impl.HttpSolrClient.executeMethod(HttpSolrClient.java:708)
at app//org.apache.solr.client.solrj.impl.HttpSolrClient.request(HttpSolrClient.java:250)
at app//org.apache.solr.client.solrj.impl.HttpSolrClient.request(HttpSolrClient.java:229)
at app//org.apache.solr.client.solrj.SolrRequest.process(SolrRequest.java:285)
at app//org.apache.solr.client.solrj.SolrClient.query(SolrClient.java:926)
at app//org.apache.solr.client.solrj.SolrClient.query(SolrClient.java:939)
at app//org.apache.solr.handler.component.DistributedDebugComponentTest.testTolerantSearch(DistributedDebugComponentTest.java:424)
at java.base@26-ea/jdk.internal.reflect.DirectMethodHandleAccessor.invoke(DirectMethodHandleAccessor.java:104)
at java.base@26-ea/java.lang.reflect.Method.invoke(Method.java:565)
at app//com.carrotsearch.randomizedtesting.RandomizedRunner.invoke(RandomizedRunner.java:1758)
at app//com.carrotsearch.randomizedtesting.RandomizedRunner$8.evaluate(RandomizedRunner.java:946)
at app//com.carrotsearch.randomizedtesting.RandomizedRunner$9.evaluate(RandomizedRunner.java:982)
at app//com.carrotsearch.randomizedtesting.RandomizedRunner$10.evaluate(RandomizedRunner.java:996)
at app//com.carrotsearch.randomizedtesting.rules.SystemPropertiesRestoreRule$1.evaluate(SystemPropertiesRestoreRule.java:80)
at app//org.junit.rules.RunRules.evaluate(RunRules.java:20)
at app//org.apache.lucene.tests.util.TestRuleSetupTeardownChained$1.evaluate(TestRuleSetupTeardownChained.java:48)
at app//org.apache.lucene.tests.util.AbstractBeforeAfterRule$1.evaluate(AbstractBeforeAfterRule.java:43)
at app//org.apache.lucene.tests.util.TestRuleThreadAndTestName$1.evaluate(TestRuleThreadAndTestName.java:45)
at app//org.apache.lucene.tests.util.TestRuleIgnoreAfterMaxFailures$1.evaluate(TestRuleIgnoreAfterMaxFailures.java:60)
at app//org.apache.lucene.tests.util.TestRuleMarkFailure$1.evaluate(TestRuleMarkFailure.java:44)
at app//org.junit.rules.RunRules.evaluate(RunRules.java:20)
at app//com.carrotsearch.randomizedtesting.rules.StatementAdapter.evaluate(StatementAdapter.java:36)
at app//com.carrotsearch.randomizedtesting.ThreadLeakControl$StatementRunner.run(ThreadLeakControl.java:390)
at app//com.carrotsearch.randomizedtesting.ThreadLeakControl.forkTimeoutingTask(ThreadLeakControl.java:843)
at app//com.carrotsearch.randomizedtesting.ThreadLeakControl$3.evaluate(ThreadLeakControl.java:490)
at app//com.carrotsearch.randomizedtesting.RandomizedRunner.runSingleTest(RandomizedRunner.java:955)
at app//com.carrotsearch.randomizedtesting.RandomizedRunner$5.evaluate(RandomizedRunner.java:840)
at app//com.carrotsearch.randomizedtesting.RandomizedRunner$6.evaluate(RandomizedRunner.java:891)
at app//com.carrotsearch.randomizedtesting.RandomizedRunner$7.evaluate(RandomizedRunner.java:902)
at app//org.junit.rules.ExternalResource$1.evaluate(ExternalResource.java:54)
at app//com.carrotsearch.randomizedtesting.rules.StatementAdapter.evaluate(StatementAdapter.java:36)
at app//com.carrotsearch.randomizedtesting.rules.StatementAdapter.evaluate(StatementAdapter.java:36)
at app//org.apache.lucene.tests.util.AbstractBeforeAfterRule$1.evaluate(AbstractBeforeAfterRule.java:43)
at app//com.carrotsearch.randomizedtesting.rules.SystemPropertiesRestoreRule$1.evaluate(SystemPropertiesRestoreRule.java:80)
at app//org.junit.rules.RunRules.evaluate(RunRules.java:20)
at app//org.apache.lucene.tests.util.AbstractBeforeAfterRule$1.evaluate(AbstractBeforeAfterRule.java:43)
at app//com.carrotsearch.randomizedtesting.rules.StatementAdapter.evaluate(StatementAdapter.java:36)
at app//org.apache.lucene.tests.util.TestRuleStoreClassName$1.evaluate(TestRuleStoreClassName.java:38)
at app//com.carrotsearch.randomizedtesting.rules.NoShadowingOrOverridesOnMethodsRule$1.evaluate(NoShadowingOrOverridesOnMethodsRule.java:40)
at app//com.carrotsearch.randomizedtesting.rules.NoShadowingOrOverridesOnMethodsRule$1.evaluate(NoShadowingOrOverridesOnMethodsRule.java:40)
at app//com.carrotsearch.randomizedtesting.rules.StatementAdapter.evaluate(StatementAdapter.java:36)
at app//com.carrotsearch.randomizedtesting.rules.StatementAdapter.evaluate(StatementAdapter.java:36)
at app//org.apache.lucene.tests.util.TestRuleAssertionsRequired$1.evaluate(TestRuleAssertionsRequired.java:53)
at app//org.apache.lucene.tests.util.AbstractBeforeAfterRule$1.evaluate(AbstractBeforeAfterRule.java:43)
at app//org.apache.lucene.tests.util.TestRuleMarkFailure$1.evaluate(TestRuleMarkFailure.java:44)
at app//org.apache.lucene.tests.util.TestRuleIgnoreAfterMaxFailures$1.evaluate(TestRuleIgnoreAfterMaxFailures.java:60)
at app//org.apache.lucene.tests.util.TestRuleIgnoreTestSuites$1.evaluate(TestRuleIgnoreTestSuites.java:47)
at app//org.junit.rules.RunRules.evaluate(RunRules.java:20)
at app//com.carrotsearch.randomizedtesting.rules.StatementAdapter.evaluate(StatementAdapter.java:36)
at app//com.carrotsearch.randomizedtesting.ThreadLeakControl$StatementRunner.run(ThreadLeakControl.java:390)
at app//com.carrotsearch.randomizedtesting.ThreadLeakControl.lambda$forkTimeoutingTask$0(ThreadLeakControl.java:850)
at java.base@26-ea/java.lang.Thread.run(Thread.java:1474)
FAILED: org.apache.solr.search.TestMainQueryCaching.testMatchAllDocsNonScoreSort
Error Message:
java.lang.AssertionError: Bad matchAllDocs insert count expected:<1> but was:<0>
Stack Trace:
java.lang.AssertionError: Bad matchAllDocs insert count expected:<1> but was:<0>
at __randomizedtesting.SeedInfo.seed([5E97B5EEE52D3DED:8970AF48E4A940CD]:0)
at org.junit.Assert.fail(Assert.java:89)
at org.junit.Assert.failNotEquals(Assert.java:835)
at org.junit.Assert.assertEquals(Assert.java:647)
at org.apache.solr.search.TestMainQueryCaching.assertMetricCounts(TestMainQueryCaching.java:411)
at org.apache.solr.search.TestMainQueryCaching.assertMetricCounts(TestMainQueryCaching.java:392)
at org.apache.solr.search.TestMainQueryCaching.testMatchAllDocsNonScoreSort(TestMainQueryCaching.java:315)
at java.base/jdk.internal.reflect.DirectMethodHandleAccessor.invoke(DirectMethodHandleAccessor.java:104)
at java.base/java.lang.reflect.Method.invoke(Method.java:565)
at com.carrotsearch.randomizedtesting.RandomizedRunner.invoke(RandomizedRunner.java:1758)
at com.carrotsearch.randomizedtesting.RandomizedRunner$8.evaluate(RandomizedRunner.java:946)
at com.carrotsearch.randomizedtesting.RandomizedRunner$9.evaluate(RandomizedRunner.java:982)
at com.carrotsearch.randomizedtesting.RandomizedRunner$10.evaluate(RandomizedRunner.java:996)
at com.carrotsearch.randomizedtesting.rules.SystemPropertiesRestoreRule$1.evaluate(SystemPropertiesRestoreRule.java:80)
at org.junit.rules.RunRules.evaluate(RunRules.java:20)
at org.apache.lucene.tests.util.TestRuleSetupTeardownChained$1.evaluate(TestRuleSetupTeardownChained.java:48)
at org.apache.lucene.tests.util.AbstractBeforeAfterRule$1.evaluate(AbstractBeforeAfterRule.java:43)
at org.apache.lucene.tests.util.TestRuleThreadAndTestName$1.evaluate(TestRuleThreadAndTestName.java:45)
at org.apache.lucene.tests.util.TestRuleIgnoreAfterMaxFailures$1.evaluate(TestRuleIgnoreAfterMaxFailures.java:60)
at org.apache.lucene.tests.util.TestRuleMarkFailure$1.evaluate(TestRuleMarkFailure.java:44)
at org.junit.rules.RunRules.evaluate(RunRules.java:20)
at com.carrotsearch.randomizedtesting.rules.StatementAdapter.evaluate(StatementAdapter.java:36)
at com.carrotsearch.randomizedtesting.ThreadLeakControl$StatementRunner.run(ThreadLeakControl.java:390)
at com.carrotsearch.randomizedtesting.ThreadLeakControl.forkTimeoutingTask(ThreadLeakControl.java:843)
at com.carrotsearch.randomizedtesting.ThreadLeakControl$3.evaluate(ThreadLeakControl.java:490)
at com.carrotsearch.randomizedtesting.RandomizedRunner.runSingleTest(RandomizedRunner.java:955)
at com.carrotsearch.randomizedtesting.RandomizedRunner$5.evaluate(RandomizedRunner.java:840)
at com.carrotsearch.randomizedtesting.RandomizedRunner$6.evaluate(RandomizedRunner.java:891)
at com.carrotsearch.randomizedtesting.RandomizedRunner$7.evaluate(RandomizedRunner.java:902)
at com.carrotsearch.randomizedtesting.rules.StatementAdapter.evaluate(StatementAdapter.java:36)
at com.carrotsearch.randomizedtesting.rules.StatementAdapter.evaluate(StatementAdapter.java:36)
at org.apache.lucene.tests.util.AbstractBeforeAfterRule$1.evaluate(AbstractBeforeAfterRule.java:43)
at com.carrotsearch.randomizedtesting.rules.SystemPropertiesRestoreRule$1.evaluate(SystemPropertiesRestoreRule.java:80)
at org.junit.rules.RunRules.evaluate(RunRules.java:20)
at org.apache.lucene.tests.util.AbstractBeforeAfterRule$1.evaluate(AbstractBeforeAfterRule.java:43)
at com.carrotsearch.randomizedtesting.rules.StatementAdapter.evaluate(StatementAdapter.java:36)
at org.apache.lucene.tests.util.TestRuleStoreClassName$1.evaluate(TestRuleStoreClassName.java:38)
at com.carrotsearch.randomizedtesting.rules.NoShadowingOrOverridesOnMethodsRule$1.evaluate(NoShadowingOrOverridesOnMethodsRule.java:40)
at com.carrotsearch.randomizedtesting.rules.NoShadowingOrOverridesOnMethodsRule$1.evaluate(NoShadowingOrOverridesOnMethodsRule.java:40)
at com.carrotsearch.randomizedtesting.rules.StatementAdapter.evaluate(StatementAdapter.java:36)
at com.carrotsearch.randomizedtesting.rules.StatementAdapter.evaluate(StatementAdapter.java:36)
at org.apache.lucene.tests.util.TestRuleAssertionsRequired$1.evaluate(TestRuleAssertionsRequired.java:53)
at org.apache.lucene.tests.util.AbstractBeforeAfterRule$1.evaluate(AbstractBeforeAfterRule.java:43)
at org.apache.lucene.tests.util.TestRuleMarkFailure$1.evaluate(TestRuleMarkFailure.java:44)
at org.apache.lucene.tests.util.TestRuleIgnoreAfterMaxFailures$1.evaluate(TestRuleIgnoreAfterMaxFailures.java:60)
at org.apache.lucene.tests.util.TestRuleIgnoreTestSuites$1.evaluate(TestRuleIgnoreTestSuites.java:47)
at org.junit.rules.RunRules.evaluate(RunRules.java:20)
at com.carrotsearch.randomizedtesting.rules.StatementAdapter.evaluate(StatementAdapter.java:36)
at com.carrotsearch.randomizedtesting.ThreadLeakControl$StatementRunner.run(ThreadLeakControl.java:390)
at com.carrotsearch.randomizedtesting.ThreadLeakControl.lambda$forkTimeoutingTask$0(ThreadLeakControl.java:850)
at java.base/java.lang.Thread.run(Thread.java:1474)
[JENKINS] Solr-main-Linux (64bit/hotspot/jdk-22.0.2) - Build # 28144 - Still Failing!
Posted by Policeman Jenkins Server <je...@thetaphi.de>.
Build: https://jenkins.thetaphi.de/job/Solr-main-Linux/28144/
Java: 64bit/hotspot/jdk-22.0.2 -XX:-UseCompressedOops -XX:+UseSerialGC
1 tests failed.
FAILED: org.apache.solr.cloud.TestDistribDocBasedVersion.testPullReplica
Error Message:
com.carrotsearch.randomizedtesting.UncaughtExceptionError: Captured an uncaught exception in thread: Thread[id=5540, name=updateExecutor-2966-thread-1, state=RUNNABLE, group=TGRP-TestDistribDocBasedVersion]
Stack Trace:
com.carrotsearch.randomizedtesting.UncaughtExceptionError: Captured an uncaught exception in thread: Thread[id=5540, name=updateExecutor-2966-thread-1, state=RUNNABLE, group=TGRP-TestDistribDocBasedVersion]
at __randomizedtesting.SeedInfo.seed([2A1BE20D9D533FD8:62A775C3388116A1]:0)
Caused by: org.apache.solr.common.SolrException: java.util.concurrent.ExecutionException: org.apache.solr.common.cloud.ZooKeeperException:
at __randomizedtesting.SeedInfo.seed([2A1BE20D9D533FD8]:0)
at app//org.apache.solr.update.DefaultSolrCoreState$2.run(DefaultSolrCoreState.java:356)
at app//com.codahale.metrics.InstrumentedExecutorService$InstrumentedRunnable.run(InstrumentedExecutorService.java:212)
at app//org.apache.solr.common.util.ExecutorUtil$MDCAwareThreadPoolExecutor.lambda$execute$0(ExecutorUtil.java:381)
at java.base@22.0.2/java.util.concurrent.ThreadPoolExecutor.runWorker(ThreadPoolExecutor.java:1144)
at java.base@22.0.2/java.util.concurrent.ThreadPoolExecutor$Worker.run(ThreadPoolExecutor.java:642)
at java.base@22.0.2/java.lang.Thread.run(Thread.java:1570)
Caused by: java.util.concurrent.ExecutionException: org.apache.solr.common.cloud.ZooKeeperException:
at java.base/java.util.concurrent.FutureTask.report(FutureTask.java:122)
at java.base/java.util.concurrent.FutureTask.get(FutureTask.java:191)
at org.apache.solr.update.DefaultSolrCoreState$2.run(DefaultSolrCoreState.java:351)
... 5 more
Caused by: org.apache.solr.common.cloud.ZooKeeperException:
at app//org.apache.solr.cloud.RecoveryStrategy.run(RecoveryStrategy.java:330)
at app//com.codahale.metrics.InstrumentedExecutorService$InstrumentedRunnable.run(InstrumentedExecutorService.java:212)
at java.base@22.0.2/java.util.concurrent.Executors$RunnableAdapter.call(Executors.java:572)
at java.base@22.0.2/java.util.concurrent.FutureTask.run(FutureTask.java:317)
... 4 more
Caused by: org.apache.solr.common.SolrException: SolrCore not found:collection1_shard1_replica_p5 in [control_collection_shard1_replica_n1]
at app//org.apache.solr.cloud.ReplicateFromLeader.startReplication(ReplicateFromLeader.java:75)
at app//org.apache.solr.cloud.ZkController.startReplicationFromLeader(ZkController.java:1538)
at app//org.apache.solr.cloud.RecoveryStrategy.doReplicateOnlyRecovery(RecoveryStrategy.java:431)
at app//org.apache.solr.cloud.RecoveryStrategy.doRecovery(RecoveryStrategy.java:349)
at app//org.apache.solr.cloud.RecoveryStrategy.run(RecoveryStrategy.java:323)
... 7 more
[JENKINS] Solr-main-Linux (64bit/hotspot/jdk-21.0.6) - Build # 28143 - Still Failing!
Posted by Policeman Jenkins Server <je...@thetaphi.de>.
Build: https://jenkins.thetaphi.de/job/Solr-main-Linux/28143/
Java: 64bit/hotspot/jdk-21.0.6 -XX:+UseCompressedOops -XX:+UseG1GC
All tests passed
[JENKINS] Solr-main-Linux (64bit/hotspot/jdk-25-rc+35) - Build # 28142 - Still Failing!
Posted by Policeman Jenkins Server <je...@thetaphi.de>.
Build: https://jenkins.thetaphi.de/job/Solr-main-Linux/28142/
Java: 64bit/hotspot/jdk-25-rc+35 -XX:-UseCompressedOops -XX:+UseG1GC
All tests passed
[JENKINS-EA] Solr-main-Linux (64bit/hotspot/jdk-26-ea+10) - Build # 28141 - Still Failing!
Posted by Policeman Jenkins Server <je...@thetaphi.de>.
Build: https://jenkins.thetaphi.de/job/Solr-main-Linux/28141/
Java: 64bit/hotspot/jdk-26-ea+10 -XX:-UseCompressedOops -XX:+UseG1GC
1 tests failed.
FAILED: org.apache.solr.cloud.TestDistribDocBasedVersion.testPullReplica
Error Message:
com.carrotsearch.randomizedtesting.UncaughtExceptionError: Captured an uncaught exception in thread: Thread[id=5137, name=updateExecutor-2767-thread-1, state=RUNNABLE, group=TGRP-TestDistribDocBasedVersion]
Stack Trace:
com.carrotsearch.randomizedtesting.UncaughtExceptionError: Captured an uncaught exception in thread: Thread[id=5137, name=updateExecutor-2767-thread-1, state=RUNNABLE, group=TGRP-TestDistribDocBasedVersion]
at __randomizedtesting.SeedInfo.seed([D0505DAEDB0EB8B4:98ECCA607EDC91CD]:0)
Caused by: org.apache.solr.common.SolrException: java.util.concurrent.ExecutionException: org.apache.solr.common.cloud.ZooKeeperException:
at __randomizedtesting.SeedInfo.seed([D0505DAEDB0EB8B4]:0)
at app//org.apache.solr.update.DefaultSolrCoreState$2.run(DefaultSolrCoreState.java:356)
at app//com.codahale.metrics.InstrumentedExecutorService$InstrumentedRunnable.run(InstrumentedExecutorService.java:212)
at app//org.apache.solr.common.util.ExecutorUtil$MDCAwareThreadPoolExecutor.lambda$execute$0(ExecutorUtil.java:381)
at java.base@26-ea/java.util.concurrent.ThreadPoolExecutor.runWorker(ThreadPoolExecutor.java:1090)
at java.base@26-ea/java.util.concurrent.ThreadPoolExecutor$Worker.run(ThreadPoolExecutor.java:614)
at java.base@26-ea/java.lang.Thread.run(Thread.java:1474)
Caused by: java.util.concurrent.ExecutionException: org.apache.solr.common.cloud.ZooKeeperException:
at java.base/java.util.concurrent.FutureTask.report(FutureTask.java:124)
at java.base/java.util.concurrent.FutureTask.get(FutureTask.java:193)
at org.apache.solr.update.DefaultSolrCoreState$2.run(DefaultSolrCoreState.java:351)
... 5 more
Caused by: org.apache.solr.common.cloud.ZooKeeperException:
at app//org.apache.solr.cloud.RecoveryStrategy.run(RecoveryStrategy.java:330)
at app//com.codahale.metrics.InstrumentedExecutorService$InstrumentedRunnable.run(InstrumentedExecutorService.java:212)
at java.base@26-ea/java.util.concurrent.Executors$RunnableAdapter.call(Executors.java:545)
at java.base@26-ea/java.util.concurrent.FutureTask.run(FutureTask.java:330)
... 4 more
Caused by: org.apache.solr.common.SolrException: SolrCore not found:collection1_shard1_replica_p5 in [control_collection_shard1_replica_n1]
at app//org.apache.solr.cloud.ReplicateFromLeader.startReplication(ReplicateFromLeader.java:75)
at app//org.apache.solr.cloud.ZkController.startReplicationFromLeader(ZkController.java:1538)
at app//org.apache.solr.cloud.RecoveryStrategy.doReplicateOnlyRecovery(RecoveryStrategy.java:431)
at app//org.apache.solr.cloud.RecoveryStrategy.doRecovery(RecoveryStrategy.java:349)
at app//org.apache.solr.cloud.RecoveryStrategy.run(RecoveryStrategy.java:323)
... 7 more
[JENKINS] Solr-main-Linux (64bit/hotspot/jdk-25-rc+35) - Build # 28140 - Still Failing!
Posted by Policeman Jenkins Server <je...@thetaphi.de>.
Build: https://jenkins.thetaphi.de/job/Solr-main-Linux/28140/
Java: 64bit/hotspot/jdk-25-rc+35 -XX:-UseCompressedOops -XX:+UseParallelGC
2 tests failed.
FAILED: org.apache.solr.cloud.TestDistribDocBasedVersion.testPullReplica
Error Message:
com.carrotsearch.randomizedtesting.UncaughtExceptionError: Captured an uncaught exception in thread: Thread[id=5666, name=updateExecutor-2981-thread-1, state=RUNNABLE, group=TGRP-TestDistribDocBasedVersion]
Stack Trace:
com.carrotsearch.randomizedtesting.UncaughtExceptionError: Captured an uncaught exception in thread: Thread[id=5666, name=updateExecutor-2981-thread-1, state=RUNNABLE, group=TGRP-TestDistribDocBasedVersion]
at __randomizedtesting.SeedInfo.seed([4F6C3DB91A4D1A7D:7D0AA77BF9F3304]:0)
Caused by: org.apache.solr.common.SolrException: java.util.concurrent.ExecutionException: org.apache.solr.common.cloud.ZooKeeperException:
at __randomizedtesting.SeedInfo.seed([4F6C3DB91A4D1A7D]:0)
at app//org.apache.solr.update.DefaultSolrCoreState$2.run(DefaultSolrCoreState.java:356)
at app//com.codahale.metrics.InstrumentedExecutorService$InstrumentedRunnable.run(InstrumentedExecutorService.java:212)
at app//org.apache.solr.common.util.ExecutorUtil$MDCAwareThreadPoolExecutor.lambda$execute$0(ExecutorUtil.java:381)
at java.base@25/java.util.concurrent.ThreadPoolExecutor.runWorker(ThreadPoolExecutor.java:1090)
at java.base@25/java.util.concurrent.ThreadPoolExecutor$Worker.run(ThreadPoolExecutor.java:614)
at java.base@25/java.lang.Thread.run(Thread.java:1474)
Caused by: java.util.concurrent.ExecutionException: org.apache.solr.common.cloud.ZooKeeperException:
at java.base/java.util.concurrent.FutureTask.report(FutureTask.java:124)
at java.base/java.util.concurrent.FutureTask.get(FutureTask.java:193)
at org.apache.solr.update.DefaultSolrCoreState$2.run(DefaultSolrCoreState.java:351)
... 5 more
Caused by: org.apache.solr.common.cloud.ZooKeeperException:
at app//org.apache.solr.cloud.RecoveryStrategy.run(RecoveryStrategy.java:330)
at app//com.codahale.metrics.InstrumentedExecutorService$InstrumentedRunnable.run(InstrumentedExecutorService.java:212)
at java.base@25/java.util.concurrent.Executors$RunnableAdapter.call(Executors.java:545)
at java.base@25/java.util.concurrent.FutureTask.run(FutureTask.java:328)
... 4 more
Caused by: org.apache.solr.common.SolrException: SolrCore not found:collection1_shard1_replica_p5 in [control_collection_shard1_replica_n1]
at app//org.apache.solr.cloud.ReplicateFromLeader.startReplication(ReplicateFromLeader.java:75)
at app//org.apache.solr.cloud.ZkController.startReplicationFromLeader(ZkController.java:1538)
at app//org.apache.solr.cloud.RecoveryStrategy.doReplicateOnlyRecovery(RecoveryStrategy.java:431)
at app//org.apache.solr.cloud.RecoveryStrategy.doRecovery(RecoveryStrategy.java:349)
at app//org.apache.solr.cloud.RecoveryStrategy.run(RecoveryStrategy.java:323)
... 7 more
FAILED: org.apache.solr.handler.component.DistributedDebugComponentTest.testTolerantSearch
Error Message:
org.apache.solr.client.solrj.SolrClient$RemoteSolrException: Error from server at http://127.0.0.1:35267/solr: org.apache.solr.client.solrj.SolrServerException: Connection refused
Stack Trace:
org.apache.solr.client.solrj.SolrClient$RemoteSolrException: Error from server at http://127.0.0.1:35267/solr: org.apache.solr.client.solrj.SolrServerException: Connection refused
at __randomizedtesting.SeedInfo.seed([4F6C3DB91A4D1A7D:8995F667D98FC728]:0)
at app//org.apache.solr.client.solrj.impl.HttpSolrClient.executeMethod(HttpSolrClient.java:708)
at app//org.apache.solr.client.solrj.impl.HttpSolrClient.request(HttpSolrClient.java:250)
at app//org.apache.solr.client.solrj.impl.HttpSolrClient.request(HttpSolrClient.java:229)
at app//org.apache.solr.client.solrj.SolrRequest.process(SolrRequest.java:285)
at app//org.apache.solr.client.solrj.SolrClient.query(SolrClient.java:926)
at app//org.apache.solr.client.solrj.SolrClient.query(SolrClient.java:939)
at app//org.apache.solr.handler.component.DistributedDebugComponentTest.testTolerantSearch(DistributedDebugComponentTest.java:424)
at java.base@25/jdk.internal.reflect.DirectMethodHandleAccessor.invoke(DirectMethodHandleAccessor.java:104)
at java.base@25/java.lang.reflect.Method.invoke(Method.java:565)
at app//com.carrotsearch.randomizedtesting.RandomizedRunner.invoke(RandomizedRunner.java:1758)
at app//com.carrotsearch.randomizedtesting.RandomizedRunner$8.evaluate(RandomizedRunner.java:946)
at app//com.carrotsearch.randomizedtesting.RandomizedRunner$9.evaluate(RandomizedRunner.java:982)
at app//com.carrotsearch.randomizedtesting.RandomizedRunner$10.evaluate(RandomizedRunner.java:996)
at app//com.carrotsearch.randomizedtesting.rules.SystemPropertiesRestoreRule$1.evaluate(SystemPropertiesRestoreRule.java:80)
at app//org.junit.rules.RunRules.evaluate(RunRules.java:20)
at app//org.apache.lucene.tests.util.TestRuleSetupTeardownChained$1.evaluate(TestRuleSetupTeardownChained.java:48)
at app//org.apache.lucene.tests.util.AbstractBeforeAfterRule$1.evaluate(AbstractBeforeAfterRule.java:43)
at app//org.apache.lucene.tests.util.TestRuleThreadAndTestName$1.evaluate(TestRuleThreadAndTestName.java:45)
at app//org.apache.lucene.tests.util.TestRuleIgnoreAfterMaxFailures$1.evaluate(TestRuleIgnoreAfterMaxFailures.java:60)
at app//org.apache.lucene.tests.util.TestRuleMarkFailure$1.evaluate(TestRuleMarkFailure.java:44)
at app//org.junit.rules.RunRules.evaluate(RunRules.java:20)
at app//com.carrotsearch.randomizedtesting.rules.StatementAdapter.evaluate(StatementAdapter.java:36)
at app//com.carrotsearch.randomizedtesting.ThreadLeakControl$StatementRunner.run(ThreadLeakControl.java:390)
at app//com.carrotsearch.randomizedtesting.ThreadLeakControl.forkTimeoutingTask(ThreadLeakControl.java:843)
at app//com.carrotsearch.randomizedtesting.ThreadLeakControl$3.evaluate(ThreadLeakControl.java:490)
at app//com.carrotsearch.randomizedtesting.RandomizedRunner.runSingleTest(RandomizedRunner.java:955)
at app//com.carrotsearch.randomizedtesting.RandomizedRunner$5.evaluate(RandomizedRunner.java:840)
at app//com.carrotsearch.randomizedtesting.RandomizedRunner$6.evaluate(RandomizedRunner.java:891)
at app//com.carrotsearch.randomizedtesting.RandomizedRunner$7.evaluate(RandomizedRunner.java:902)
at app//org.junit.rules.ExternalResource$1.evaluate(ExternalResource.java:54)
at app//com.carrotsearch.randomizedtesting.rules.StatementAdapter.evaluate(StatementAdapter.java:36)
at app//com.carrotsearch.randomizedtesting.rules.StatementAdapter.evaluate(StatementAdapter.java:36)
at app//org.apache.lucene.tests.util.AbstractBeforeAfterRule$1.evaluate(AbstractBeforeAfterRule.java:43)
at app//com.carrotsearch.randomizedtesting.rules.SystemPropertiesRestoreRule$1.evaluate(SystemPropertiesRestoreRule.java:80)
at app//org.junit.rules.RunRules.evaluate(RunRules.java:20)
at app//org.apache.lucene.tests.util.AbstractBeforeAfterRule$1.evaluate(AbstractBeforeAfterRule.java:43)
at app//com.carrotsearch.randomizedtesting.rules.StatementAdapter.evaluate(StatementAdapter.java:36)
at app//org.apache.lucene.tests.util.TestRuleStoreClassName$1.evaluate(TestRuleStoreClassName.java:38)
at app//com.carrotsearch.randomizedtesting.rules.NoShadowingOrOverridesOnMethodsRule$1.evaluate(NoShadowingOrOverridesOnMethodsRule.java:40)
at app//com.carrotsearch.randomizedtesting.rules.NoShadowingOrOverridesOnMethodsRule$1.evaluate(NoShadowingOrOverridesOnMethodsRule.java:40)
at app//com.carrotsearch.randomizedtesting.rules.StatementAdapter.evaluate(StatementAdapter.java:36)
at app//com.carrotsearch.randomizedtesting.rules.StatementAdapter.evaluate(StatementAdapter.java:36)
at app//org.apache.lucene.tests.util.TestRuleAssertionsRequired$1.evaluate(TestRuleAssertionsRequired.java:53)
at app//org.apache.lucene.tests.util.AbstractBeforeAfterRule$1.evaluate(AbstractBeforeAfterRule.java:43)
at app//org.apache.lucene.tests.util.TestRuleMarkFailure$1.evaluate(TestRuleMarkFailure.java:44)
at app//org.apache.lucene.tests.util.TestRuleIgnoreAfterMaxFailures$1.evaluate(TestRuleIgnoreAfterMaxFailures.java:60)
at app//org.apache.lucene.tests.util.TestRuleIgnoreTestSuites$1.evaluate(TestRuleIgnoreTestSuites.java:47)
at app//org.junit.rules.RunRules.evaluate(RunRules.java:20)
at app//com.carrotsearch.randomizedtesting.rules.StatementAdapter.evaluate(StatementAdapter.java:36)
at app//com.carrotsearch.randomizedtesting.ThreadLeakControl$StatementRunner.run(ThreadLeakControl.java:390)
at app//com.carrotsearch.randomizedtesting.ThreadLeakControl.lambda$forkTimeoutingTask$0(ThreadLeakControl.java:850)
at java.base@25/java.lang.Thread.run(Thread.java:1474)
[JENKINS] Solr-main-Linux (64bit/hotspot/jdk-22.0.2) - Build # 28139 - Still Failing!
Posted by Policeman Jenkins Server <je...@thetaphi.de>.
Build: https://jenkins.thetaphi.de/job/Solr-main-Linux/28139/
Java: 64bit/hotspot/jdk-22.0.2 -XX:-UseCompressedOops -XX:+UseSerialGC
2 tests failed.
FAILED: org.apache.solr.cloud.TestDistribDocBasedVersion.testPullReplica
Error Message:
com.carrotsearch.randomizedtesting.UncaughtExceptionError: Captured an uncaught exception in thread: Thread[id=207, name=updateExecutor-19-thread-1, state=RUNNABLE, group=TGRP-TestDistribDocBasedVersion]
Stack Trace:
com.carrotsearch.randomizedtesting.UncaughtExceptionError: Captured an uncaught exception in thread: Thread[id=207, name=updateExecutor-19-thread-1, state=RUNNABLE, group=TGRP-TestDistribDocBasedVersion]
at __randomizedtesting.SeedInfo.seed([58A7C88C77FF36BB:101B5F42D22D1FC2]:0)
Caused by: org.apache.solr.common.SolrException: java.util.concurrent.ExecutionException: org.apache.solr.common.cloud.ZooKeeperException:
at __randomizedtesting.SeedInfo.seed([58A7C88C77FF36BB]:0)
at app//org.apache.solr.update.DefaultSolrCoreState$2.run(DefaultSolrCoreState.java:356)
at app//com.codahale.metrics.InstrumentedExecutorService$InstrumentedRunnable.run(InstrumentedExecutorService.java:212)
at app//org.apache.solr.common.util.ExecutorUtil$MDCAwareThreadPoolExecutor.lambda$execute$0(ExecutorUtil.java:381)
at java.base@22.0.2/java.util.concurrent.ThreadPoolExecutor.runWorker(ThreadPoolExecutor.java:1144)
at java.base@22.0.2/java.util.concurrent.ThreadPoolExecutor$Worker.run(ThreadPoolExecutor.java:642)
at java.base@22.0.2/java.lang.Thread.run(Thread.java:1570)
Caused by: java.util.concurrent.ExecutionException: org.apache.solr.common.cloud.ZooKeeperException:
at java.base/java.util.concurrent.FutureTask.report(FutureTask.java:122)
at java.base/java.util.concurrent.FutureTask.get(FutureTask.java:191)
at org.apache.solr.update.DefaultSolrCoreState$2.run(DefaultSolrCoreState.java:351)
... 5 more
Caused by: org.apache.solr.common.cloud.ZooKeeperException:
at app//org.apache.solr.cloud.RecoveryStrategy.run(RecoveryStrategy.java:330)
at app//com.codahale.metrics.InstrumentedExecutorService$InstrumentedRunnable.run(InstrumentedExecutorService.java:212)
at java.base@22.0.2/java.util.concurrent.Executors$RunnableAdapter.call(Executors.java:572)
at java.base@22.0.2/java.util.concurrent.FutureTask.run(FutureTask.java:317)
... 4 more
Caused by: org.apache.solr.common.SolrException: SolrCore not found:collection1_shard1_replica_p5 in [control_collection_shard1_replica_n1]
at app//org.apache.solr.cloud.ReplicateFromLeader.startReplication(ReplicateFromLeader.java:75)
at app//org.apache.solr.cloud.ZkController.startReplicationFromLeader(ZkController.java:1538)
at app//org.apache.solr.cloud.RecoveryStrategy.doReplicateOnlyRecovery(RecoveryStrategy.java:431)
at app//org.apache.solr.cloud.RecoveryStrategy.doRecovery(RecoveryStrategy.java:349)
at app//org.apache.solr.cloud.RecoveryStrategy.run(RecoveryStrategy.java:323)
... 7 more
FAILED: org.apache.solr.cloud.TestDistribDocBasedVersion.testPullReplica
Error Message:
com.carrotsearch.randomizedtesting.UncaughtExceptionError: Captured an uncaught exception in thread: Thread[id=5224, name=updateExecutor-2811-thread-1, state=RUNNABLE, group=TGRP-TestDistribDocBasedVersion]
Stack Trace:
com.carrotsearch.randomizedtesting.UncaughtExceptionError: Captured an uncaught exception in thread: Thread[id=5224, name=updateExecutor-2811-thread-1, state=RUNNABLE, group=TGRP-TestDistribDocBasedVersion]
at __randomizedtesting.SeedInfo.seed([58A7C88C77FF36BB:101B5F42D22D1FC2]:0)
Caused by: org.apache.solr.common.SolrException: java.util.concurrent.ExecutionException: org.apache.solr.common.cloud.ZooKeeperException:
at __randomizedtesting.SeedInfo.seed([58A7C88C77FF36BB]:0)
at app//org.apache.solr.update.DefaultSolrCoreState$2.run(DefaultSolrCoreState.java:356)
at app//com.codahale.metrics.InstrumentedExecutorService$InstrumentedRunnable.run(InstrumentedExecutorService.java:212)
at app//org.apache.solr.common.util.ExecutorUtil$MDCAwareThreadPoolExecutor.lambda$execute$0(ExecutorUtil.java:381)
at java.base@22.0.2/java.util.concurrent.ThreadPoolExecutor.runWorker(ThreadPoolExecutor.java:1144)
at java.base@22.0.2/java.util.concurrent.ThreadPoolExecutor$Worker.run(ThreadPoolExecutor.java:642)
at java.base@22.0.2/java.lang.Thread.run(Thread.java:1570)
Caused by: java.util.concurrent.ExecutionException: org.apache.solr.common.cloud.ZooKeeperException:
at java.base/java.util.concurrent.FutureTask.report(FutureTask.java:122)
at java.base/java.util.concurrent.FutureTask.get(FutureTask.java:191)
at org.apache.solr.update.DefaultSolrCoreState$2.run(DefaultSolrCoreState.java:351)
... 5 more
Caused by: org.apache.solr.common.cloud.ZooKeeperException:
at app//org.apache.solr.cloud.RecoveryStrategy.run(RecoveryStrategy.java:330)
at app//com.codahale.metrics.InstrumentedExecutorService$InstrumentedRunnable.run(InstrumentedExecutorService.java:212)
at java.base@22.0.2/java.util.concurrent.Executors$RunnableAdapter.call(Executors.java:572)
at java.base@22.0.2/java.util.concurrent.FutureTask.run(FutureTask.java:317)
... 4 more
Caused by: org.apache.solr.common.SolrException: SolrCore not found:collection1_shard1_replica_p5 in [control_collection_shard1_replica_n1]
at app//org.apache.solr.cloud.ReplicateFromLeader.startReplication(ReplicateFromLeader.java:75)
at app//org.apache.solr.cloud.ZkController.startReplicationFromLeader(ZkController.java:1538)
at app//org.apache.solr.cloud.RecoveryStrategy.doReplicateOnlyRecovery(RecoveryStrategy.java:431)
at app//org.apache.solr.cloud.RecoveryStrategy.doRecovery(RecoveryStrategy.java:349)
at app//org.apache.solr.cloud.RecoveryStrategy.run(RecoveryStrategy.java:323)
... 7 more
[JENKINS-EA] Solr-main-Linux (64bit/hotspot/jdk-26-ea+10) - Build # 28138 - Still Failing!
Posted by Policeman Jenkins Server <je...@thetaphi.de>.
Build: https://jenkins.thetaphi.de/job/Solr-main-Linux/28138/
Java: 64bit/hotspot/jdk-26-ea+10 -XX:-UseCompressedOops -XX:+UseParallelGC
1 tests failed.
FAILED: org.apache.solr.cloud.TestDistribDocBasedVersion.testPullReplica
Error Message:
com.carrotsearch.randomizedtesting.UncaughtExceptionError: Captured an uncaught exception in thread: Thread[id=5278, name=updateExecutor-2776-thread-1, state=RUNNABLE, group=TGRP-TestDistribDocBasedVersion]
Stack Trace:
com.carrotsearch.randomizedtesting.UncaughtExceptionError: Captured an uncaught exception in thread: Thread[id=5278, name=updateExecutor-2776-thread-1, state=RUNNABLE, group=TGRP-TestDistribDocBasedVersion]
at __randomizedtesting.SeedInfo.seed([2F4B803259509FD3:67F717FCFC82B6AA]:0)
Caused by: org.apache.solr.common.SolrException: java.util.concurrent.ExecutionException: org.apache.solr.common.cloud.ZooKeeperException:
at __randomizedtesting.SeedInfo.seed([2F4B803259509FD3]:0)
at app//org.apache.solr.update.DefaultSolrCoreState$2.run(DefaultSolrCoreState.java:356)
at app//com.codahale.metrics.InstrumentedExecutorService$InstrumentedRunnable.run(InstrumentedExecutorService.java:212)
at app//org.apache.solr.common.util.ExecutorUtil$MDCAwareThreadPoolExecutor.lambda$execute$0(ExecutorUtil.java:381)
at java.base@26-ea/java.util.concurrent.ThreadPoolExecutor.runWorker(ThreadPoolExecutor.java:1090)
at java.base@26-ea/java.util.concurrent.ThreadPoolExecutor$Worker.run(ThreadPoolExecutor.java:614)
at java.base@26-ea/java.lang.Thread.run(Thread.java:1474)
Caused by: java.util.concurrent.ExecutionException: org.apache.solr.common.cloud.ZooKeeperException:
at java.base/java.util.concurrent.FutureTask.report(FutureTask.java:124)
at java.base/java.util.concurrent.FutureTask.get(FutureTask.java:193)
at org.apache.solr.update.DefaultSolrCoreState$2.run(DefaultSolrCoreState.java:351)
... 5 more
Caused by: org.apache.solr.common.cloud.ZooKeeperException:
at app//org.apache.solr.cloud.RecoveryStrategy.run(RecoveryStrategy.java:330)
at app//com.codahale.metrics.InstrumentedExecutorService$InstrumentedRunnable.run(InstrumentedExecutorService.java:212)
at java.base@26-ea/java.util.concurrent.Executors$RunnableAdapter.call(Executors.java:545)
at java.base@26-ea/java.util.concurrent.FutureTask.run(FutureTask.java:330)
... 4 more
Caused by: org.apache.solr.common.SolrException: SolrCore not found:collection1_shard1_replica_p5 in [control_collection_shard1_replica_n1]
at app//org.apache.solr.cloud.ReplicateFromLeader.startReplication(ReplicateFromLeader.java:75)
at app//org.apache.solr.cloud.ZkController.startReplicationFromLeader(ZkController.java:1538)
at app//org.apache.solr.cloud.RecoveryStrategy.doReplicateOnlyRecovery(RecoveryStrategy.java:431)
at app//org.apache.solr.cloud.RecoveryStrategy.doRecovery(RecoveryStrategy.java:349)
at app//org.apache.solr.cloud.RecoveryStrategy.run(RecoveryStrategy.java:323)
... 7 more