You are viewing a plain text version of this content. The canonical link for it is here.
Posted to issues@flink.apache.org by "Ahmed Hamdy (Jira)" <ji...@apache.org> on 2024/11/02 20:25:00 UTC
[jira] [Commented] (FLINK-34705) org.apache.flink.connector.elasticsearch.sink.ElasticsearchWriterITCase FAILURE
[ https://issues.apache.org/jira/browse/FLINK-34705?page=com.atlassian.jira.plugin.system.issuetabpanels:comment-tabpanel&focusedCommentId=17895055#comment-17895055 ]
Ahmed Hamdy commented on FLINK-34705:
-------------------------------------
Since ES connector has been externalized and this doesn't seem to appear on the CI. Could we close this ticket
> org.apache.flink.connector.elasticsearch.sink.ElasticsearchWriterITCase FAILURE
> -------------------------------------------------------------------------------
>
> Key: FLINK-34705
> URL: https://issues.apache.org/jira/browse/FLINK-34705
> Project: Flink
> Issue Type: Bug
> Components: Connectors / ElasticSearch
> Affects Versions: 1.16.2
> Environment: Environment is x86 machine
> Reporter: baihailiang
> Priority: Major
>
>
> {code:java}
> // code placeholder
> [ERROR] Tests run: 1, Failures: 0, Errors: 1, Skipped: 0, Time elapsed: 111.197 s <<< FAILURE! - in org.apache.flink.connector.elasticsearch.sink.ElasticsearchWriterITCase
> [ERROR] org.apache.flink.connector.elasticsearch.sink.ElasticsearchWriterITCase Time elapsed: 111.197 s <<< ERROR!
> org.testcontainers.containers.ContainerLaunchException: Container startup failed
> at org.testcontainers.containers.GenericContainer.doStart(GenericContainer.java:345)
> at org.testcontainers.containers.GenericContainer.start(GenericContainer.java:326)
> at org.testcontainers.junit.jupiter.TestcontainersExtension$StoreAdapter.start(TestcontainersExtension.java:242)
> at org.testcontainers.junit.jupiter.TestcontainersExtension$StoreAdapter.access$200(TestcontainersExtension.java:229)
> at org.testcontainers.junit.jupiter.TestcontainersExtension.lambda$null$1(TestcontainersExtension.java:59)
> at org.junit.jupiter.engine.execution.ExtensionValuesStore.lambda$getOrComputeIfAbsent$4(ExtensionValuesStore.java:86)
> at org.junit.jupiter.engine.execution.ExtensionValuesStore$MemoizingSupplier.computeValue(ExtensionValuesStore.java:223)
> at org.junit.jupiter.engine.execution.ExtensionValuesStore$MemoizingSupplier.get(ExtensionValuesStore.java:211)
> at org.junit.jupiter.engine.execution.ExtensionValuesStore$StoredValue.evaluate(ExtensionValuesStore.java:191)
> at org.junit.jupiter.engine.execution.ExtensionValuesStore$StoredValue.access$100(ExtensionValuesStore.java:171)
> at org.junit.jupiter.engine.execution.ExtensionValuesStore.getOrComputeIfAbsent(ExtensionValuesStore.java:89)
> at org.junit.jupiter.engine.execution.NamespaceAwareStore.getOrComputeIfAbsent(NamespaceAwareStore.java:53)
> at org.testcontainers.junit.jupiter.TestcontainersExtension.lambda$beforeAll$2(TestcontainersExtension.java:59)
> at java.util.ArrayList.forEach(ArrayList.java:1259)
> at org.testcontainers.junit.jupiter.TestcontainersExtension.beforeAll(TestcontainersExtension.java:59)
> at org.junit.jupiter.engine.descriptor.ClassBasedTestDescriptor.lambda$invokeBeforeAllCallbacks$10(ClassBasedTestDescriptor.java:381)
> at org.junit.platform.engine.support.hierarchical.ThrowableCollector.execute(ThrowableCollector.java:73)
> at org.junit.jupiter.engine.descriptor.ClassBasedTestDescriptor.invokeBeforeAllCallbacks(ClassBasedTestDescriptor.java:381)
> at org.junit.jupiter.engine.descriptor.ClassBasedTestDescriptor.before(ClassBasedTestDescriptor.java:205)
> at org.junit.jupiter.engine.descriptor.ClassBasedTestDescriptor.before(ClassBasedTestDescriptor.java:80)
> at org.junit.platform.engine.support.hierarchical.NodeTestTask.lambda$executeRecursively$6(NodeTestTask.java:148)
> at org.junit.platform.engine.support.hierarchical.ThrowableCollector.execute(ThrowableCollector.java:73)
> at org.junit.platform.engine.support.hierarchical.NodeTestTask.lambda$executeRecursively$8(NodeTestTask.java:141)
> at org.junit.platform.engine.support.hierarchical.Node.around(Node.java:137)
> at org.junit.platform.engine.support.hierarchical.NodeTestTask.lambda$executeRecursively$9(NodeTestTask.java:139)
> at org.junit.platform.engine.support.hierarchical.ThrowableCollector.execute(ThrowableCollector.java:73)
> at org.junit.platform.engine.support.hierarchical.NodeTestTask.executeRecursively(NodeTestTask.java:138)
> at org.junit.platform.engine.support.hierarchical.NodeTestTask.execute(NodeTestTask.java:95)
> at org.junit.platform.engine.support.hierarchical.ForkJoinPoolHierarchicalTestExecutorService$ExclusiveTask.compute(ForkJoinPoolHierarchicalTestExecutorService.java:185)
> at org.junit.platform.engine.support.hierarchical.ForkJoinPoolHierarchicalTestExecutorService.invokeAll(ForkJoinPoolHierarchicalTestExecutorService.java:129)
> at org.junit.platform.engine.support.hierarchical.NodeTestTask.lambda$executeRecursively$6(NodeTestTask.java:155)
> at org.junit.platform.engine.support.hierarchical.ThrowableCollector.execute(ThrowableCollector.java:73)
> at org.junit.platform.engine.support.hierarchical.NodeTestTask.lambda$executeRecursively$8(NodeTestTask.java:141)
> at org.junit.platform.engine.support.hierarchical.Node.around(Node.java:137)
> at org.junit.platform.engine.support.hierarchical.NodeTestTask.lambda$executeRecursively$9(NodeTestTask.java:139)
> at org.junit.platform.engine.support.hierarchical.ThrowableCollector.execute(ThrowableCollector.java:73)
> at org.junit.platform.engine.support.hierarchical.NodeTestTask.executeRecursively(NodeTestTask.java:138)
> at org.junit.platform.engine.support.hierarchical.NodeTestTask.execute(NodeTestTask.java:95)
> at org.junit.platform.engine.support.hierarchical.ForkJoinPoolHierarchicalTestExecutorService$ExclusiveTask.compute(ForkJoinPoolHierarchicalTestExecutorService.java:185)
> at java.util.concurrent.RecursiveAction.exec(RecursiveAction.java:189)
> at java.util.concurrent.ForkJoinTask.doExec(ForkJoinTask.java:289)
> at java.util.concurrent.ForkJoinPool$WorkQueue.runTask(ForkJoinPool.java:1056)
> at java.util.concurrent.ForkJoinPool.runWorker(ForkJoinPool.java:1692)
> at java.util.concurrent.ForkJoinWorkerThread.run(ForkJoinWorkerThread.java:175)
> Caused by: org.rnorth.ducttape.RetryCountExceededException: Retry limit hit with exception
> at org.rnorth.ducttape.unreliables.Unreliables.retryUntilSuccess(Unreliables.java:88)
> at org.testcontainers.containers.GenericContainer.doStart(GenericContainer.java:338)
> ... 43 more
> Caused by: org.testcontainers.containers.ContainerLaunchException: Could not create/start container
> at org.testcontainers.containers.GenericContainer.tryStart(GenericContainer.java:537)
> at org.testcontainers.containers.GenericContainer.lambda$doStart$0(GenericContainer.java:340)
> at org.rnorth.ducttape.unreliables.Unreliables.retryUntilSuccess(Unreliables.java:81)
> ... 44 more
> Caused by: org.testcontainers.containers.ContainerLaunchException: Timed out waiting for log output matching '.*("message":\s?"started".*|] started
> $)'
> at org.testcontainers.containers.wait.strategy.LogMessageWaitStrategy.waitUntilReady(LogMessageWaitStrategy.java:49)
> at org.testcontainers.containers.wait.strategy.AbstractWaitStrategy.waitUntilReady(AbstractWaitStrategy.java:51)
> at org.testcontainers.containers.GenericContainer.waitUntilContainerStarted(GenericContainer.java:926)
> at org.testcontainers.containers.GenericContainer.tryStart(GenericContainer.java:480)
> ... 46 more {code}
> {code:java}
> // code placeholder
> [ERROR] Tests run: 1, Failures: 0, Errors: 1, Skipped: 0, Time elapsed: 64.189 s <<< FAILURE! - in org.apache.flink.streaming.connectors.elasticsearch7.ElasticsearchSinkITCase[ERROR] org.apache.flink.streaming.connectors.elasticsearch7.ElasticsearchSinkITCase Time elapsed: 64.189 s <<< ERROR!org.testcontainers.containers.ContainerLaunchException: Container startup failed at org.testcontainers.containers.GenericContainer.doStart(GenericContainer.java:345) at org.testcontainers.containers.GenericContainer.start(GenericContainer.java:326) at org.testcontainers.containers.GenericContainer.starting(GenericContainer.java:1063) at org.testcontainers.containers.FailureDetectingExternalResource$1.evaluate(FailureDetectingExternalResource.java:29) at org.junit.rules.ExternalResource$1.evaluate(ExternalResource.java:54) at org.junit.rules.ExternalResource$1.evaluate(ExternalResource.java:54) at org.junit.rules.RunRules.evaluate(RunRules.java:20) at org.junit.runners.ParentRunner$3.evaluate(ParentRunner.java:306) at org.junit.runners.ParentRunner.run(ParentRunner.java:413) at org.junit.runner.JUnitCore.run(JUnitCore.java:137) at org.junit.runner.JUnitCore.run(JUnitCore.java:115) at org.junit.vintage.engine.execution.RunnerExecutor.execute(RunnerExecutor.java:42) at org.junit.vintage.engine.VintageTestEngine.executeAllChildren(VintageTestEngine.java:80) at org.junit.vintage.engine.VintageTestEngine.execute(VintageTestEngine.java:72) at org.junit.platform.launcher.core.EngineExecutionOrchestrator.execute(EngineExecutionOrchestrator.java:107) at org.junit.platform.launcher.core.EngineExecutionOrchestrator.execute(EngineExecutionOrchestrator.java:88) at org.junit.platform.launcher.core.EngineExecutionOrchestrator.lambda$execute$0(EngineExecutionOrchestrator.java:54) at org.junit.platform.launcher.core.EngineExecutionOrchestrator.withInterceptedStreams(EngineExecutionOrchestrator.java:67) at org.junit.platform.launcher.core.EngineExecutionOrchestrator.execute(EngineExecutionOrchestrator.java:52) at org.junit.platform.launcher.core.DefaultLauncher.execute(DefaultLauncher.java:114) at org.junit.platform.launcher.core.DefaultLauncher.execute(DefaultLauncher.java:86) at org.junit.platform.launcher.core.DefaultLauncherSession$DelegatingLauncher.execute(DefaultLauncherSession.java:86) at org.junit.platform.launcher.core.SessionPerRequestLauncher.execute(SessionPerRequestLauncher.java:53) at org.apache.maven.surefire.junitplatform.JUnitPlatformProvider.execute(JUnitPlatformProvider.java:188) at org.apache.maven.surefire.junitplatform.JUnitPlatformProvider.invokeAllTests(JUnitPlatformProvider.java:154) at org.apache.maven.surefire.junitplatform.JUnitPlatformProvider.invoke(JUnitPlatformProvider.java:124) at org.apache.maven.surefire.booter.ForkedBooter.runSuitesInProcess(ForkedBooter.java:428) at org.apache.maven.surefire.booter.ForkedBooter.execute(ForkedBooter.java:162) at org.apache.maven.surefire.booter.ForkedBooter.run(ForkedBooter.java:562) at org.apache.maven.surefire.booter.ForkedBooter.main(ForkedBooter.java:548)Caused by: org.rnorth.ducttape.RetryCountExceededException: Retry limit hit with exception at org.rnorth.ducttape.unreliables.Unreliables.retryUntilSuccess(Unreliables.java:88) at org.testcontainers.containers.GenericContainer.doStart(GenericContainer.java:338) ... 29 moreCaused by: org.testcontainers.containers.ContainerLaunchException: Could not create/start container at org.testcontainers.containers.GenericContainer.tryStart(GenericContainer.java:537) at org.testcontainers.containers.GenericContainer.lambda$doStart$0(GenericContainer.java:340) at org.rnorth.ducttape.unreliables.Unreliables.retryUntilSuccess(Unreliables.java:81) ... 30 moreCaused by: org.testcontainers.containers.ContainerLaunchException: Timed out waiting for log output matching '.*("message":\s?"started".*|] started$)' at org.testcontainers.containers.wait.strategy.LogMessageWaitStrategy.waitUntilReady(LogMessageWaitStrategy.java:49) at org.testcontainers.containers.wait.strategy.AbstractWaitStrategy.waitUntilReady(AbstractWaitStrategy.java:51) at org.testcontainers.containers.GenericContainer.waitUntilContainerStarted(GenericContainer.java:926) at org.testcontainers.containers.GenericContainer.tryStart(GenericContainer.java:480) ... 32 more
> [INFO] Running org.apache.flink.connector.elasticsearch.table.Elasticsearch7DynamicSinkITCase[ERROR] Tests run: 1, Failures: 0, Errors: 1, Skipped: 0, Time elapsed: 61.856 s <<< FAILURE! - in org.apache.flink.connector.elasticsearch.sink.Elasticsearch7SinkITCase[ERROR] org.apache.flink.connector.elasticsearch.sink.Elasticsearch7SinkITCase Time elapsed: 61.856 s <<< ERROR!org.testcontainers.containers.ContainerLaunchException: Container startup failed at org.testcontainers.containers.GenericContainer.doStart(GenericContainer.java:345) at org.testcontainers.containers.GenericContainer.start(GenericContainer.java:326) at org.testcontainers.junit.jupiter.TestcontainersExtension$StoreAdapter.start(TestcontainersExtension.java:242) at org.testcontainers.junit.jupiter.TestcontainersExtension$StoreAdapter.access$200(TestcontainersExtension.java:229) at org.testcontainers.junit.jupiter.TestcontainersExtension.lambda$null$1(TestcontainersExtension.java:59) at org.junit.jupiter.engine.execution.ExtensionValuesStore.lambda$getOrComputeIfAbsent$4(ExtensionValuesStore.java:86) at org.junit.jupiter.engine.execution.ExtensionValuesStore$MemoizingSupplier.computeValue(ExtensionValuesStore.java:223) at org.junit.jupiter.engine.execution.ExtensionValuesStore$MemoizingSupplier.get(ExtensionValuesStore.java:211) at org.junit.jupiter.engine.execution.ExtensionValuesStore$StoredValue.evaluate(ExtensionValuesStore.java:191) at org.junit.jupiter.engine.execution.ExtensionValuesStore$StoredValue.access$100(ExtensionValuesStore.java:171) at org.junit.jupiter.engine.execution.ExtensionValuesStore.getOrComputeIfAbsent(ExtensionValuesStore.java:89) at org.junit.jupiter.engine.execution.NamespaceAwareStore.getOrComputeIfAbsent(NamespaceAwareStore.java:53) at org.testcontainers.junit.jupiter.TestcontainersExtension.lambda$beforeAll$2(TestcontainersExtension.java:59) at java.util.ArrayList.forEach(ArrayList.java:1259) at org.testcontainers.junit.jupiter.TestcontainersExtension.beforeAll(TestcontainersExtension.java:59) at org.junit.jupiter.engine.descriptor.ClassBasedTestDescriptor.lambda$invokeBeforeAllCallbacks$10(ClassBasedTestDescriptor.java:381) at org.junit.platform.engine.support.hierarchical.ThrowableCollector.execute(ThrowableCollector.java:73) at org.junit.jupiter.engine.descriptor.ClassBasedTestDescriptor.invokeBeforeAllCallbacks(ClassBasedTestDescriptor.java:381) at org.junit.jupiter.engine.descriptor.ClassBasedTestDescriptor.before(ClassBasedTestDescriptor.java:205) at org.junit.jupiter.engine.descriptor.ClassBasedTestDescriptor.before(ClassBasedTestDescriptor.java:80) at org.junit.platform.engine.support.hierarchical.NodeTestTask.lambda$executeRecursively$6(NodeTestTask.java:148) at org.junit.platform.engine.support.hierarchical.ThrowableCollector.execute(ThrowableCollector.java:73) at org.junit.platform.engine.support.hierarchical.NodeTestTask.lambda$executeRecursively$8(NodeTestTask.java:141) at org.junit.platform.engine.support.hierarchical.Node.around(Node.java:137) at org.junit.platform.engine.support.hierarchical.NodeTestTask.lambda$executeRecursively$9(NodeTestTask.java:139) at org.junit.platform.engine.support.hierarchical.ThrowableCollector.execute(ThrowableCollector.java:73) at org.junit.platform.engine.support.hierarchical.NodeTestTask.executeRecursively(NodeTestTask.java:138) at org.junit.platform.engine.support.hierarchical.NodeTestTask.execute(NodeTestTask.java:95) at org.junit.platform.engine.support.hierarchical.ForkJoinPoolHierarchicalTestExecutorService$ExclusiveTask.compute(ForkJoinPoolHierarchicalTestExecutorService.java:185) at org.junit.platform.engine.support.hierarchical.ForkJoinPoolHierarchicalTestExecutorService.invokeAll(ForkJoinPoolHierarchicalTestExecutorService.java:129) at org.junit.platform.engine.support.hierarchical.NodeTestTask.lambda$executeRecursively$6(NodeTestTask.java:155) at org.junit.platform.engine.support.hierarchical.ThrowableCollector.execute(ThrowableCollector.java:73) at org.junit.platform.engine.support.hierarchical.NodeTestTask.lambda$executeRecursively$8(NodeTestTask.java:141) at org.junit.platform.engine.support.hierarchical.Node.around(Node.java:137) at org.junit.platform.engine.support.hierarchical.NodeTestTask.lambda$executeRecursively$9(NodeTestTask.java:139) at org.junit.platform.engine.support.hierarchical.ThrowableCollector.execute(ThrowableCollector.java:73) at org.junit.platform.engine.support.hierarchical.NodeTestTask.executeRecursively(NodeTestTask.java:138) at org.junit.platform.engine.support.hierarchical.NodeTestTask.execute(NodeTestTask.java:95) at org.junit.platform.engine.support.hierarchical.ForkJoinPoolHierarchicalTestExecutorService$ExclusiveTask.compute(ForkJoinPoolHierarchicalTestExecutorService.java:185) at java.util.concurrent.RecursiveAction.exec(RecursiveAction.java:189) at java.util.concurrent.ForkJoinTask.doExec(ForkJoinTask.java:289) at java.util.concurrent.ForkJoinPool$WorkQueue.runTask(ForkJoinPool.java:1056) at java.util.concurrent.ForkJoinPool.runWorker(ForkJoinPool.java:1692) at java.util.concurrent.ForkJoinWorkerThread.run(ForkJoinWorkerThread.java:175)Caused by: org.rnorth.ducttape.RetryCountExceededException: Retry limit hit with exception at org.rnorth.ducttape.unreliables.Unreliables.retryUntilSuccess(Unreliables.java:88) at org.testcontainers.containers.GenericContainer.doStart(GenericContainer.java:338) ... 43 moreCaused by: org.testcontainers.containers.ContainerLaunchException: Could not create/start container at org.testcontainers.containers.GenericContainer.tryStart(GenericContainer.java:537) at org.testcontainers.containers.GenericContainer.lambda$doStart$0(GenericContainer.java:340) at org.rnorth.ducttape.unreliables.Unreliables.retryUntilSuccess(Unreliables.java:81) ... 44 moreCaused by: org.testcontainers.containers.ContainerLaunchException: Timed out waiting for log output matching '.*("message":\s?"started".*|] started$)' at org.testcontainers.containers.wait.strategy.LogMessageWaitStrategy.waitUntilReady(LogMessageWaitStrategy.java:49) at org.testcontainers.containers.wait.strategy.AbstractWaitStrategy.waitUntilReady(AbstractWaitStrategy.java:51) at org.testcontainers.containers.GenericContainer.waitUntilContainerStarted(GenericContainer.java:926) at org.testcontainers.containers.GenericContainer.tryStart(GenericContainer.java:480) ... 46 more
> [ERROR] Tests run: 1, Failures: 0, Errors: 1, Skipped: 0, Time elapsed: 61.837 s <<< FAILURE! - in org.apache.flink.connector.elasticsearch.table.Elasticsearch7DynamicSinkITCase[ERROR] org.apache.flink.connector.elasticsearch.table.Elasticsearch7DynamicSinkITCase Time elapsed: 61.837 s <<< ERROR!org.testcontainers.containers.ContainerLaunchException: Container startup failed at org.testcontainers.containers.GenericContainer.doStart(GenericContainer.java:345) at org.testcontainers.containers.GenericContainer.start(GenericContainer.java:326) at org.testcontainers.junit.jupiter.TestcontainersExtension$StoreAdapter.start(TestcontainersExtension.java:242) at org.testcontainers.junit.jupiter.TestcontainersExtension$StoreAdapter.access$200(TestcontainersExtension.java:229) at org.testcontainers.junit.jupiter.TestcontainersExtension.lambda$null$1(TestcontainersExtension.java:59) at org.junit.jupiter.engine.execution.ExtensionValuesStore.lambda$getOrComputeIfAbsent$4(ExtensionValuesStore.java:86) at org.junit.jupiter.engine.execution.ExtensionValuesStore$MemoizingSupplier.computeValue(ExtensionValuesStore.java:223) at org.junit.jupiter.engine.execution.ExtensionValuesStore$MemoizingSupplier.get(ExtensionValuesStore.java:211) at org.junit.jupiter.engine.execution.ExtensionValuesStore$StoredValue.evaluate(ExtensionValuesStore.java:191) at org.junit.jupiter.engine.execution.ExtensionValuesStore$StoredValue.access$100(ExtensionValuesStore.java:171) at org.junit.jupiter.engine.execution.ExtensionValuesStore.getOrComputeIfAbsent(ExtensionValuesStore.java:89) at org.junit.jupiter.engine.execution.NamespaceAwareStore.getOrComputeIfAbsent(NamespaceAwareStore.java:53) at org.testcontainers.junit.jupiter.TestcontainersExtension.lambda$beforeAll$2(TestcontainersExtension.java:59) at java.util.ArrayList.forEach(ArrayList.java:1259) at org.testcontainers.junit.jupiter.TestcontainersExtension.beforeAll(TestcontainersExtension.java:59) at org.junit.jupiter.engine.descriptor.ClassBasedTestDescriptor.lambda$invokeBeforeAllCallbacks$10(ClassBasedTestDescriptor.java:381) at org.junit.platform.engine.support.hierarchical.ThrowableCollector.execute(ThrowableCollector.java:73) at org.junit.jupiter.engine.descriptor.ClassBasedTestDescriptor.invokeBeforeAllCallbacks(ClassBasedTestDescriptor.java:381) at org.junit.jupiter.engine.descriptor.ClassBasedTestDescriptor.before(ClassBasedTestDescriptor.java:205) at org.junit.jupiter.engine.descriptor.ClassBasedTestDescriptor.before(ClassBasedTestDescriptor.java:80) at org.junit.platform.engine.support.hierarchical.NodeTestTask.lambda$executeRecursively$6(NodeTestTask.java:148) at org.junit.platform.engine.support.hierarchical.ThrowableCollector.execute(ThrowableCollector.java:73) at org.junit.platform.engine.support.hierarchical.NodeTestTask.lambda$executeRecursively$8(NodeTestTask.java:141) at org.junit.platform.engine.support.hierarchical.Node.around(Node.java:137) at org.junit.platform.engine.support.hierarchical.NodeTestTask.lambda$executeRecursively$9(NodeTestTask.java:139) at org.junit.platform.engine.support.hierarchical.ThrowableCollector.execute(ThrowableCollector.java:73) at org.junit.platform.engine.support.hierarchical.NodeTestTask.executeRecursively(NodeTestTask.java:138) at org.junit.platform.engine.support.hierarchical.NodeTestTask.execute(NodeTestTask.java:95) at org.junit.platform.engine.support.hierarchical.ForkJoinPoolHierarchicalTestExecutorService$ExclusiveTask.compute(ForkJoinPoolHierarchicalTestExecutorService.java:185) at org.junit.platform.engine.support.hierarchical.ForkJoinPoolHierarchicalTestExecutorService.invokeAll(ForkJoinPoolHierarchicalTestExecutorService.java:129) at org.junit.platform.engine.support.hierarchical.NodeTestTask.lambda$executeRecursively$6(NodeTestTask.java:155) at org.junit.platform.engine.support.hierarchical.ThrowableCollector.execute(ThrowableCollector.java:73) at org.junit.platform.engine.support.hierarchical.NodeTestTask.lambda$executeRecursively$8(NodeTestTask.java:141) at org.junit.platform.engine.support.hierarchical.Node.around(Node.java:137) at org.junit.platform.engine.support.hierarchical.NodeTestTask.lambda$executeRecursively$9(NodeTestTask.java:139) at org.junit.platform.engine.support.hierarchical.ThrowableCollector.execute(ThrowableCollector.java:73) at org.junit.platform.engine.support.hierarchical.NodeTestTask.executeRecursively(NodeTestTask.java:138) at org.junit.platform.engine.support.hierarchical.NodeTestTask.execute(NodeTestTask.java:95) at org.junit.platform.engine.support.hierarchical.ForkJoinPoolHierarchicalTestExecutorService$ExclusiveTask.compute(ForkJoinPoolHierarchicalTestExecutorService.java:185) at java.util.concurrent.RecursiveAction.exec(RecursiveAction.java:189) at java.util.concurrent.ForkJoinTask.doExec(ForkJoinTask.java:289) at java.util.concurrent.ForkJoinPool$WorkQueue.runTask(ForkJoinPool.java:1056) at java.util.concurrent.ForkJoinPool.runWorker(ForkJoinPool.java:1692) at java.util.concurrent.ForkJoinWorkerThread.run(ForkJoinWorkerThread.java:175)Caused by: org.rnorth.ducttape.RetryCountExceededException: Retry limit hit with exception at org.rnorth.ducttape.unreliables.Unreliables.retryUntilSuccess(Unreliables.java:88) at org.testcontainers.containers.GenericContainer.doStart(GenericContainer.java:338) ... 43 moreCaused by: org.testcontainers.containers.ContainerLaunchException: Could not create/start container at org.testcontainers.containers.GenericContainer.tryStart(GenericContainer.java:537) at org.testcontainers.containers.GenericContainer.lambda$doStart$0(GenericContainer.java:340) at org.rnorth.ducttape.unreliables.Unreliables.retryUntilSuccess(Unreliables.java:81) ... 44 moreCaused by: org.testcontainers.containers.ContainerLaunchException: Timed out waiting for log output matching '.*("message":\s?"started".*|] started$)' at org.testcontainers.containers.wait.strategy.LogMessageWaitStrategy.waitUntilReady(LogMessageWaitStrategy.java:49) at org.testcontainers.containers.wait.strategy.AbstractWaitStrategy.waitUntilReady(AbstractWaitStrategy.java:51) at org.testcontainers.containers.GenericContainer.waitUntilContainerStarted(GenericContainer.java:926) at org.testcontainers.containers.GenericContainer.tryStart(GenericContainer.java:480) ... 46 more {code}
> The scenario in which these errors occur is that I create a docker image using the dockerfile, mount flink in the specified directory and start compiling and executing the ci tests using maven, and these tests start reporting errors because I can't find docker in the environment, so I modified the dockerfile and added yum install docker.After installing docker in the image and compiling maven again ci test will be the above error
> *My docker and maven compilation commands*
> {code:java}
> docker run --privileged --rm --cpus="6" -m 12g --user flinkci -v $WORKSPACE:/home/flinkci/flink -v /data1/flink/maven:/home/flinkci/.m2/repository -v /var/run/docker.sock:/var/run/docker-sock image:v1.0.0 /bin/bash -c \"cd /home/flinkci/flink && mvn clean install -Dscala-2.12 {code}
>
>
--
This message was sent by Atlassian Jira
(v8.20.10#820010)