You are viewing a plain text version of this content. The canonical link for it is here.
Posted to dev@pdfbox.apache.org by Apache Jenkins Server <je...@builds.apache.org> on 2023/06/08 16:50:27 UTC
Build failed in Jenkins: PDFBox » PDFBox-sonar2 #1052
See <https://ci-builds.apache.org/job/PDFBox/job/PDFBox-sonar2/1052/display/redirect>
Changes:
------------------------------------------
[...truncated 7.10 KB...]
[INFO] --- enforcer:3.3.0:enforce (enforce-maven-version) @ pdfbox-parent ---
[INFO]
[INFO] --- enforcer:3.3.0:enforce (enforce-java-version) @ pdfbox-parent ---
[INFO]
[INFO] --- jacoco:0.8.10:prepare-agent (default) @ pdfbox-parent ---
[INFO] surefireArgLine set to -javaagent:/home/jenkins/.m2/repository/org/jacoco/org.jacoco.agent/0.8.10/org.jacoco.agent-0.8.10-runtime.jar=destfile=<https://ci-builds.apache.org/job/PDFBox/job/PDFBox-sonar2/ws/parent/target/jacoco.exec>
[WARNING] Failed to getClass for org.apache.maven.plugins.source.SourceJarMojo
[INFO]
[INFO] <<< source:3.2.1:jar (attach-sources) < generate-sources @ pdfbox-parent <<<
[INFO]
[INFO]
[INFO] --- source:3.2.1:jar (attach-sources) @ pdfbox-parent ---
[WARNING] Attempt to (de-)serialize anonymous class org.jfrog.hudson.maven2.MavenDependenciesRecorder$1; see: https://jenkins.io/redirect/serialization-of-anonymous-classes/
[INFO]
[INFO] --------------------< org.apache.pdfbox:pdfbox-io >---------------------
[INFO] Building Apache PDFBox io 3.0.0-SNAPSHOT [2/13]
[INFO] from io/pom.xml
[INFO] -------------------------------[ bundle ]-------------------------------
[INFO]
[INFO] --- enforcer:3.3.0:enforce (default) @ pdfbox-io ---
[INFO] Rule 0: org.apache.maven.enforcer.rules.version.RequireMavenVersion passed
[INFO]
[INFO] --- enforcer:3.3.0:enforce (enforce-maven-version) @ pdfbox-io ---
[INFO] Rule 0: org.apache.maven.enforcer.rules.version.RequireMavenVersion passed
[INFO]
[INFO] --- enforcer:3.3.0:enforce (enforce-java-version) @ pdfbox-io ---
[INFO] Rule 0: org.apache.maven.enforcer.rules.version.RequireJavaVersion passed
[INFO]
[INFO] --- jacoco:0.8.10:prepare-agent (default) @ pdfbox-io ---
[INFO] surefireArgLine set to -javaagent:/home/jenkins/.m2/repository/org/jacoco/org.jacoco.agent/0.8.10/org.jacoco.agent-0.8.10-runtime.jar=destfile=<https://ci-builds.apache.org/job/PDFBox/job/PDFBox-sonar2/ws/io/target/jacoco.exec>
[INFO]
[INFO] --- remote-resources:1.7.0:process (process-resource-bundles) @ pdfbox-io ---
[INFO] Preparing remote bundle org.apache:apache-jar-resource-bundle:1.4
[INFO] Copying 3 resources from 1 bundle.
[INFO]
[INFO] --- resources:3.3.0:resources (default-resources) @ pdfbox-io ---
[INFO] skip non existing resourceDirectory <https://ci-builds.apache.org/job/PDFBox/job/PDFBox-sonar2/ws/io/src/main/resources>
[INFO] Copying 3 resources
[INFO]
[INFO] --- compiler:3.10.1:compile (default-compile) @ pdfbox-io ---
[INFO] Changes detected - recompiling the module!
[INFO] Compiling 15 source files to <https://ci-builds.apache.org/job/PDFBox/job/PDFBox-sonar2/ws/io/target/classes>
[INFO]
[INFO] --- resources:3.3.0:testResources (default-testResources) @ pdfbox-io ---
[INFO] Copying 2 resources
[INFO] Copying 3 resources
[INFO]
[INFO] --- compiler:3.10.1:testCompile (default-testCompile) @ pdfbox-io ---
[INFO] Changes detected - recompiling the module!
[INFO] Compiling 8 source files to <https://ci-builds.apache.org/job/PDFBox/job/PDFBox-sonar2/ws/io/target/test-classes>
[INFO]
[INFO] --- surefire:2.22.2:test (default-test) @ pdfbox-io ---
[INFO]
[INFO] -------------------------------------------------------
[INFO] T E S T S
[INFO] -------------------------------------------------------
[INFO] Running org.apache.pdfbox.io.ScratchFileBufferTest
[INFO] Tests run: 7, Failures: 0, Errors: 0, Skipped: 0, Time elapsed: 0.142 s - in org.apache.pdfbox.io.ScratchFileBufferTest
[INFO] Running org.apache.pdfbox.io.RandomAccessInputStreamTest
[INFO] Tests run: 5, Failures: 0, Errors: 0, Skipped: 0, Time elapsed: 0.001 s - in org.apache.pdfbox.io.RandomAccessInputStreamTest
[INFO] Running org.apache.pdfbox.io.RandomAccessReadViewTest
[INFO] Tests run: 7, Failures: 0, Errors: 0, Skipped: 0, Time elapsed: 0.001 s - in org.apache.pdfbox.io.RandomAccessReadViewTest
[INFO] Running org.apache.pdfbox.io.TestIOUtils
[INFO] Tests run: 1, Failures: 0, Errors: 0, Skipped: 0, Time elapsed: 0 s - in org.apache.pdfbox.io.TestIOUtils
[INFO] Running org.apache.pdfbox.io.RandomAccessReadBufferTest
[INFO] Tests run: 11, Failures: 0, Errors: 0, Skipped: 0, Time elapsed: 1.204 s - in org.apache.pdfbox.io.RandomAccessReadBufferTest
[INFO] Running org.apache.pdfbox.io.SequenceRandomAccessReadTest
[INFO] Tests run: 5, Failures: 0, Errors: 0, Skipped: 0, Time elapsed: 0.019 s - in org.apache.pdfbox.io.SequenceRandomAccessReadTest
[INFO] Running org.apache.pdfbox.io.RandomAccessReadMemoryMappedFileTest
[INFO] Tests run: 9, Failures: 0, Errors: 0, Skipped: 0, Time elapsed: 0.024 s - in org.apache.pdfbox.io.RandomAccessReadMemoryMappedFileTest
[INFO] Running org.apache.pdfbox.io.RandomAccessReadBufferedFileTest
[INFO] Tests run: 8, Failures: 0, Errors: 0, Skipped: 0, Time elapsed: 0.018 s - in org.apache.pdfbox.io.RandomAccessReadBufferedFileTest
[INFO]
[INFO] Results:
[INFO]
[INFO] Tests run: 53, Failures: 0, Errors: 0, Skipped: 0
[INFO]
[JENKINS] Recording test results
[INFO]
[INFO] --- jacoco:0.8.10:report (report) @ pdfbox-io ---
[INFO] Loading execution data file <https://ci-builds.apache.org/job/PDFBox/job/PDFBox-sonar2/ws/io/target/jacoco.exec>
[INFO] Analyzed bundle 'Apache PDFBox io' with 13 classes
[INFO]
[INFO] --- animal-sniffer:1.23:check (check-java-version) @ pdfbox-io ---
[INFO] Checking unresolved references to org.codehaus.mojo.signature:java18:1.0
[INFO]
[INFO] --- bundle:5.1.9:bundle (default-bundle) @ pdfbox-io ---
[INFO] Building bundle: <https://ci-builds.apache.org/job/PDFBox/job/PDFBox-sonar2/ws/io/target/pdfbox-io-3.0.0-SNAPSHOT.jar>
[INFO] Writing manifest: <https://ci-builds.apache.org/job/PDFBox/job/PDFBox-sonar2/ws/io/target/classes/META-INF/MANIFEST.MF>
[INFO]
[INFO] --- site:3.12.1:attach-descriptor (attach-descriptor) @ pdfbox-io ---
[INFO] Skipping because packaging 'bundle' is not pom.
[INFO]
[INFO] >>> source:3.2.1:jar (attach-sources) > generate-sources @ pdfbox-io >>>
[INFO]
[INFO] --- enforcer:3.3.0:enforce (default) @ pdfbox-io ---
[INFO]
[INFO] --- enforcer:3.3.0:enforce (enforce-maven-version) @ pdfbox-io ---
[INFO]
[INFO] --- enforcer:3.3.0:enforce (enforce-java-version) @ pdfbox-io ---
[INFO]
[INFO] --- jacoco:0.8.10:prepare-agent (default) @ pdfbox-io ---
[INFO] surefireArgLine set to -javaagent:/home/jenkins/.m2/repository/org/jacoco/org.jacoco.agent/0.8.10/org.jacoco.agent-0.8.10-runtime.jar=destfile=<https://ci-builds.apache.org/job/PDFBox/job/PDFBox-sonar2/ws/io/target/jacoco.exec>
[WARNING] Failed to getClass for org.apache.maven.plugins.source.SourceJarMojo
[INFO]
[INFO] <<< source:3.2.1:jar (attach-sources) < generate-sources @ pdfbox-io <<<
[INFO]
[INFO]
[INFO] --- source:3.2.1:jar (attach-sources) @ pdfbox-io ---
[INFO] Building jar: <https://ci-builds.apache.org/job/PDFBox/job/PDFBox-sonar2/ws/io/target/pdfbox-io-3.0.0-SNAPSHOT-sources.jar>
[INFO]
[INFO] ---------------------< org.apache.pdfbox:fontbox >----------------------
[INFO] Building Apache FontBox 3.0.0-SNAPSHOT [3/13]
[INFO] from fontbox/pom.xml
[INFO] -------------------------------[ bundle ]-------------------------------
[INFO]
[INFO] --- enforcer:3.3.0:enforce (default) @ fontbox ---
[INFO]
[INFO] --- enforcer:3.3.0:enforce (enforce-maven-version) @ fontbox ---
[INFO]
[INFO] --- enforcer:3.3.0:enforce (enforce-java-version) @ fontbox ---
[INFO]
[INFO] --- jacoco:0.8.10:prepare-agent (default) @ fontbox ---
[INFO] surefireArgLine set to -javaagent:/home/jenkins/.m2/repository/org/jacoco/org.jacoco.agent/0.8.10/org.jacoco.agent-0.8.10-runtime.jar=destfile=<https://ci-builds.apache.org/job/PDFBox/job/PDFBox-sonar2/ws/fontbox/target/jacoco.exec>
[INFO]
[INFO] --- remote-resources:1.7.0:process (process-resource-bundles) @ fontbox ---
[INFO] Preparing remote bundle org.apache:apache-jar-resource-bundle:1.4
[INFO] Copying 3 resources from 1 bundle.
[INFO] Copying appended resource: META-INF/NOTICE
[INFO] Copying appended resource: META-INF/LICENSE
[INFO]
[INFO] --- resources:3.3.0:resources (default-resources) @ fontbox ---
[INFO] Copying 93 resources
[INFO] Copying 3 resources
[INFO]
[INFO] --- compiler:3.10.1:compile (default-compile) @ fontbox ---
[INFO] Changes detected - recompiling the module!
[INFO] Compiling 135 source files to <https://ci-builds.apache.org/job/PDFBox/job/PDFBox-sonar2/ws/fontbox/target/classes>
[INFO] <https://ci-builds.apache.org/job/PDFBox/job/PDFBox-sonar2/ws/fontbox/src/main/java/org/apache/fontbox/cff/CFFFont.java>: Some input files use unchecked or unsafe operations.
[INFO] <https://ci-builds.apache.org/job/PDFBox/job/PDFBox-sonar2/ws/fontbox/src/main/java/org/apache/fontbox/cff/CFFFont.java>: Recompile with -Xlint:unchecked for details.
[INFO]
[INFO] --- download:1.7.0:wget (PDFBOX-4038) @ fontbox ---
[WARNING] Error while reading from cache /home/jenkins/.m2/repository/.cache/download-maven-plugin/index.ser
[WARNING] Error while reading from cache /home/jenkins/.m2/repository/.cache/download-maven-plugin/index.ser
[WARNING] Error while reading from cache /home/jenkins/.m2/repository/.cache/download-maven-plugin/index.ser
[WARNING] Error while reading from cache /home/jenkins/.m2/repository/.cache/download-maven-plugin/index.ser
[INFO]
[INFO] --- download:1.7.0:wget (PDFBOX-3997) @ fontbox ---
[WARNING] Error while reading from cache /home/jenkins/.m2/repository/.cache/download-maven-plugin/index.ser
[WARNING] Error while reading from cache /home/jenkins/.m2/repository/.cache/download-maven-plugin/index.ser
[WARNING] Error while reading from cache /home/jenkins/.m2/repository/.cache/download-maven-plugin/index.ser
[WARNING] Error while reading from cache /home/jenkins/.m2/repository/.cache/download-maven-plugin/index.ser
[INFO]
[INFO] --- download:1.7.0:wget (PDFBOX-3379) @ fontbox ---
[WARNING] Error while reading from cache /home/jenkins/.m2/repository/.cache/download-maven-plugin/index.ser
[WARNING] Error while reading from cache /home/jenkins/.m2/repository/.cache/download-maven-plugin/index.ser
[WARNING] Error while reading from cache /home/jenkins/.m2/repository/.cache/download-maven-plugin/index.ser
[WARNING] Error while reading from cache /home/jenkins/.m2/repository/.cache/download-maven-plugin/index.ser
[INFO]
[INFO] --- download:1.7.0:wget (PDFBOX-5328) @ fontbox ---
[WARNING] Error while reading from cache /home/jenkins/.m2/repository/.cache/download-maven-plugin/index.ser
[WARNING] Error while reading from cache /home/jenkins/.m2/repository/.cache/download-maven-plugin/index.ser
[WARNING] Error while reading from cache /home/jenkins/.m2/repository/.cache/download-maven-plugin/index.ser
[WARNING] Error while reading from cache /home/jenkins/.m2/repository/.cache/download-maven-plugin/index.ser
[INFO]
[INFO] --- download:1.7.0:wget (PDFBOX-5356) @ fontbox ---
[WARNING] Error while reading from cache /home/jenkins/.m2/repository/.cache/download-maven-plugin/index.ser
[WARNING] Error while reading from cache /home/jenkins/.m2/repository/.cache/download-maven-plugin/index.ser
[INFO]
[INFO] ------------------------------------------------------------------------
[INFO] Skipping Apache PDFBox
[INFO] This project has been banned from the build due to previous failures.
[INFO] ------------------------------------------------------------------------
[INFO] ------------------------------------------------------------------------
[INFO] Reactor Summary for Apache PDFBox 3.0.0-SNAPSHOT:
[INFO]
[INFO] PDFBox parent ...................................... SUCCESS [ 15.304 s]
[INFO] Apache PDFBox io ................................... SUCCESS [ 38.852 s]
[INFO] Apache FontBox ..................................... FAILURE [ 18.150 s]
[INFO] Apache XmpBox ...................................... SKIPPED
[INFO] Apache PDFBox ...................................... SKIPPED
[INFO] Apache Preflight ................................... SKIPPED
[INFO] Apache Preflight application ....................... SKIPPED
[INFO] Apache PDFBox Debugger ............................. SKIPPED
[INFO] Apache PDFBox tools ................................ SKIPPED
[INFO] Apache PDFBox application .......................... SKIPPED
[INFO] Apache PDFBox Debugger application ................. SKIPPED
[INFO] Apache PDFBox examples ............................. SKIPPED
[INFO] Apache PDFBox ...................................... SKIPPED
[INFO] ------------------------------------------------------------------------
[INFO] BUILD FAILURE
[INFO] ------------------------------------------------------------------------
[INFO] Total time: 01:43 min
[INFO] Finished at: 2023-06-08T16:49:55Z
[INFO] ------------------------------------------------------------------------
[WARNING]
[WARNING] Plugin validation issues were detected in 10 plugin(s)
[WARNING]
[WARNING] * org.apache.maven.plugins:maven-scm-plugin:1.13.0
[WARNING] * org.apache.maven.plugins:maven-source-plugin:3.2.1
[WARNING] * org.jacoco:jacoco-maven-plugin:0.8.10
[WARNING] * org.apache.maven.plugins:maven-site-plugin:3.12.1
[WARNING] * org.apache.felix:maven-bundle-plugin:5.1.9
[WARNING] * org.apache.maven.plugins:maven-compiler-plugin:3.10.1
[WARNING] * org.apache.maven.plugins:maven-remote-resources-plugin:1.7.0
[WARNING] * org.apache.maven.plugins:maven-surefire-plugin:2.22.2
[WARNING] * org.apache.maven.plugins:maven-resources-plugin:3.3.0
[WARNING] * org.codehaus.mojo:sonar-maven-plugin:3.9.1.2184
[WARNING]
[WARNING] For more or less details, use 'maven.plugin.validation' property with one of the values (case insensitive): [BRIEF, DEFAULT, VERBOSE]
[WARNING]
Waiting for Jenkins to finish collecting data
[ERROR] Failed to execute goal com.googlecode.maven-download-plugin:download-maven-plugin:1.7.0:wget (PDFBOX-5356) on project fontbox: General error: Not same digest as expected: expected <2787fcecc0feb1c9e6ff0d8de6193658413863e44eaab572751ca7e6c3b369c0a9731f4952cb0821f307760f0422f77c5f0d3fe7df6b054643fb39423e8d70ee> was <c1ab86078fa4c59ebc746385aee835b43bb2ef3ab65ca014976193d66d0bccfdeab5104b744ff43cbbff087760330c92d734833f87d0cf4aedbc60157a12bcab> -> [Help 1]
[ERROR]
[ERROR] To see the full stack trace of the errors, re-run Maven with the -e switch.
[ERROR] Re-run Maven using the -X switch to enable full debug logging.
[ERROR]
[ERROR] For more information about the errors and possible solutions, please read the following articles:
[ERROR] [Help 1] http://cwiki.apache.org/confluence/display/MAVEN/MojoExecutionException
[ERROR]
[ERROR] After correcting the problems, you can resume the build with the command
[ERROR] mvn <goals> -rf :fontbox
[JENKINS] Archiving <https://ci-builds.apache.org/job/PDFBox/job/PDFBox-sonar2/ws/examples/pom.xml> to org.apache.pdfbox/pdfbox-examples/3.0.0-SNAPSHOT/pdfbox-examples-3.0.0-SNAPSHOT.pom
[JENKINS] Archiving <https://ci-builds.apache.org/job/PDFBox/job/PDFBox-sonar2/ws/parent/pom.xml> to org.apache.pdfbox/pdfbox-parent/3.0.0-SNAPSHOT/pdfbox-parent-3.0.0-SNAPSHOT.pom
[JENKINS] Archiving <https://ci-builds.apache.org/job/PDFBox/job/PDFBox-sonar2/ws/pdfbox/pom.xml> to org.apache.pdfbox/pdfbox/3.0.0-SNAPSHOT/pdfbox-3.0.0-SNAPSHOT.pom
[JENKINS] Archiving <https://ci-builds.apache.org/job/PDFBox/job/PDFBox-sonar2/ws/debugger-app/pom.xml> to org.apache.pdfbox/debugger-app/3.0.0-SNAPSHOT/debugger-app-3.0.0-SNAPSHOT.pom
[JENKINS] Archiving <https://ci-builds.apache.org/job/PDFBox/job/PDFBox-sonar2/ws/io/pom.xml> to org.apache.pdfbox/pdfbox-io/3.0.0-SNAPSHOT/pdfbox-io-3.0.0-SNAPSHOT.pom
[JENKINS] Archiving <https://ci-builds.apache.org/job/PDFBox/job/PDFBox-sonar2/ws/io/target/pdfbox-io-3.0.0-SNAPSHOT.jar> to org.apache.pdfbox/pdfbox-io/3.0.0-SNAPSHOT/pdfbox-io-3.0.0-SNAPSHOT.jar
[JENKINS] Archiving <https://ci-builds.apache.org/job/PDFBox/job/PDFBox-sonar2/ws/io/target/pdfbox-io-3.0.0-SNAPSHOT-sources.jar> to org.apache.pdfbox/pdfbox-io/3.0.0-SNAPSHOT/pdfbox-io-3.0.0-SNAPSHOT-sources.jar
[JENKINS] Archiving <https://ci-builds.apache.org/job/PDFBox/job/PDFBox-sonar2/ws/fontbox/pom.xml> to org.apache.pdfbox/fontbox/3.0.0-SNAPSHOT/fontbox-3.0.0-SNAPSHOT.pom
[JENKINS] Archiving <https://ci-builds.apache.org/job/PDFBox/job/PDFBox-sonar2/ws/xmpbox/pom.xml> to org.apache.pdfbox/xmpbox/3.0.0-SNAPSHOT/xmpbox-3.0.0-SNAPSHOT.pom
[JENKINS] Archiving <https://ci-builds.apache.org/job/PDFBox/job/PDFBox-sonar2/ws/tools/pom.xml> to org.apache.pdfbox/pdfbox-tools/3.0.0-SNAPSHOT/pdfbox-tools-3.0.0-SNAPSHOT.pom
[JENKINS] Archiving <https://ci-builds.apache.org/job/PDFBox/job/PDFBox-sonar2/ws/debugger/pom.xml> to org.apache.pdfbox/pdfbox-debugger/3.0.0-SNAPSHOT/pdfbox-debugger-3.0.0-SNAPSHOT.pom
[JENKINS] Archiving <https://ci-builds.apache.org/job/PDFBox/job/PDFBox-sonar2/ws/preflight-app/pom.xml> to org.apache.pdfbox/preflight-app/3.0.0-SNAPSHOT/preflight-app-3.0.0-SNAPSHOT.pom
[JENKINS] Archiving <https://ci-builds.apache.org/job/PDFBox/job/PDFBox-sonar2/ws/app/pom.xml> to org.apache.pdfbox/pdfbox-app/3.0.0-SNAPSHOT/pdfbox-app-3.0.0-SNAPSHOT.pom
[JENKINS] Archiving <https://ci-builds.apache.org/job/PDFBox/job/PDFBox-sonar2/ws/preflight/pom.xml> to org.apache.pdfbox/preflight/3.0.0-SNAPSHOT/preflight-3.0.0-SNAPSHOT.pom
[JENKINS] Archiving <https://ci-builds.apache.org/job/PDFBox/job/PDFBox-sonar2/ws/pom.xml> to org.apache.pdfbox/pdfbox-reactor/3.0.0-SNAPSHOT/pdfbox-reactor-3.0.0-SNAPSHOT.pom
No mail will be sent out, as 'PDFBox » PDFBox-sonar2 » Apache PDFBox examples #1052' does not have a result yet. Please make sure you set a proper result in case of pipeline/build scripts.
No mail will be sent out, as 'PDFBox » PDFBox-sonar2 » Apache PDFBox #1052' does not have a result yet. Please make sure you set a proper result in case of pipeline/build scripts.
No mail will be sent out, as 'PDFBox » PDFBox-sonar2 » Apache PDFBox Debugger application #1052' does not have a result yet. Please make sure you set a proper result in case of pipeline/build scripts.
Sending e-mails to: dev@pdfbox.apache.org
No mail will be sent out, as 'PDFBox » PDFBox-sonar2 » Apache XmpBox #1052' does not have a result yet. Please make sure you set a proper result in case of pipeline/build scripts.
No mail will be sent out, as 'PDFBox » PDFBox-sonar2 » Apache PDFBox tools #1052' does not have a result yet. Please make sure you set a proper result in case of pipeline/build scripts.
No mail will be sent out, as 'PDFBox » PDFBox-sonar2 » Apache PDFBox Debugger #1052' does not have a result yet. Please make sure you set a proper result in case of pipeline/build scripts.
No mail will be sent out, as 'PDFBox » PDFBox-sonar2 » Apache Preflight application #1052' does not have a result yet. Please make sure you set a proper result in case of pipeline/build scripts.
No mail will be sent out, as 'PDFBox » PDFBox-sonar2 » Apache PDFBox application #1052' does not have a result yet. Please make sure you set a proper result in case of pipeline/build scripts.
No mail will be sent out, as 'PDFBox » PDFBox-sonar2 » Apache Preflight #1052' does not have a result yet. Please make sure you set a proper result in case of pipeline/build scripts.
No mail will be sent out, as 'PDFBox » PDFBox-sonar2 » Apache PDFBox #1052' does not have a result yet. Please make sure you set a proper result in case of pipeline/build scripts.
channel stopped
---------------------------------------------------------------------
To unsubscribe, e-mail: dev-unsubscribe@pdfbox.apache.org
For additional commands, e-mail: dev-help@pdfbox.apache.org
Jenkins build is back to normal : PDFBox » PDFBox-sonar2 #1058
Posted by Apache Jenkins Server <je...@builds.apache.org>.
See <https://ci-builds.apache.org/job/PDFBox/job/PDFBox-sonar2/1058/display/redirect>
---------------------------------------------------------------------
To unsubscribe, e-mail: dev-unsubscribe@pdfbox.apache.org
For additional commands, e-mail: dev-help@pdfbox.apache.org
Build failed in Jenkins: PDFBox » PDFBox-sonar2 #1057
Posted by Apache Jenkins Server <je...@builds.apache.org>.
See <https://ci-builds.apache.org/job/PDFBox/job/PDFBox-sonar2/1057/display/redirect>
Changes:
------------------------------------------
[...truncated 30.13 KB...]
[INFO] Tests run: 22, Failures: 0, Errors: 0, Skipped: 0, Time elapsed: 0.047 s - in org.apache.xmpbox.schema.XMPMediaManagementTest
[INFO] Running org.apache.xmpbox.schema.XMPSchemaTest
[INFO] Tests run: 12, Failures: 0, Errors: 0, Skipped: 0, Time elapsed: 0.012 s - in org.apache.xmpbox.schema.XMPSchemaTest
[INFO] Running org.apache.xmpbox.schema.TestExifXmp
[INFO] Tests run: 2, Failures: 0, Errors: 0, Skipped: 0, Time elapsed: 0.198 s - in org.apache.xmpbox.schema.TestExifXmp
[INFO] Running org.apache.xmpbox.schema.AdobePDFTest
[INFO] Tests run: 8, Failures: 0, Errors: 0, Skipped: 0, Time elapsed: 0.015 s - in org.apache.xmpbox.schema.AdobePDFTest
[INFO] Running org.apache.xmpbox.schema.DublinCoreTest
[INFO] Tests run: 108, Failures: 0, Errors: 0, Skipped: 0, Time elapsed: 0.383 s - in org.apache.xmpbox.schema.DublinCoreTest
[INFO] Running org.apache.xmpbox.schema.PDFAIdentificationOthersTest
[INFO] Tests run: 3, Failures: 0, Errors: 0, Skipped: 0, Time elapsed: 0 s - in org.apache.xmpbox.schema.PDFAIdentificationOthersTest
[INFO] Running org.apache.xmpbox.schema.BasicJobTicketSchemaTest
[INFO] Tests run: 3, Failures: 0, Errors: 0, Skipped: 0, Time elapsed: 0.016 s - in org.apache.xmpbox.schema.BasicJobTicketSchemaTest
[INFO] Running org.apache.xmpbox.schema.PDFAIdentificationTest
[INFO] Tests run: 6, Failures: 0, Errors: 0, Skipped: 0, Time elapsed: 0.013 s - in org.apache.xmpbox.schema.PDFAIdentificationTest
[INFO] Running org.apache.xmpbox.schema.PhotoshopSchemaTest
[INFO] Tests run: 162, Failures: 0, Errors: 0, Skipped: 0, Time elapsed: 0.394 s - in org.apache.xmpbox.schema.PhotoshopSchemaTest
[INFO] Running org.apache.xmpbox.schema.XMPBasicTest
[INFO] Tests run: 22, Failures: 0, Errors: 0, Skipped: 0, Time elapsed: 0.033 s - in org.apache.xmpbox.schema.XMPBasicTest
[INFO] Running org.apache.xmpbox.schema.AdobePDFErrorsTest
[INFO] Tests run: 3, Failures: 0, Errors: 0, Skipped: 0, Time elapsed: 0.003 s - in org.apache.xmpbox.schema.AdobePDFErrorsTest
[INFO]
[INFO] Results:
[INFO]
[INFO] Tests run: 807, Failures: 0, Errors: 0, Skipped: 0
[INFO]
[JENKINS] Recording test results
[INFO]
[INFO] --- jacoco:0.8.10:report (report) @ xmpbox ---
[INFO] Loading execution data file <https://ci-builds.apache.org/job/PDFBox/job/PDFBox-sonar2/ws/xmpbox/target/jacoco.exec>
[INFO] Analyzed bundle 'Apache XmpBox' with 73 classes
[INFO]
[INFO] --- animal-sniffer:1.23:check (check-java-version) @ xmpbox ---
[INFO] Checking unresolved references to org.codehaus.mojo.signature:java18:1.0
[INFO]
[INFO] --- bundle:5.1.9:bundle (default-bundle) @ xmpbox ---
[INFO] Building bundle: <https://ci-builds.apache.org/job/PDFBox/job/PDFBox-sonar2/ws/xmpbox/target/xmpbox-3.0.0-SNAPSHOT.jar>
[INFO] Writing manifest: <https://ci-builds.apache.org/job/PDFBox/job/PDFBox-sonar2/ws/xmpbox/target/classes/META-INF/MANIFEST.MF>
[INFO]
[INFO] --- site:3.12.1:attach-descriptor (attach-descriptor) @ xmpbox ---
[INFO] Skipping because packaging 'bundle' is not pom.
[INFO]
[INFO] >>> source:3.2.1:jar (attach-sources) > generate-sources @ xmpbox >>>
[INFO]
[INFO] --- enforcer:3.3.0:enforce (default) @ xmpbox ---
[INFO]
[INFO] --- enforcer:3.3.0:enforce (enforce-maven-version) @ xmpbox ---
[INFO]
[INFO] --- enforcer:3.3.0:enforce (enforce-java-version) @ xmpbox ---
[INFO]
[INFO] --- jacoco:0.8.10:prepare-agent (default) @ xmpbox ---
[INFO] surefireArgLine set to -javaagent:/home/jenkins/.m2/repository/org/jacoco/org.jacoco.agent/0.8.10/org.jacoco.agent-0.8.10-runtime.jar=destfile=<https://ci-builds.apache.org/job/PDFBox/job/PDFBox-sonar2/ws/xmpbox/target/jacoco.exec>
[WARNING] Failed to getClass for org.apache.maven.plugins.source.SourceJarMojo
[INFO]
[INFO] <<< source:3.2.1:jar (attach-sources) < generate-sources @ xmpbox <<<
[INFO]
[INFO]
[INFO] --- source:3.2.1:jar (attach-sources) @ xmpbox ---
[INFO]
[INFO] ----------------------< org.apache.pdfbox:pdfbox >----------------------
[INFO] Building Apache PDFBox 3.0.0-SNAPSHOT [5/13]
[INFO] from pdfbox/pom.xml
[INFO] -------------------------------[ bundle ]-------------------------------
[INFO]
[INFO] --- enforcer:3.3.0:enforce (default) @ pdfbox ---
[INFO]
[INFO] --- enforcer:3.3.0:enforce (enforce-maven-version) @ pdfbox ---
[INFO]
[INFO] --- enforcer:3.3.0:enforce (enforce-java-version) @ pdfbox ---
[INFO]
[INFO] --- jacoco:0.8.10:prepare-agent (default) @ pdfbox ---
[INFO] surefireArgLine set to -javaagent:/home/jenkins/.m2/repository/org/jacoco/org.jacoco.agent/0.8.10/org.jacoco.agent-0.8.10-runtime.jar=destfile=<https://ci-builds.apache.org/job/PDFBox/job/PDFBox-sonar2/ws/pdfbox/target/jacoco.exec>
[INFO]
[INFO] --- remote-resources:1.7.0:process (process-resource-bundles) @ pdfbox ---
[INFO] Preparing remote bundle org.apache:apache-jar-resource-bundle:1.4
[INFO] Copying 3 resources from 1 bundle.
[INFO] Copying appended resource: META-INF/NOTICE
[INFO] Copying appended resource: META-INF/LICENSE
[INFO]
[INFO] --- resources:3.3.0:resources (default-resources) @ pdfbox ---
[INFO] Copying 1 resource
[INFO] Copying 21 resources
[INFO] Copying 3 resources
[INFO] The encoding used to copy filtered properties files have not been set. This means that the same encoding will be used to copy filtered properties files as when copying other filtered resources. This might not be what you want! Run your build with --debug to see which files might be affected. Read more at https://maven.apache.org/plugins/maven-resources-plugin/examples/filtering-properties-files.html
[INFO]
[INFO] --- compiler:3.10.1:compile (default-compile) @ pdfbox ---
[INFO] Changes detected - recompiling the module!
[INFO] Compiling 613 source files to <https://ci-builds.apache.org/job/PDFBox/job/PDFBox-sonar2/ws/pdfbox/target/classes>
[WARNING] <https://ci-builds.apache.org/job/PDFBox/job/PDFBox-sonar2/ws/pdfbox/src/main/java/org/apache/pdfbox/pdmodel/font/PDType3Font.java>:[202,18] getHeight(int) in org.apache.pdfbox.pdmodel.font.PDFontLike has been deprecated
[WARNING] <https://ci-builds.apache.org/job/PDFBox/job/PDFBox-sonar2/ws/pdfbox/src/main/java/org/apache/pdfbox/pdmodel/font/PDType0Font.java>:[468,18] getHeight(int) in org.apache.pdfbox.pdmodel.font.PDFontLike has been deprecated
[WARNING] <https://ci-builds.apache.org/job/PDFBox/job/PDFBox-sonar2/ws/pdfbox/src/main/java/org/apache/pdfbox/pdmodel/font/PDType0Font.java>:[470,30] getHeight(int) in org.apache.pdfbox.pdmodel.font.PDFontLike has been deprecated
[WARNING] <https://ci-builds.apache.org/job/PDFBox/job/PDFBox-sonar2/ws/pdfbox/src/main/java/org/apache/pdfbox/pdmodel/encryption/SecurityHandler.java>:[634,19] setValue(byte[]) in org.apache.pdfbox.cos.COSString has been deprecated
[WARNING] <https://ci-builds.apache.org/job/PDFBox/job/PDFBox-sonar2/ws/pdfbox/src/main/java/org/apache/pdfbox/pdmodel/encryption/SecurityHandler.java>:[657,15] setValue(byte[]) in org.apache.pdfbox.cos.COSString has been deprecated
[WARNING] <https://ci-builds.apache.org/job/PDFBox/job/PDFBox-sonar2/ws/pdfbox/src/main/java/org/apache/pdfbox/pdmodel/font/PDCIDFontType2.java>:[324,18] getHeight(int) in org.apache.pdfbox.pdmodel.font.PDFontLike has been deprecated
[WARNING] <https://ci-builds.apache.org/job/PDFBox/job/PDFBox-sonar2/ws/pdfbox/src/main/java/org/apache/pdfbox/pdmodel/font/PDType1CFont.java>:[368,18] getHeight(int) in org.apache.pdfbox.pdmodel.font.PDFontLike has been deprecated
[WARNING] <https://ci-builds.apache.org/job/PDFBox/job/PDFBox-sonar2/ws/pdfbox/src/main/java/org/apache/pdfbox/pdmodel/font/PDType1Font.java>:[377,18] getHeight(int) in org.apache.pdfbox.pdmodel.font.PDFontLike has been deprecated
[WARNING] <https://ci-builds.apache.org/job/PDFBox/job/PDFBox-sonar2/ws/pdfbox/src/main/java/org/apache/pdfbox/pdmodel/font/PDCIDFontType0.java>:[445,18] getHeight(int) in org.apache.pdfbox.pdmodel.font.PDFontLike has been deprecated
[WARNING] <https://ci-builds.apache.org/job/PDFBox/job/PDFBox-sonar2/ws/pdfbox/src/main/java/org/apache/pdfbox/pdmodel/font/PDTrueTypeFont.java>:[375,18] getHeight(int) in org.apache.pdfbox.pdmodel.font.PDFontLike has been deprecated
[INFO] <https://ci-builds.apache.org/job/PDFBox/job/PDFBox-sonar2/ws/pdfbox/src/main/java/org/apache/pdfbox/pdmodel/common/PDStream.java>: Some input files use unchecked or unsafe operations.
[INFO] <https://ci-builds.apache.org/job/PDFBox/job/PDFBox-sonar2/ws/pdfbox/src/main/java/org/apache/pdfbox/pdmodel/common/PDStream.java>: Recompile with -Xlint:unchecked for details.
[INFO]
[INFO] --- download:1.7.0:wget (PDFBOX-1031-1) @ pdfbox ---
[INFO] File already exist, skipping
[INFO]
[INFO] --- download:1.7.0:wget (PDFBOX-1031-2) @ pdfbox ---
[INFO] File already exist, skipping
[INFO]
[INFO] --- download:1.7.0:wget (PDFBOX-1065-1) @ pdfbox ---
[INFO] File already exist, skipping
[INFO]
[INFO] --- download:1.7.0:wget (PDFBOX-1065-2) @ pdfbox ---
[INFO] File already exist, skipping
[INFO]
[INFO] --- download:1.7.0:wget (PDFBOX-1100-1) @ pdfbox ---
[INFO] File already exist, skipping
[INFO]
[INFO] --- download:1.7.0:wget (PDFBOX-1100-2) @ pdfbox ---
[INFO] File already exist, skipping
[INFO]
[INFO] --- download:1.7.0:wget (PDFBOX-3208) @ pdfbox ---
[INFO] File already exist, skipping
[INFO]
[INFO] --- download:1.7.0:wget (PDFBOX-3656) @ pdfbox ---
[INFO] File already exist, skipping
[INFO]
[INFO] --- download:1.7.0:wget (PDFBOX-3682) @ pdfbox ---
[INFO] File already exist, skipping
[INFO]
[INFO] --- download:1.7.0:wget (PDFBOX-3940) @ pdfbox ---
[INFO] File already exist, skipping
[INFO]
[INFO] --- download:1.7.0:wget (PDFBOX-3783) @ pdfbox ---
[INFO] File already exist, skipping
[INFO]
[INFO] --- download:1.7.0:wget (PDFBOX-3785) @ pdfbox ---
[INFO] File already exist, skipping
[INFO]
[INFO] --- download:1.7.0:wget (PDFBOX-3947) @ pdfbox ---
[INFO] File already exist, skipping
[INFO]
[INFO] --- download:1.7.0:wget (PDFBOX-3948) @ pdfbox ---
[INFO] File already exist, skipping
[INFO]
[INFO] --- download:1.7.0:wget (PDFBOX-3949) @ pdfbox ---
[INFO] File already exist, skipping
[INFO]
[INFO] --- download:1.7.0:wget (PDFBOX-3950) @ pdfbox ---
[INFO] File already exist, skipping
[INFO]
[INFO] --- download:1.7.0:wget (PDFBOX-3951) @ pdfbox ---
[INFO] File already exist, skipping
[INFO]
[INFO] --- download:1.7.0:wget (PDFBOX-3964) @ pdfbox ---
[INFO] File already exist, skipping
[INFO]
[INFO] --- download:1.7.0:wget (PDFBOX-3977) @ pdfbox ---
[INFO] File already exist, skipping
[INFO]
[INFO] --- download:1.7.0:wget (Genko) @ pdfbox ---
[INFO] File already exist, skipping
[INFO]
[INFO] --- download:1.7.0:wget (PDFBOX-3999) @ pdfbox ---
[INFO] File already exist, skipping
[INFO]
[INFO] --- download:1.7.0:wget (PDFBOX-4106) @ pdfbox ---
[INFO] File already exist, skipping
[INFO]
[INFO] ------------------------------------------------------------------------
[INFO] Skipping Apache PDFBox
[INFO] This project has been banned from the build due to previous failures.
[INFO] ------------------------------------------------------------------------
[INFO] ------------------------------------------------------------------------
[INFO] Reactor Summary for Apache PDFBox 3.0.0-SNAPSHOT:
[INFO]
[INFO] PDFBox parent ...................................... SUCCESS [ 16.936 s]
[INFO] Apache PDFBox io ................................... SUCCESS [ 39.675 s]
[INFO] Apache FontBox ..................................... SUCCESS [ 26.193 s]
[INFO] Apache XmpBox ...................................... SUCCESS [ 14.513 s]
[INFO] Apache PDFBox ...................................... FAILURE [ 20.472 s]
[INFO] Apache Preflight ................................... SKIPPED
[INFO] Apache Preflight application ....................... SKIPPED
[INFO] Apache PDFBox Debugger ............................. SKIPPED
[INFO] Apache PDFBox tools ................................ SKIPPED
[INFO] Apache PDFBox application .......................... SKIPPED
[INFO] Apache PDFBox Debugger application ................. SKIPPED
[INFO] Apache PDFBox examples ............................. SKIPPED
[INFO] Apache PDFBox ...................................... SKIPPED
[INFO] ------------------------------------------------------------------------
[INFO] BUILD FAILURE
[INFO] ------------------------------------------------------------------------
[INFO] Total time: 02:33 min
[INFO] Finished at: 2023-06-08T18:59:32Z
[INFO] ------------------------------------------------------------------------
[WARNING]
[WARNING] Plugin validation issues were detected in 10 plugin(s)
[WARNING]
[WARNING] * org.apache.maven.plugins:maven-scm-plugin:1.13.0
[WARNING] * org.apache.maven.plugins:maven-source-plugin:3.2.1
[WARNING] * org.jacoco:jacoco-maven-plugin:0.8.10
[WARNING] * org.apache.maven.plugins:maven-site-plugin:3.12.1
[WARNING] * org.apache.felix:maven-bundle-plugin:5.1.9
[WARNING] * org.apache.maven.plugins:maven-compiler-plugin:3.10.1
[WARNING] * org.apache.maven.plugins:maven-remote-resources-plugin:1.7.0
[WARNING] * org.apache.maven.plugins:maven-surefire-plugin:2.22.2
[WARNING] * org.apache.maven.plugins:maven-resources-plugin:3.3.0
[WARNING] * org.codehaus.mojo:sonar-maven-plugin:3.9.1.2184
[WARNING]
[WARNING] For more or less details, use 'maven.plugin.validation' property with one of the values (case insensitive): [BRIEF, DEFAULT, VERBOSE]
[WARNING]
Waiting for Jenkins to finish collecting data
[ERROR] Failed to execute goal com.googlecode.maven-download-plugin:download-maven-plugin:1.7.0:wget (PDFBOX-4106) on project pdfbox: General error: Error while expanding <https://ci-builds.apache.org/job/PDFBox/job/PDFBox-sonar2/ws/pdfbox/target/fonts/ipag00303.zip>: Error on ZipFile <https://ci-builds.apache.org/job/PDFBox/job/PDFBox-sonar2/ws/pdfbox/target/fonts/ipag00303.zip>: Archive is not a ZIP archive -> [Help 1]
[ERROR]
[ERROR] To see the full stack trace of the errors, re-run Maven with the -e switch.
[ERROR] Re-run Maven using the -X switch to enable full debug logging.
[ERROR]
[ERROR] For more information about the errors and possible solutions, please read the following articles:
[ERROR] [Help 1] http://cwiki.apache.org/confluence/display/MAVEN/MojoExecutionException
[ERROR]
[ERROR] After correcting the problems, you can resume the build with the command
[ERROR] mvn <goals> -rf :pdfbox
[JENKINS] Archiving <https://ci-builds.apache.org/job/PDFBox/job/PDFBox-sonar2/ws/examples/pom.xml> to org.apache.pdfbox/pdfbox-examples/3.0.0-SNAPSHOT/pdfbox-examples-3.0.0-SNAPSHOT.pom
[JENKINS] Archiving <https://ci-builds.apache.org/job/PDFBox/job/PDFBox-sonar2/ws/parent/pom.xml> to org.apache.pdfbox/pdfbox-parent/3.0.0-SNAPSHOT/pdfbox-parent-3.0.0-SNAPSHOT.pom
[JENKINS] Archiving <https://ci-builds.apache.org/job/PDFBox/job/PDFBox-sonar2/ws/pdfbox/pom.xml> to org.apache.pdfbox/pdfbox/3.0.0-SNAPSHOT/pdfbox-3.0.0-SNAPSHOT.pom
[JENKINS] Archiving <https://ci-builds.apache.org/job/PDFBox/job/PDFBox-sonar2/ws/debugger-app/pom.xml> to org.apache.pdfbox/debugger-app/3.0.0-SNAPSHOT/debugger-app-3.0.0-SNAPSHOT.pom
[JENKINS] Archiving <https://ci-builds.apache.org/job/PDFBox/job/PDFBox-sonar2/ws/io/pom.xml> to org.apache.pdfbox/pdfbox-io/3.0.0-SNAPSHOT/pdfbox-io-3.0.0-SNAPSHOT.pom
[JENKINS] Archiving <https://ci-builds.apache.org/job/PDFBox/job/PDFBox-sonar2/ws/io/target/pdfbox-io-3.0.0-SNAPSHOT.jar> to org.apache.pdfbox/pdfbox-io/3.0.0-SNAPSHOT/pdfbox-io-3.0.0-SNAPSHOT.jar
[JENKINS] Archiving <https://ci-builds.apache.org/job/PDFBox/job/PDFBox-sonar2/ws/io/target/pdfbox-io-3.0.0-SNAPSHOT-sources.jar> to org.apache.pdfbox/pdfbox-io/3.0.0-SNAPSHOT/pdfbox-io-3.0.0-SNAPSHOT-sources.jar
[JENKINS] Archiving <https://ci-builds.apache.org/job/PDFBox/job/PDFBox-sonar2/ws/fontbox/pom.xml> to org.apache.pdfbox/fontbox/3.0.0-SNAPSHOT/fontbox-3.0.0-SNAPSHOT.pom
[JENKINS] Archiving <https://ci-builds.apache.org/job/PDFBox/job/PDFBox-sonar2/ws/fontbox/target/fontbox-3.0.0-SNAPSHOT.jar> to org.apache.pdfbox/fontbox/3.0.0-SNAPSHOT/fontbox-3.0.0-SNAPSHOT.jar
[JENKINS] Archiving <https://ci-builds.apache.org/job/PDFBox/job/PDFBox-sonar2/ws/fontbox/target/fontbox-3.0.0-SNAPSHOT-sources.jar> to org.apache.pdfbox/fontbox/3.0.0-SNAPSHOT/fontbox-3.0.0-SNAPSHOT-sources.jar
[JENKINS] Archiving <https://ci-builds.apache.org/job/PDFBox/job/PDFBox-sonar2/ws/xmpbox/pom.xml> to org.apache.pdfbox/xmpbox/3.0.0-SNAPSHOT/xmpbox-3.0.0-SNAPSHOT.pom
[JENKINS] Archiving <https://ci-builds.apache.org/job/PDFBox/job/PDFBox-sonar2/ws/xmpbox/target/xmpbox-3.0.0-SNAPSHOT.jar> to org.apache.pdfbox/xmpbox/3.0.0-SNAPSHOT/xmpbox-3.0.0-SNAPSHOT.jar
[JENKINS] Archiving <https://ci-builds.apache.org/job/PDFBox/job/PDFBox-sonar2/ws/xmpbox/target/xmpbox-3.0.0-SNAPSHOT-sources.jar> to org.apache.pdfbox/xmpbox/3.0.0-SNAPSHOT/xmpbox-3.0.0-SNAPSHOT-sources.jar
[JENKINS] Archiving <https://ci-builds.apache.org/job/PDFBox/job/PDFBox-sonar2/ws/tools/pom.xml> to org.apache.pdfbox/pdfbox-tools/3.0.0-SNAPSHOT/pdfbox-tools-3.0.0-SNAPSHOT.pom
[JENKINS] Archiving <https://ci-builds.apache.org/job/PDFBox/job/PDFBox-sonar2/ws/debugger/pom.xml> to org.apache.pdfbox/pdfbox-debugger/3.0.0-SNAPSHOT/pdfbox-debugger-3.0.0-SNAPSHOT.pom
[JENKINS] Archiving <https://ci-builds.apache.org/job/PDFBox/job/PDFBox-sonar2/ws/preflight-app/pom.xml> to org.apache.pdfbox/preflight-app/3.0.0-SNAPSHOT/preflight-app-3.0.0-SNAPSHOT.pom
[JENKINS] Archiving <https://ci-builds.apache.org/job/PDFBox/job/PDFBox-sonar2/ws/app/pom.xml> to org.apache.pdfbox/pdfbox-app/3.0.0-SNAPSHOT/pdfbox-app-3.0.0-SNAPSHOT.pom
[JENKINS] Archiving <https://ci-builds.apache.org/job/PDFBox/job/PDFBox-sonar2/ws/preflight/pom.xml> to org.apache.pdfbox/preflight/3.0.0-SNAPSHOT/preflight-3.0.0-SNAPSHOT.pom
[JENKINS] Archiving <https://ci-builds.apache.org/job/PDFBox/job/PDFBox-sonar2/ws/pom.xml> to org.apache.pdfbox/pdfbox-reactor/3.0.0-SNAPSHOT/pdfbox-reactor-3.0.0-SNAPSHOT.pom
No mail will be sent out, as 'PDFBox » PDFBox-sonar2 » Apache PDFBox examples #1057' does not have a result yet. Please make sure you set a proper result in case of pipeline/build scripts.
Sending e-mails to: dev@pdfbox.apache.org
No mail will be sent out, as 'PDFBox » PDFBox-sonar2 » Apache PDFBox Debugger application #1057' does not have a result yet. Please make sure you set a proper result in case of pipeline/build scripts.
No mail will be sent out, as 'PDFBox » PDFBox-sonar2 » Apache PDFBox tools #1057' does not have a result yet. Please make sure you set a proper result in case of pipeline/build scripts.
No mail will be sent out, as 'PDFBox » PDFBox-sonar2 » Apache PDFBox Debugger #1057' does not have a result yet. Please make sure you set a proper result in case of pipeline/build scripts.
No mail will be sent out, as 'PDFBox » PDFBox-sonar2 » Apache Preflight application #1057' does not have a result yet. Please make sure you set a proper result in case of pipeline/build scripts.
No mail will be sent out, as 'PDFBox » PDFBox-sonar2 » Apache PDFBox application #1057' does not have a result yet. Please make sure you set a proper result in case of pipeline/build scripts.
No mail will be sent out, as 'PDFBox » PDFBox-sonar2 » Apache Preflight #1057' does not have a result yet. Please make sure you set a proper result in case of pipeline/build scripts.
No mail will be sent out, as 'PDFBox » PDFBox-sonar2 » Apache PDFBox #1057' does not have a result yet. Please make sure you set a proper result in case of pipeline/build scripts.
channel stopped
---------------------------------------------------------------------
To unsubscribe, e-mail: dev-unsubscribe@pdfbox.apache.org
For additional commands, e-mail: dev-help@pdfbox.apache.org
Jenkins build is unstable: PDFBox » PDFBox-sonar2 #1056
Posted by Apache Jenkins Server <je...@builds.apache.org>.
See <https://ci-builds.apache.org/job/PDFBox/job/PDFBox-sonar2/1056/display/redirect>
---------------------------------------------------------------------
To unsubscribe, e-mail: dev-unsubscribe@pdfbox.apache.org
For additional commands, e-mail: dev-help@pdfbox.apache.org
Build failed in Jenkins: PDFBox » PDFBox-sonar2 #1055
Posted by Apache Jenkins Server <je...@builds.apache.org>.
See <https://ci-builds.apache.org/job/PDFBox/job/PDFBox-sonar2/1055/display/redirect>
Changes:
------------------------------------------
[...truncated 389.54 KB...]
08.06.2023 17:37:55 INFO text.TestTextStripper:239 - Preparing to parse sample_fonts_solidconvertor.pdf for sorted test
08.06.2023 17:37:55 WARN font.PDTrueTypeFont:142 - Using fallback font LiberationSans for Tahoma
08.06.2023 17:37:55 WARN font.PDTrueTypeFont:142 - Using fallback font LiberationSans for ArialNarrow
08.06.2023 17:37:55 WARN font.PDTrueTypeFont:142 - Using fallback font LiberationSans-Bold for ArialBlack
08.06.2023 17:37:55 WARN font.PDTrueTypeFont:142 - Using fallback font LiberationSans-Bold for ArialRoundedMTBold
08.06.2023 17:37:55 WARN font.PDFont:147 - Invalid ToUnicode CMap in font Verdana
08.06.2023 17:37:55 WARN font.PDFont:161 - Using predefined identity CMap instead
08.06.2023 17:37:55 WARN font.PDFont:147 - Invalid ToUnicode CMap in font MSReferenceSansSerif
08.06.2023 17:37:55 WARN font.PDFont:161 - Using predefined identity CMap instead
08.06.2023 17:37:55 INFO text.TestTextStripper:243 - Preparing to parse PDFBOX-3498-Y5TLCWTIAE3FYDVJTV2TXRZGXLEDUNSW.pdf for standard test
08.06.2023 17:37:56 WARN font.PDTrueTypeFont:142 - Using fallback font LiberationSerif for CourierNewPSMT
08.06.2023 17:37:56 INFO text.TestTextStripper:239 - Preparing to parse PDFBOX-3498-Y5TLCWTIAE3FYDVJTV2TXRZGXLEDUNSW.pdf for sorted test
08.06.2023 17:37:56 WARN font.PDTrueTypeFont:142 - Using fallback font LiberationSerif for CourierNewPSMT
08.06.2023 17:37:56 INFO text.TestTextStripper:243 - Preparing to parse PDFBOX-3195.pdf for standard test
08.06.2023 17:37:56 INFO text.TestTextStripper:239 - Preparing to parse PDFBOX-3195.pdf for sorted test
08.06.2023 17:37:56 WARN font.PDTrueTypeFont:142 - Using fallback font LiberationSerif for CourierNewPSMT
[INFO] Tests run: 3, Failures: 0, Errors: 0, Skipped: 0, Time elapsed: 8.338 s - in org.apache.pdfbox.text.TestTextStripper
08.06.2023 17:37:56 WARN font.PDTrueTypeFont:142 - Using fallback font LiberationSerif for CourierNewPSMT
08.06.2023 17:37:56 WARN pdmodel.PDDocument:1282 - do not call setAllSecurityToBeRemoved(true) before calling protect(), as protect() implies setAllSecurityToBeRemoved(false)
08.06.2023 17:37:57 WARN font.PDTrueTypeFont:142 - Using fallback font LiberationSerif for CourierNewPSMT
[INFO] Tests run: 5, Failures: 0, Errors: 0, Skipped: 0, Time elapsed: 9.4 s - in org.apache.pdfbox.rendering.TestQuality
[INFO] Tests run: 1, Failures: 0, Errors: 0, Skipped: 0, Time elapsed: 9.541 s - in org.apache.pdfbox.multipdf.PDFMergerUtilityTest
08.06.2023 17:38:00 WARN pdmodel.PDDocument:1282 - do not call setAllSecurityToBeRemoved(true) before calling protect(), as protect() implies setAllSecurityToBeRemoved(false)
08.06.2023 17:38:03 WARN pdmodel.PDDocument:1282 - do not call setAllSecurityToBeRemoved(true) before calling protect(), as protect() implies setAllSecurityToBeRemoved(false)
[INFO] Tests run: 1, Failures: 0, Errors: 0, Skipped: 0, Time elapsed: 16.596 s - in org.apache.pdfbox.filter.TestFilters
08.06.2023 17:38:06 WARN pdmodel.PDDocument:1282 - do not call setAllSecurityToBeRemoved(true) before calling protect(), as protect() implies setAllSecurityToBeRemoved(false)
[INFO] Tests run: 1, Failures: 0, Errors: 0, Skipped: 0, Time elapsed: 20.278 s - in org.apache.pdfbox.encryption.TestSymmetricKeyEncryption
[INFO]
[INFO] Results:
[INFO]
[WARNING] Tests run: 658, Failures: 0, Errors: 0, Skipped: 3
[INFO]
[JENKINS] Recording test results
[INFO]
[INFO] --- jacoco:0.8.10:report (report) @ pdfbox ---
[INFO] Loading execution data file <https://ci-builds.apache.org/job/PDFBox/job/PDFBox-sonar2/ws/pdfbox/target/jacoco.exec>
[INFO] Analyzed bundle 'Apache PDFBox' with 699 classes
[INFO]
[INFO] --- animal-sniffer:1.23:check (check-java-version) @ pdfbox ---
[INFO] Checking unresolved references to org.codehaus.mojo.signature:java18:1.0
[INFO]
[INFO] --- bundle:5.1.9:bundle (default-bundle) @ pdfbox ---
[INFO] Building bundle: <https://ci-builds.apache.org/job/PDFBox/job/PDFBox-sonar2/ws/pdfbox/target/pdfbox-3.0.0-SNAPSHOT.jar>
[INFO] Writing manifest: <https://ci-builds.apache.org/job/PDFBox/job/PDFBox-sonar2/ws/pdfbox/target/classes/META-INF/MANIFEST.MF>
[INFO]
[INFO] --- site:3.12.1:attach-descriptor (attach-descriptor) @ pdfbox ---
[INFO] Skipping because packaging 'bundle' is not pom.
[INFO]
[INFO] >>> source:3.2.1:jar (attach-sources) > generate-sources @ pdfbox >>>
[INFO]
[INFO] --- enforcer:3.3.0:enforce (default) @ pdfbox ---
[INFO]
[INFO] --- enforcer:3.3.0:enforce (enforce-maven-version) @ pdfbox ---
[INFO]
[INFO] --- enforcer:3.3.0:enforce (enforce-java-version) @ pdfbox ---
[INFO]
[INFO] --- jacoco:0.8.10:prepare-agent (default) @ pdfbox ---
[INFO] surefireArgLine set to -javaagent:/home/jenkins/.m2/repository/org/jacoco/org.jacoco.agent/0.8.10/org.jacoco.agent-0.8.10-runtime.jar=destfile=<https://ci-builds.apache.org/job/PDFBox/job/PDFBox-sonar2/ws/pdfbox/target/jacoco.exec>
[WARNING] Failed to getClass for org.apache.maven.plugins.source.SourceJarMojo
[INFO]
[INFO] <<< source:3.2.1:jar (attach-sources) < generate-sources @ pdfbox <<<
[INFO]
[INFO]
[INFO] --- source:3.2.1:jar (attach-sources) @ pdfbox ---
[INFO] Building jar: <https://ci-builds.apache.org/job/PDFBox/job/PDFBox-sonar2/ws/pdfbox/target/pdfbox-3.0.0-SNAPSHOT-sources.jar>
[INFO]
[INFO] --------------------< org.apache.pdfbox:preflight >---------------------
[INFO] Building Apache Preflight 3.0.0-SNAPSHOT [6/13]
[INFO] from preflight/pom.xml
[INFO] -------------------------------[ bundle ]-------------------------------
[INFO] Downloading from central: https://repo.maven.apache.org/maven2/commons-io/commons-io/2.13.0/commons-io-2.13.0.pom
[INFO] Downloaded from central: https://repo.maven.apache.org/maven2/commons-io/commons-io/2.13.0/commons-io-2.13.0.pom (20 kB at 178 kB/s)
[INFO] Downloading from central: https://repo.maven.apache.org/maven2/commons-io/commons-io/2.13.0/commons-io-2.13.0.jar
[INFO] Downloaded from central: https://repo.maven.apache.org/maven2/commons-io/commons-io/2.13.0/commons-io-2.13.0.jar (484 kB at 3.5 MB/s)
[INFO]
[INFO] --- enforcer:3.3.0:enforce (default) @ preflight ---
[INFO]
[INFO] --- enforcer:3.3.0:enforce (enforce-maven-version) @ preflight ---
[INFO]
[INFO] --- enforcer:3.3.0:enforce (enforce-java-version) @ preflight ---
[INFO]
[INFO] --- jacoco:0.8.10:prepare-agent (default) @ preflight ---
[INFO] surefireArgLine set to -javaagent:/home/jenkins/.m2/repository/org/jacoco/org.jacoco.agent/0.8.10/org.jacoco.agent-0.8.10-runtime.jar=destfile=<https://ci-builds.apache.org/job/PDFBox/job/PDFBox-sonar2/ws/preflight/target/jacoco.exec>
[INFO]
[INFO] --- remote-resources:1.7.0:process (process-resource-bundles) @ preflight ---
[INFO] Preparing remote bundle org.apache:apache-jar-resource-bundle:1.4
[INFO] Copying 3 resources from 1 bundle.
[INFO]
[INFO] --- resources:3.3.0:resources (default-resources) @ preflight ---
[INFO] skip non existing resourceDirectory <https://ci-builds.apache.org/job/PDFBox/job/PDFBox-sonar2/ws/preflight/src/main/resources>
[INFO] Copying 3 resources
[INFO]
[INFO] --- compiler:3.10.1:compile (default-compile) @ preflight ---
[INFO] Changes detected - recompiling the module!
[INFO] Compiling 116 source files to <https://ci-builds.apache.org/job/PDFBox/job/PDFBox-sonar2/ws/preflight/target/classes>
[INFO] <https://ci-builds.apache.org/job/PDFBox/job/PDFBox-sonar2/ws/preflight/src/main/java/org/apache/pdfbox/preflight/font/descriptor/FontDescriptorHelper.java>: <https://ci-builds.apache.org/job/PDFBox/job/PDFBox-sonar2/ws/preflight/src/main/java/org/apache/pdfbox/preflight/font/descriptor/FontDescriptorHelper.java> uses unchecked or unsafe operations.
[INFO] <https://ci-builds.apache.org/job/PDFBox/job/PDFBox-sonar2/ws/preflight/src/main/java/org/apache/pdfbox/preflight/font/descriptor/FontDescriptorHelper.java>: Recompile with -Xlint:unchecked for details.
[INFO]
[INFO] --- download:1.7.0:wget (get-isartor) @ preflight ---
[INFO]
[INFO] --- download:1.7.0:wget (get-bavaria) @ preflight ---
[ERROR]
java.net.SocketTimeoutException: Read timed out
at java.net.SocketInputStream.socketRead0 (Native Method)
at java.net.SocketInputStream.socketRead (SocketInputStream.java:115)
at java.net.SocketInputStream.read (SocketInputStream.java:168)
at java.net.SocketInputStream.read (SocketInputStream.java:140)
at sun.security.ssl.SSLSocketInputRecord.read (SSLSocketInputRecord.java:478)
at sun.security.ssl.SSLSocketInputRecord.readFully (SSLSocketInputRecord.java:461)
at sun.security.ssl.SSLSocketInputRecord.decodeInputRecord (SSLSocketInputRecord.java:243)
at sun.security.ssl.SSLSocketInputRecord.decode (SSLSocketInputRecord.java:181)
at sun.security.ssl.SSLTransport.decode (SSLTransport.java:111)
at sun.security.ssl.SSLSocketImpl.decode (SSLSocketImpl.java:1509)
at sun.security.ssl.SSLSocketImpl.readApplicationRecord (SSLSocketImpl.java:1476)
at sun.security.ssl.SSLSocketImpl$AppInputStream.read (SSLSocketImpl.java:1065)
at org.apache.http.impl.io.SessionInputBufferImpl.streamRead (SessionInputBufferImpl.java:137)
at org.apache.http.impl.io.SessionInputBufferImpl.read (SessionInputBufferImpl.java:197)
at org.apache.http.impl.io.ContentLengthInputStream.read (ContentLengthInputStream.java:176)
at org.apache.http.conn.EofSensorInputStream.read (EofSensorInputStream.java:135)
at org.apache.http.conn.EofSensorInputStream.read (EofSensorInputStream.java:148)
at com.googlecode.download.maven.plugin.internal.HttpFileRequester.handleResponse (HttpFileRequester.java:306)
at com.googlecode.download.maven.plugin.internal.HttpFileRequester.lambda$download$0 (HttpFileRequester.java:271)
at org.apache.http.impl.client.CloseableHttpClient.execute (CloseableHttpClient.java:223)
at org.apache.http.impl.client.CloseableHttpClient.execute (CloseableHttpClient.java:165)
at com.googlecode.download.maven.plugin.internal.HttpFileRequester.download (HttpFileRequester.java:271)
at com.googlecode.download.maven.plugin.internal.WGetMojo.doGet (WGetMojo.java:510)
at com.googlecode.download.maven.plugin.internal.WGetMojo.execute (WGetMojo.java:390)
at org.apache.maven.plugin.DefaultBuildPluginManager.executeMojo (DefaultBuildPluginManager.java:126)
at org.apache.maven.lifecycle.internal.MojoExecutor.doExecute2 (MojoExecutor.java:342)
at org.apache.maven.lifecycle.internal.MojoExecutor.doExecute (MojoExecutor.java:330)
at org.apache.maven.lifecycle.internal.MojoExecutor.execute (MojoExecutor.java:213)
at org.apache.maven.lifecycle.internal.MojoExecutor.execute (MojoExecutor.java:175)
at org.apache.maven.lifecycle.internal.MojoExecutor.access$000 (MojoExecutor.java:76)
at org.apache.maven.lifecycle.internal.MojoExecutor$1.run (MojoExecutor.java:163)
at org.apache.maven.plugin.DefaultMojosExecutionStrategy.execute (DefaultMojosExecutionStrategy.java:39)
at org.apache.maven.lifecycle.internal.MojoExecutor.execute (MojoExecutor.java:160)
at org.apache.maven.lifecycle.internal.LifecycleModuleBuilder.buildProject (LifecycleModuleBuilder.java:105)
at org.apache.maven.lifecycle.internal.LifecycleModuleBuilder.buildProject (LifecycleModuleBuilder.java:73)
at org.apache.maven.lifecycle.internal.builder.singlethreaded.SingleThreadedBuilder.build (SingleThreadedBuilder.java:53)
at org.apache.maven.lifecycle.internal.LifecycleStarter.execute (LifecycleStarter.java:118)
at org.apache.maven.DefaultMaven.doExecute (DefaultMaven.java:261)
at org.apache.maven.DefaultMaven.doExecute (DefaultMaven.java:173)
at org.apache.maven.DefaultMaven.execute (DefaultMaven.java:101)
at org.jvnet.hudson.maven3.launcher.Maven35Launcher.main (Maven35Launcher.java:138)
at jdk.internal.reflect.NativeMethodAccessorImpl.invoke0 (Native Method)
at jdk.internal.reflect.NativeMethodAccessorImpl.invoke (NativeMethodAccessorImpl.java:62)
at jdk.internal.reflect.DelegatingMethodAccessorImpl.invoke (DelegatingMethodAccessorImpl.java:43)
at java.lang.reflect.Method.invoke (Method.java:566)
at org.codehaus.plexus.classworlds.launcher.Launcher.launchEnhanced (Launcher.java:283)
at org.codehaus.plexus.classworlds.launcher.Launcher.launch (Launcher.java:226)
at jenkins.maven3.agent.Maven35Main.launch (Maven35Main.java:179)
at jdk.internal.reflect.NativeMethodAccessorImpl.invoke0 (Native Method)
at jdk.internal.reflect.NativeMethodAccessorImpl.invoke (NativeMethodAccessorImpl.java:62)
at jdk.internal.reflect.DelegatingMethodAccessorImpl.invoke (DelegatingMethodAccessorImpl.java:43)
at java.lang.reflect.Method.invoke (Method.java:566)
at hudson.maven.Maven3Builder.call (Maven3Builder.java:139)
at hudson.maven.Maven3Builder.call (Maven3Builder.java:70)
at hudson.remoting.UserRequest.perform (UserRequest.java:211)
at hudson.remoting.UserRequest.perform (UserRequest.java:54)
at hudson.remoting.Request$2.run (Request.java:377)
at hudson.remoting.InterceptingExecutorService.lambda$wrap$0 (InterceptingExecutorService.java:78)
at java.util.concurrent.FutureTask.run (FutureTask.java:264)
at java.util.concurrent.ThreadPoolExecutor.runWorker (ThreadPoolExecutor.java:1128)
at java.util.concurrent.ThreadPoolExecutor$Worker.run (ThreadPoolExecutor.java:628)
at java.lang.Thread.run (Thread.java:829)
[INFO]
[INFO] ------------------------------------------------------------------------
[INFO] Skipping Apache PDFBox
[INFO] This project has been banned from the build due to previous failures.
[INFO] ------------------------------------------------------------------------
[INFO] ------------------------------------------------------------------------
[INFO] Reactor Summary for Apache PDFBox 3.0.0-SNAPSHOT:
[INFO]
[INFO] PDFBox parent ...................................... SUCCESS [ 16.302 s]
[INFO] Apache PDFBox io ................................... SUCCESS [ 47.221 s]
[INFO] Apache FontBox ..................................... SUCCESS [ 28.191 s]
[INFO] Apache XmpBox ...................................... SUCCESS [ 16.780 s]
[INFO] Apache PDFBox ...................................... SUCCESS [01:26 min]
[INFO] Apache Preflight ................................... FAILURE [ 35.450 s]
[INFO] Apache Preflight application ....................... SKIPPED
[INFO] Apache PDFBox Debugger ............................. SKIPPED
[INFO] Apache PDFBox tools ................................ SKIPPED
[INFO] Apache PDFBox application .......................... SKIPPED
[INFO] Apache PDFBox Debugger application ................. SKIPPED
[INFO] Apache PDFBox examples ............................. SKIPPED
[INFO] Apache PDFBox ...................................... SKIPPED
[INFO] ------------------------------------------------------------------------
[INFO] BUILD FAILURE
[INFO] ------------------------------------------------------------------------
[INFO] Total time: 04:31 min
[INFO] Finished at: 2023-06-08T17:39:17Z
[INFO] ------------------------------------------------------------------------
[WARNING]
[WARNING] Plugin validation issues were detected in 10 plugin(s)
[WARNING]
[WARNING] * org.apache.maven.plugins:maven-scm-plugin:1.13.0
[WARNING] * org.apache.maven.plugins:maven-source-plugin:3.2.1
[WARNING] * org.jacoco:jacoco-maven-plugin:0.8.10
[WARNING] * org.apache.maven.plugins:maven-site-plugin:3.12.1
[WARNING] * org.apache.felix:maven-bundle-plugin:5.1.9
[WARNING] * org.apache.maven.plugins:maven-compiler-plugin:3.10.1
[WARNING] * org.apache.maven.plugins:maven-remote-resources-plugin:1.7.0
[WARNING] * org.apache.maven.plugins:maven-surefire-plugin:2.22.2
[WARNING] * org.apache.maven.plugins:maven-resources-plugin:3.3.0
[WARNING] * org.codehaus.mojo:sonar-maven-plugin:3.9.1.2184
[WARNING]
[WARNING] For more or less details, use 'maven.plugin.validation' property with one of the values (case insensitive): [BRIEF, DEFAULT, VERBOSE]
[WARNING]
Waiting for Jenkins to finish collecting data
[ERROR] Failed to execute goal com.googlecode.maven-download-plugin:download-maven-plugin:1.7.0:wget (get-bavaria) on project preflight: Read timed out -> [Help 1]
[ERROR]
[ERROR] To see the full stack trace of the errors, re-run Maven with the -e switch.
[ERROR] Re-run Maven using the -X switch to enable full debug logging.
[ERROR]
[ERROR] For more information about the errors and possible solutions, please read the following articles:
[ERROR] [Help 1] http://cwiki.apache.org/confluence/display/MAVEN/MojoExecutionException
[ERROR]
[ERROR] After correcting the problems, you can resume the build with the command
[ERROR] mvn <goals> -rf :preflight
[JENKINS] Archiving <https://ci-builds.apache.org/job/PDFBox/job/PDFBox-sonar2/ws/examples/pom.xml> to org.apache.pdfbox/pdfbox-examples/3.0.0-SNAPSHOT/pdfbox-examples-3.0.0-SNAPSHOT.pom
[JENKINS] Archiving <https://ci-builds.apache.org/job/PDFBox/job/PDFBox-sonar2/ws/parent/pom.xml> to org.apache.pdfbox/pdfbox-parent/3.0.0-SNAPSHOT/pdfbox-parent-3.0.0-SNAPSHOT.pom
[JENKINS] Archiving <https://ci-builds.apache.org/job/PDFBox/job/PDFBox-sonar2/ws/pdfbox/pom.xml> to org.apache.pdfbox/pdfbox/3.0.0-SNAPSHOT/pdfbox-3.0.0-SNAPSHOT.pom
[JENKINS] Archiving <https://ci-builds.apache.org/job/PDFBox/job/PDFBox-sonar2/ws/pdfbox/target/pdfbox-3.0.0-SNAPSHOT.jar> to org.apache.pdfbox/pdfbox/3.0.0-SNAPSHOT/pdfbox-3.0.0-SNAPSHOT.jar
[JENKINS] Archiving <https://ci-builds.apache.org/job/PDFBox/job/PDFBox-sonar2/ws/pdfbox/target/pdfbox-3.0.0-SNAPSHOT-sources.jar> to org.apache.pdfbox/pdfbox/3.0.0-SNAPSHOT/pdfbox-3.0.0-SNAPSHOT-sources.jar
[JENKINS] Archiving <https://ci-builds.apache.org/job/PDFBox/job/PDFBox-sonar2/ws/debugger-app/pom.xml> to org.apache.pdfbox/debugger-app/3.0.0-SNAPSHOT/debugger-app-3.0.0-SNAPSHOT.pom
[JENKINS] Archiving <https://ci-builds.apache.org/job/PDFBox/job/PDFBox-sonar2/ws/io/pom.xml> to org.apache.pdfbox/pdfbox-io/3.0.0-SNAPSHOT/pdfbox-io-3.0.0-SNAPSHOT.pom
[JENKINS] Archiving <https://ci-builds.apache.org/job/PDFBox/job/PDFBox-sonar2/ws/io/target/pdfbox-io-3.0.0-SNAPSHOT.jar> to org.apache.pdfbox/pdfbox-io/3.0.0-SNAPSHOT/pdfbox-io-3.0.0-SNAPSHOT.jar
[JENKINS] Archiving <https://ci-builds.apache.org/job/PDFBox/job/PDFBox-sonar2/ws/io/target/pdfbox-io-3.0.0-SNAPSHOT-sources.jar> to org.apache.pdfbox/pdfbox-io/3.0.0-SNAPSHOT/pdfbox-io-3.0.0-SNAPSHOT-sources.jar
[JENKINS] Archiving <https://ci-builds.apache.org/job/PDFBox/job/PDFBox-sonar2/ws/fontbox/pom.xml> to org.apache.pdfbox/fontbox/3.0.0-SNAPSHOT/fontbox-3.0.0-SNAPSHOT.pom
[JENKINS] Archiving <https://ci-builds.apache.org/job/PDFBox/job/PDFBox-sonar2/ws/fontbox/target/fontbox-3.0.0-SNAPSHOT.jar> to org.apache.pdfbox/fontbox/3.0.0-SNAPSHOT/fontbox-3.0.0-SNAPSHOT.jar
[JENKINS] Archiving <https://ci-builds.apache.org/job/PDFBox/job/PDFBox-sonar2/ws/fontbox/target/fontbox-3.0.0-SNAPSHOT-sources.jar> to org.apache.pdfbox/fontbox/3.0.0-SNAPSHOT/fontbox-3.0.0-SNAPSHOT-sources.jar
[JENKINS] Archiving <https://ci-builds.apache.org/job/PDFBox/job/PDFBox-sonar2/ws/xmpbox/pom.xml> to org.apache.pdfbox/xmpbox/3.0.0-SNAPSHOT/xmpbox-3.0.0-SNAPSHOT.pom
[JENKINS] Archiving <https://ci-builds.apache.org/job/PDFBox/job/PDFBox-sonar2/ws/xmpbox/target/xmpbox-3.0.0-SNAPSHOT.jar> to org.apache.pdfbox/xmpbox/3.0.0-SNAPSHOT/xmpbox-3.0.0-SNAPSHOT.jar
[JENKINS] Archiving <https://ci-builds.apache.org/job/PDFBox/job/PDFBox-sonar2/ws/xmpbox/target/xmpbox-3.0.0-SNAPSHOT-sources.jar> to org.apache.pdfbox/xmpbox/3.0.0-SNAPSHOT/xmpbox-3.0.0-SNAPSHOT-sources.jar
[JENKINS] Archiving <https://ci-builds.apache.org/job/PDFBox/job/PDFBox-sonar2/ws/tools/pom.xml> to org.apache.pdfbox/pdfbox-tools/3.0.0-SNAPSHOT/pdfbox-tools-3.0.0-SNAPSHOT.pom
[JENKINS] Archiving <https://ci-builds.apache.org/job/PDFBox/job/PDFBox-sonar2/ws/debugger/pom.xml> to org.apache.pdfbox/pdfbox-debugger/3.0.0-SNAPSHOT/pdfbox-debugger-3.0.0-SNAPSHOT.pom
[JENKINS] Archiving <https://ci-builds.apache.org/job/PDFBox/job/PDFBox-sonar2/ws/preflight-app/pom.xml> to org.apache.pdfbox/preflight-app/3.0.0-SNAPSHOT/preflight-app-3.0.0-SNAPSHOT.pom
[JENKINS] Archiving <https://ci-builds.apache.org/job/PDFBox/job/PDFBox-sonar2/ws/app/pom.xml> to org.apache.pdfbox/pdfbox-app/3.0.0-SNAPSHOT/pdfbox-app-3.0.0-SNAPSHOT.pom
[JENKINS] Archiving <https://ci-builds.apache.org/job/PDFBox/job/PDFBox-sonar2/ws/preflight/pom.xml> to org.apache.pdfbox/preflight/3.0.0-SNAPSHOT/preflight-3.0.0-SNAPSHOT.pom
[JENKINS] Archiving <https://ci-builds.apache.org/job/PDFBox/job/PDFBox-sonar2/ws/pom.xml> to org.apache.pdfbox/pdfbox-reactor/3.0.0-SNAPSHOT/pdfbox-reactor-3.0.0-SNAPSHOT.pom
No mail will be sent out, as 'PDFBox » PDFBox-sonar2 » Apache PDFBox examples #1055' does not have a result yet. Please make sure you set a proper result in case of pipeline/build scripts.
No mail will be sent out, as 'PDFBox » PDFBox-sonar2 » Apache PDFBox Debugger application #1055' does not have a result yet. Please make sure you set a proper result in case of pipeline/build scripts.
No mail will be sent out, as 'PDFBox » PDFBox-sonar2 » Apache PDFBox tools #1055' does not have a result yet. Please make sure you set a proper result in case of pipeline/build scripts.
No mail will be sent out, as 'PDFBox » PDFBox-sonar2 » Apache PDFBox Debugger #1055' does not have a result yet. Please make sure you set a proper result in case of pipeline/build scripts.
No mail will be sent out, as 'PDFBox » PDFBox-sonar2 » Apache Preflight application #1055' does not have a result yet. Please make sure you set a proper result in case of pipeline/build scripts.
No mail will be sent out, as 'PDFBox » PDFBox-sonar2 » Apache PDFBox application #1055' does not have a result yet. Please make sure you set a proper result in case of pipeline/build scripts.
Sending e-mails to: dev@pdfbox.apache.org
No mail will be sent out, as 'PDFBox » PDFBox-sonar2 » Apache PDFBox #1055' does not have a result yet. Please make sure you set a proper result in case of pipeline/build scripts.
channel stopped
---------------------------------------------------------------------
To unsubscribe, e-mail: dev-unsubscribe@pdfbox.apache.org
For additional commands, e-mail: dev-help@pdfbox.apache.org
Build failed in Jenkins: PDFBox » PDFBox-sonar2 #1054
Posted by Apache Jenkins Server <je...@builds.apache.org>.
See <https://ci-builds.apache.org/job/PDFBox/job/PDFBox-sonar2/1054/display/redirect>
Changes:
------------------------------------------
[...truncated 390.08 KB...]
08.06.2023 17:14:38 WARN cff.Type1CharString:170 - Unknown charstring command in glyph p of font UQDPRA+HelveticaNeueLTStd-Bd
08.06.2023 17:14:39 WARN cff.Type1CharString:170 - Unknown charstring command in glyph p of font UQDPRA+HelveticaNeueLTStd-Bd
08.06.2023 17:14:39 WARN cff.Type1CharString:170 - Unknown charstring command in glyph p of font UQDPRA+HelveticaNeueLTStd-Bd
08.06.2023 17:14:39 WARN cff.Type1CharString:170 - Unknown charstring command in glyph p of font UQDPRA+HelveticaNeueLTStd-Bd
08.06.2023 17:14:39 INFO rendering.TestPDFToImage:200 - Writing: <https://ci-builds.apache.org/job/PDFBox/job/PDFBox-sonar2/ws/pdfbox/target/test-output/flatten/out/PDFBOX-4889.pdf-1.png>
08.06.2023 17:14:39 WARN pdmodel.PDDocument:977 - You are overwriting the existing file pdfbox1341752921238321097.pdf, this will produce a corrupted file if you're also reading from it
08.06.2023 17:14:39 INFO rendering.TestPDFToImage:231 - Comparing: PDFBOX-4955.pdf
[INFO] Tests run: 17, Failures: 0, Errors: 0, Skipped: 0, Time elapsed: 6.014 s - in org.apache.pdfbox.pdmodel.graphics.image.LosslessFactoryTest
08.06.2023 17:14:39 WARN pdmodel.PDDocument:977 - You are overwriting the existing file pdfbox11224024762613157677.pdf, this will produce a corrupted file if you're also reading from it
08.06.2023 17:14:39 INFO rendering.TestPDFToImage:231 - Comparing: PDFBOX-4889.pdf
08.06.2023 17:14:39 INFO rendering.TestPDFToImage:285 - *** TEST OK *** for file: PDFBOX-4889.pdf-1.png
08.06.2023 17:14:39 INFO rendering.TestPDFToImage:286 - Deleting: PDFBOX-4889.pdf-1.png
08.06.2023 17:14:39 INFO rendering.TestPDFToImage:277 - *** TEST OK *** for file: PDFBOX-4955.pdf-1.png
08.06.2023 17:14:39 INFO rendering.TestPDFToImage:278 - Deleting: PDFBOX-4955.pdf-1.png
[INFO] Tests run: 2, Failures: 0, Errors: 0, Skipped: 0, Time elapsed: 6.32 s - in org.apache.pdfbox.pdmodel.interactive.form.PDAcroFormFlattenTest
08.06.2023 17:14:39 WARN font.PDTrueTypeFont:142 - Using fallback font LiberationSerif for CourierNewPSMT
08.06.2023 17:14:39 WARN pdmodel.PDDocument:977 - You are overwriting the existing file JpegMultiMergeTestResult.pdf, this will produce a corrupted file if you're also reading from it
08.06.2023 17:14:39 WARN font.PDTrueTypeFont:142 - Using fallback font LiberationSerif for CourierNewPSMT
08.06.2023 17:14:40 WARN font.PDTrueTypeFont:142 - Using fallback font LiberationSerif for CourierNewPSMT
08.06.2023 17:14:40 WARN font.PDTrueTypeFont:142 - Using fallback font LiberationSerif for CourierNewPSMT
08.06.2023 17:14:40 WARN pdmodel.PDDocument:1282 - do not call setAllSecurityToBeRemoved(true) before calling protect(), as protect() implies setAllSecurityToBeRemoved(false)
[INFO] Tests run: 3, Failures: 0, Errors: 0, Skipped: 0, Time elapsed: 7.978 s - in org.apache.pdfbox.multipdf.PDFMergerUtilityTest
[INFO] Tests run: 1, Failures: 0, Errors: 0, Skipped: 0, Time elapsed: 8.815 s - in org.apache.pdfbox.util.TestNumberFormatUtil
08.06.2023 17:14:42 WARN pdmodel.PDDocument:1282 - do not call setAllSecurityToBeRemoved(true) before calling protect(), as protect() implies setAllSecurityToBeRemoved(false)
08.06.2023 17:14:45 WARN pdmodel.PDDocument:1282 - do not call setAllSecurityToBeRemoved(true) before calling protect(), as protect() implies setAllSecurityToBeRemoved(false)
[INFO] Tests run: 1, Failures: 0, Errors: 0, Skipped: 0, Time elapsed: 13.454 s - in org.apache.pdfbox.encryption.TestSymmetricKeyEncryption
[INFO] Tests run: 1, Failures: 0, Errors: 0, Skipped: 0, Time elapsed: 15.138 s - in org.apache.pdfbox.filter.TestFilters
[INFO]
[INFO] Results:
[INFO]
[WARNING] Tests run: 658, Failures: 0, Errors: 0, Skipped: 3
[INFO]
[JENKINS] Recording test results
[INFO]
[INFO] --- jacoco:0.8.10:report (report) @ pdfbox ---
[INFO] Loading execution data file <https://ci-builds.apache.org/job/PDFBox/job/PDFBox-sonar2/ws/pdfbox/target/jacoco.exec>
[INFO] Analyzed bundle 'Apache PDFBox' with 699 classes
[INFO]
[INFO] --- animal-sniffer:1.23:check (check-java-version) @ pdfbox ---
[INFO] Checking unresolved references to org.codehaus.mojo.signature:java18:1.0
[INFO]
[INFO] --- bundle:5.1.9:bundle (default-bundle) @ pdfbox ---
[INFO] Building bundle: <https://ci-builds.apache.org/job/PDFBox/job/PDFBox-sonar2/ws/pdfbox/target/pdfbox-3.0.0-SNAPSHOT.jar>
[INFO] Writing manifest: <https://ci-builds.apache.org/job/PDFBox/job/PDFBox-sonar2/ws/pdfbox/target/classes/META-INF/MANIFEST.MF>
[INFO]
[INFO] --- site:3.12.1:attach-descriptor (attach-descriptor) @ pdfbox ---
[INFO] Skipping because packaging 'bundle' is not pom.
[INFO]
[INFO] >>> source:3.2.1:jar (attach-sources) > generate-sources @ pdfbox >>>
[INFO]
[INFO] --- enforcer:3.3.0:enforce (default) @ pdfbox ---
[INFO]
[INFO] --- enforcer:3.3.0:enforce (enforce-maven-version) @ pdfbox ---
[INFO]
[INFO] --- enforcer:3.3.0:enforce (enforce-java-version) @ pdfbox ---
[INFO]
[INFO] --- jacoco:0.8.10:prepare-agent (default) @ pdfbox ---
[INFO] surefireArgLine set to -javaagent:/home/jenkins/.m2/repository/org/jacoco/org.jacoco.agent/0.8.10/org.jacoco.agent-0.8.10-runtime.jar=destfile=<https://ci-builds.apache.org/job/PDFBox/job/PDFBox-sonar2/ws/pdfbox/target/jacoco.exec>
[WARNING] Failed to getClass for org.apache.maven.plugins.source.SourceJarMojo
[INFO]
[INFO] <<< source:3.2.1:jar (attach-sources) < generate-sources @ pdfbox <<<
[INFO]
[INFO]
[INFO] --- source:3.2.1:jar (attach-sources) @ pdfbox ---
[INFO] Building jar: <https://ci-builds.apache.org/job/PDFBox/job/PDFBox-sonar2/ws/pdfbox/target/pdfbox-3.0.0-SNAPSHOT-sources.jar>
[INFO]
[INFO] --------------------< org.apache.pdfbox:preflight >---------------------
[INFO] Building Apache Preflight 3.0.0-SNAPSHOT [6/13]
[INFO] from preflight/pom.xml
[INFO] -------------------------------[ bundle ]-------------------------------
[INFO] Downloading from central: https://repo.maven.apache.org/maven2/commons-io/commons-io/2.13.0/commons-io-2.13.0.pom
[INFO] Downloaded from central: https://repo.maven.apache.org/maven2/commons-io/commons-io/2.13.0/commons-io-2.13.0.pom (20 kB at 216 kB/s)
[INFO] Downloading from central: https://repo.maven.apache.org/maven2/commons-io/commons-io/2.13.0/commons-io-2.13.0.jar
[INFO] Downloaded from central: https://repo.maven.apache.org/maven2/commons-io/commons-io/2.13.0/commons-io-2.13.0.jar (484 kB at 1.4 MB/s)
[INFO]
[INFO] --- enforcer:3.3.0:enforce (default) @ preflight ---
[INFO]
[INFO] --- enforcer:3.3.0:enforce (enforce-maven-version) @ preflight ---
[INFO]
[INFO] --- enforcer:3.3.0:enforce (enforce-java-version) @ preflight ---
[INFO]
[INFO] --- jacoco:0.8.10:prepare-agent (default) @ preflight ---
[INFO] surefireArgLine set to -javaagent:/home/jenkins/.m2/repository/org/jacoco/org.jacoco.agent/0.8.10/org.jacoco.agent-0.8.10-runtime.jar=destfile=<https://ci-builds.apache.org/job/PDFBox/job/PDFBox-sonar2/ws/preflight/target/jacoco.exec>
[INFO]
[INFO] --- remote-resources:1.7.0:process (process-resource-bundles) @ preflight ---
[INFO] Preparing remote bundle org.apache:apache-jar-resource-bundle:1.4
[INFO] Copying 3 resources from 1 bundle.
[INFO]
[INFO] --- resources:3.3.0:resources (default-resources) @ preflight ---
[INFO] skip non existing resourceDirectory <https://ci-builds.apache.org/job/PDFBox/job/PDFBox-sonar2/ws/preflight/src/main/resources>
[INFO] Copying 3 resources
[INFO]
[INFO] --- compiler:3.10.1:compile (default-compile) @ preflight ---
[INFO] Changes detected - recompiling the module!
[INFO] Compiling 116 source files to <https://ci-builds.apache.org/job/PDFBox/job/PDFBox-sonar2/ws/preflight/target/classes>
[INFO] <https://ci-builds.apache.org/job/PDFBox/job/PDFBox-sonar2/ws/preflight/src/main/java/org/apache/pdfbox/preflight/font/descriptor/FontDescriptorHelper.java>: <https://ci-builds.apache.org/job/PDFBox/job/PDFBox-sonar2/ws/preflight/src/main/java/org/apache/pdfbox/preflight/font/descriptor/FontDescriptorHelper.java> uses unchecked or unsafe operations.
[INFO] <https://ci-builds.apache.org/job/PDFBox/job/PDFBox-sonar2/ws/preflight/src/main/java/org/apache/pdfbox/preflight/font/descriptor/FontDescriptorHelper.java>: Recompile with -Xlint:unchecked for details.
[INFO]
[INFO] --- download:1.7.0:wget (get-isartor) @ preflight ---
[INFO]
[INFO] --- download:1.7.0:wget (get-bavaria) @ preflight ---
[ERROR]
java.net.SocketException: Connection reset
at java.net.SocketInputStream.read (SocketInputStream.java:186)
at java.net.SocketInputStream.read (SocketInputStream.java:140)
at sun.security.ssl.SSLSocketInputRecord.read (SSLSocketInputRecord.java:478)
at sun.security.ssl.SSLSocketInputRecord.readFully (SSLSocketInputRecord.java:461)
at sun.security.ssl.SSLSocketInputRecord.decodeInputRecord (SSLSocketInputRecord.java:243)
at sun.security.ssl.SSLSocketInputRecord.decode (SSLSocketInputRecord.java:181)
at sun.security.ssl.SSLTransport.decode (SSLTransport.java:111)
at sun.security.ssl.SSLSocketImpl.decode (SSLSocketImpl.java:1509)
at sun.security.ssl.SSLSocketImpl.readApplicationRecord (SSLSocketImpl.java:1476)
at sun.security.ssl.SSLSocketImpl$AppInputStream.read (SSLSocketImpl.java:1065)
at org.apache.http.impl.io.SessionInputBufferImpl.streamRead (SessionInputBufferImpl.java:137)
at org.apache.http.impl.io.SessionInputBufferImpl.read (SessionInputBufferImpl.java:197)
at org.apache.http.impl.io.ContentLengthInputStream.read (ContentLengthInputStream.java:176)
at org.apache.http.conn.EofSensorInputStream.read (EofSensorInputStream.java:135)
at org.apache.http.conn.EofSensorInputStream.read (EofSensorInputStream.java:148)
at com.googlecode.download.maven.plugin.internal.HttpFileRequester.handleResponse (HttpFileRequester.java:306)
at com.googlecode.download.maven.plugin.internal.HttpFileRequester.lambda$download$0 (HttpFileRequester.java:271)
at org.apache.http.impl.client.CloseableHttpClient.execute (CloseableHttpClient.java:223)
at org.apache.http.impl.client.CloseableHttpClient.execute (CloseableHttpClient.java:165)
at com.googlecode.download.maven.plugin.internal.HttpFileRequester.download (HttpFileRequester.java:271)
at com.googlecode.download.maven.plugin.internal.WGetMojo.doGet (WGetMojo.java:510)
at com.googlecode.download.maven.plugin.internal.WGetMojo.execute (WGetMojo.java:390)
at org.apache.maven.plugin.DefaultBuildPluginManager.executeMojo (DefaultBuildPluginManager.java:126)
at org.apache.maven.lifecycle.internal.MojoExecutor.doExecute2 (MojoExecutor.java:342)
at org.apache.maven.lifecycle.internal.MojoExecutor.doExecute (MojoExecutor.java:330)
at org.apache.maven.lifecycle.internal.MojoExecutor.execute (MojoExecutor.java:213)
at org.apache.maven.lifecycle.internal.MojoExecutor.execute (MojoExecutor.java:175)
at org.apache.maven.lifecycle.internal.MojoExecutor.access$000 (MojoExecutor.java:76)
at org.apache.maven.lifecycle.internal.MojoExecutor$1.run (MojoExecutor.java:163)
at org.apache.maven.plugin.DefaultMojosExecutionStrategy.execute (DefaultMojosExecutionStrategy.java:39)
at org.apache.maven.lifecycle.internal.MojoExecutor.execute (MojoExecutor.java:160)
at org.apache.maven.lifecycle.internal.LifecycleModuleBuilder.buildProject (LifecycleModuleBuilder.java:105)
at org.apache.maven.lifecycle.internal.LifecycleModuleBuilder.buildProject (LifecycleModuleBuilder.java:73)
at org.apache.maven.lifecycle.internal.builder.singlethreaded.SingleThreadedBuilder.build (SingleThreadedBuilder.java:53)
at org.apache.maven.lifecycle.internal.LifecycleStarter.execute (LifecycleStarter.java:118)
at org.apache.maven.DefaultMaven.doExecute (DefaultMaven.java:261)
at org.apache.maven.DefaultMaven.doExecute (DefaultMaven.java:173)
at org.apache.maven.DefaultMaven.execute (DefaultMaven.java:101)
at org.jvnet.hudson.maven3.launcher.Maven35Launcher.main (Maven35Launcher.java:138)
at jdk.internal.reflect.NativeMethodAccessorImpl.invoke0 (Native Method)
at jdk.internal.reflect.NativeMethodAccessorImpl.invoke (NativeMethodAccessorImpl.java:62)
at jdk.internal.reflect.DelegatingMethodAccessorImpl.invoke (DelegatingMethodAccessorImpl.java:43)
at java.lang.reflect.Method.invoke (Method.java:566)
at org.codehaus.plexus.classworlds.launcher.Launcher.launchEnhanced (Launcher.java:283)
at org.codehaus.plexus.classworlds.launcher.Launcher.launch (Launcher.java:226)
at jenkins.maven3.agent.Maven35Main.launch (Maven35Main.java:179)
at jdk.internal.reflect.NativeMethodAccessorImpl.invoke0 (Native Method)
at jdk.internal.reflect.NativeMethodAccessorImpl.invoke (NativeMethodAccessorImpl.java:62)
at jdk.internal.reflect.DelegatingMethodAccessorImpl.invoke (DelegatingMethodAccessorImpl.java:43)
at java.lang.reflect.Method.invoke (Method.java:566)
at hudson.maven.Maven3Builder.call (Maven3Builder.java:139)
at hudson.maven.Maven3Builder.call (Maven3Builder.java:70)
at hudson.remoting.UserRequest.perform (UserRequest.java:211)
at hudson.remoting.UserRequest.perform (UserRequest.java:54)
at hudson.remoting.Request$2.run (Request.java:377)
at hudson.remoting.InterceptingExecutorService.lambda$wrap$0 (InterceptingExecutorService.java:78)
at java.util.concurrent.FutureTask.run (FutureTask.java:264)
at java.util.concurrent.ThreadPoolExecutor.runWorker (ThreadPoolExecutor.java:1128)
at java.util.concurrent.ThreadPoolExecutor$Worker.run (ThreadPoolExecutor.java:628)
at java.lang.Thread.run (Thread.java:829)
[INFO]
[INFO] ------------------------------------------------------------------------
[INFO] Skipping Apache PDFBox
[INFO] This project has been banned from the build due to previous failures.
[INFO] ------------------------------------------------------------------------
[INFO] ------------------------------------------------------------------------
[INFO] Reactor Summary for Apache PDFBox 3.0.0-SNAPSHOT:
[INFO]
[INFO] PDFBox parent ...................................... SUCCESS [ 18.297 s]
[INFO] Apache PDFBox io ................................... SUCCESS [ 48.572 s]
[INFO] Apache FontBox ..................................... SUCCESS [ 54.438 s]
[INFO] Apache XmpBox ...................................... SUCCESS [ 20.510 s]
[INFO] Apache PDFBox ...................................... SUCCESS [01:27 min]
[INFO] Apache Preflight ................................... FAILURE [ 22.953 s]
[INFO] Apache Preflight application ....................... SKIPPED
[INFO] Apache PDFBox Debugger ............................. SKIPPED
[INFO] Apache PDFBox tools ................................ SKIPPED
[INFO] Apache PDFBox application .......................... SKIPPED
[INFO] Apache PDFBox Debugger application ................. SKIPPED
[INFO] Apache PDFBox examples ............................. SKIPPED
[INFO] Apache PDFBox ...................................... SKIPPED
[INFO] ------------------------------------------------------------------------
[INFO] BUILD FAILURE
[INFO] ------------------------------------------------------------------------
[INFO] Total time: 04:55 min
[INFO] Finished at: 2023-06-08T17:15:42Z
[INFO] ------------------------------------------------------------------------
[WARNING]
[WARNING] Plugin validation issues were detected in 10 plugin(s)
[WARNING]
[WARNING] * org.apache.maven.plugins:maven-scm-plugin:1.13.0
[WARNING] * org.apache.maven.plugins:maven-source-plugin:3.2.1
[WARNING] * org.jacoco:jacoco-maven-plugin:0.8.10
[WARNING] * org.apache.maven.plugins:maven-site-plugin:3.12.1
[WARNING] * org.apache.felix:maven-bundle-plugin:5.1.9
[WARNING] * org.apache.maven.plugins:maven-compiler-plugin:3.10.1
[WARNING] * org.apache.maven.plugins:maven-remote-resources-plugin:1.7.0
[WARNING] * org.apache.maven.plugins:maven-surefire-plugin:2.22.2
[WARNING] * org.apache.maven.plugins:maven-resources-plugin:3.3.0
[WARNING] * org.codehaus.mojo:sonar-maven-plugin:3.9.1.2184
[WARNING]
[WARNING] For more or less details, use 'maven.plugin.validation' property with one of the values (case insensitive): [BRIEF, DEFAULT, VERBOSE]
[WARNING]
Waiting for Jenkins to finish collecting data
[ERROR] Failed to execute goal com.googlecode.maven-download-plugin:download-maven-plugin:1.7.0:wget (get-bavaria) on project preflight: Connection reset -> [Help 1]
[ERROR]
[ERROR] To see the full stack trace of the errors, re-run Maven with the -e switch.
[ERROR] Re-run Maven using the -X switch to enable full debug logging.
[ERROR]
[ERROR] For more information about the errors and possible solutions, please read the following articles:
[ERROR] [Help 1] http://cwiki.apache.org/confluence/display/MAVEN/MojoExecutionException
[ERROR]
[ERROR] After correcting the problems, you can resume the build with the command
[ERROR] mvn <goals> -rf :preflight
[JENKINS] Archiving <https://ci-builds.apache.org/job/PDFBox/job/PDFBox-sonar2/ws/examples/pom.xml> to org.apache.pdfbox/pdfbox-examples/3.0.0-SNAPSHOT/pdfbox-examples-3.0.0-SNAPSHOT.pom
[JENKINS] Archiving <https://ci-builds.apache.org/job/PDFBox/job/PDFBox-sonar2/ws/parent/pom.xml> to org.apache.pdfbox/pdfbox-parent/3.0.0-SNAPSHOT/pdfbox-parent-3.0.0-SNAPSHOT.pom
[JENKINS] Archiving <https://ci-builds.apache.org/job/PDFBox/job/PDFBox-sonar2/ws/pdfbox/pom.xml> to org.apache.pdfbox/pdfbox/3.0.0-SNAPSHOT/pdfbox-3.0.0-SNAPSHOT.pom
[JENKINS] Archiving <https://ci-builds.apache.org/job/PDFBox/job/PDFBox-sonar2/ws/pdfbox/target/pdfbox-3.0.0-SNAPSHOT.jar> to org.apache.pdfbox/pdfbox/3.0.0-SNAPSHOT/pdfbox-3.0.0-SNAPSHOT.jar
[JENKINS] Archiving <https://ci-builds.apache.org/job/PDFBox/job/PDFBox-sonar2/ws/pdfbox/target/pdfbox-3.0.0-SNAPSHOT-sources.jar> to org.apache.pdfbox/pdfbox/3.0.0-SNAPSHOT/pdfbox-3.0.0-SNAPSHOT-sources.jar
[JENKINS] Archiving <https://ci-builds.apache.org/job/PDFBox/job/PDFBox-sonar2/ws/debugger-app/pom.xml> to org.apache.pdfbox/debugger-app/3.0.0-SNAPSHOT/debugger-app-3.0.0-SNAPSHOT.pom
[JENKINS] Archiving <https://ci-builds.apache.org/job/PDFBox/job/PDFBox-sonar2/ws/io/pom.xml> to org.apache.pdfbox/pdfbox-io/3.0.0-SNAPSHOT/pdfbox-io-3.0.0-SNAPSHOT.pom
[JENKINS] Archiving <https://ci-builds.apache.org/job/PDFBox/job/PDFBox-sonar2/ws/io/target/pdfbox-io-3.0.0-SNAPSHOT.jar> to org.apache.pdfbox/pdfbox-io/3.0.0-SNAPSHOT/pdfbox-io-3.0.0-SNAPSHOT.jar
[JENKINS] Archiving <https://ci-builds.apache.org/job/PDFBox/job/PDFBox-sonar2/ws/io/target/pdfbox-io-3.0.0-SNAPSHOT-sources.jar> to org.apache.pdfbox/pdfbox-io/3.0.0-SNAPSHOT/pdfbox-io-3.0.0-SNAPSHOT-sources.jar
[JENKINS] Archiving <https://ci-builds.apache.org/job/PDFBox/job/PDFBox-sonar2/ws/fontbox/pom.xml> to org.apache.pdfbox/fontbox/3.0.0-SNAPSHOT/fontbox-3.0.0-SNAPSHOT.pom
[JENKINS] Archiving <https://ci-builds.apache.org/job/PDFBox/job/PDFBox-sonar2/ws/fontbox/target/fontbox-3.0.0-SNAPSHOT.jar> to org.apache.pdfbox/fontbox/3.0.0-SNAPSHOT/fontbox-3.0.0-SNAPSHOT.jar
[JENKINS] Archiving <https://ci-builds.apache.org/job/PDFBox/job/PDFBox-sonar2/ws/fontbox/target/fontbox-3.0.0-SNAPSHOT-sources.jar> to org.apache.pdfbox/fontbox/3.0.0-SNAPSHOT/fontbox-3.0.0-SNAPSHOT-sources.jar
[JENKINS] Archiving <https://ci-builds.apache.org/job/PDFBox/job/PDFBox-sonar2/ws/xmpbox/pom.xml> to org.apache.pdfbox/xmpbox/3.0.0-SNAPSHOT/xmpbox-3.0.0-SNAPSHOT.pom
[JENKINS] Archiving <https://ci-builds.apache.org/job/PDFBox/job/PDFBox-sonar2/ws/xmpbox/target/xmpbox-3.0.0-SNAPSHOT.jar> to org.apache.pdfbox/xmpbox/3.0.0-SNAPSHOT/xmpbox-3.0.0-SNAPSHOT.jar
[JENKINS] Archiving <https://ci-builds.apache.org/job/PDFBox/job/PDFBox-sonar2/ws/xmpbox/target/xmpbox-3.0.0-SNAPSHOT-sources.jar> to org.apache.pdfbox/xmpbox/3.0.0-SNAPSHOT/xmpbox-3.0.0-SNAPSHOT-sources.jar
[JENKINS] Archiving <https://ci-builds.apache.org/job/PDFBox/job/PDFBox-sonar2/ws/tools/pom.xml> to org.apache.pdfbox/pdfbox-tools/3.0.0-SNAPSHOT/pdfbox-tools-3.0.0-SNAPSHOT.pom
[JENKINS] Archiving <https://ci-builds.apache.org/job/PDFBox/job/PDFBox-sonar2/ws/debugger/pom.xml> to org.apache.pdfbox/pdfbox-debugger/3.0.0-SNAPSHOT/pdfbox-debugger-3.0.0-SNAPSHOT.pom
[JENKINS] Archiving <https://ci-builds.apache.org/job/PDFBox/job/PDFBox-sonar2/ws/preflight-app/pom.xml> to org.apache.pdfbox/preflight-app/3.0.0-SNAPSHOT/preflight-app-3.0.0-SNAPSHOT.pom
[JENKINS] Archiving <https://ci-builds.apache.org/job/PDFBox/job/PDFBox-sonar2/ws/app/pom.xml> to org.apache.pdfbox/pdfbox-app/3.0.0-SNAPSHOT/pdfbox-app-3.0.0-SNAPSHOT.pom
[JENKINS] Archiving <https://ci-builds.apache.org/job/PDFBox/job/PDFBox-sonar2/ws/preflight/pom.xml> to org.apache.pdfbox/preflight/3.0.0-SNAPSHOT/preflight-3.0.0-SNAPSHOT.pom
[JENKINS] Archiving <https://ci-builds.apache.org/job/PDFBox/job/PDFBox-sonar2/ws/pom.xml> to org.apache.pdfbox/pdfbox-reactor/3.0.0-SNAPSHOT/pdfbox-reactor-3.0.0-SNAPSHOT.pom
No mail will be sent out, as 'PDFBox » PDFBox-sonar2 » Apache PDFBox examples #1054' does not have a result yet. Please make sure you set a proper result in case of pipeline/build scripts.
Sending e-mails to: dev@pdfbox.apache.org
No mail will be sent out, as 'PDFBox » PDFBox-sonar2 » Apache PDFBox Debugger application #1054' does not have a result yet. Please make sure you set a proper result in case of pipeline/build scripts.
Sending e-mails to: dev@pdfbox.apache.org
No mail will be sent out, as 'PDFBox » PDFBox-sonar2 » Apache PDFBox tools #1054' does not have a result yet. Please make sure you set a proper result in case of pipeline/build scripts.
No mail will be sent out, as 'PDFBox » PDFBox-sonar2 » Apache PDFBox Debugger #1054' does not have a result yet. Please make sure you set a proper result in case of pipeline/build scripts.
No mail will be sent out, as 'PDFBox » PDFBox-sonar2 » Apache Preflight application #1054' does not have a result yet. Please make sure you set a proper result in case of pipeline/build scripts.
No mail will be sent out, as 'PDFBox » PDFBox-sonar2 » Apache PDFBox application #1054' does not have a result yet. Please make sure you set a proper result in case of pipeline/build scripts.
Sending e-mails to: dev@pdfbox.apache.org
No mail will be sent out, as 'PDFBox » PDFBox-sonar2 » Apache PDFBox #1054' does not have a result yet. Please make sure you set a proper result in case of pipeline/build scripts.
channel stopped
---------------------------------------------------------------------
To unsubscribe, e-mail: dev-unsubscribe@pdfbox.apache.org
For additional commands, e-mail: dev-help@pdfbox.apache.org
Build failed in Jenkins: PDFBox » PDFBox-sonar2 #1053
Posted by Apache Jenkins Server <je...@builds.apache.org>.
See <https://ci-builds.apache.org/job/PDFBox/job/PDFBox-sonar2/1053/display/redirect?page=changes>
Changes:
[Tilman Hausherr] PDFBOX-4892: fix redirected URL
------------------------------------------
[...truncated 36.24 KB...]
[INFO]
[INFO] --- enforcer:3.3.0:enforce (enforce-java-version) @ pdfbox ---
[INFO]
[INFO] --- jacoco:0.8.10:prepare-agent (default) @ pdfbox ---
[INFO] surefireArgLine set to -javaagent:/home/jenkins/.m2/repository/org/jacoco/org.jacoco.agent/0.8.10/org.jacoco.agent-0.8.10-runtime.jar=destfile=<https://ci-builds.apache.org/job/PDFBox/job/PDFBox-sonar2/ws/pdfbox/target/jacoco.exec>
[INFO]
[INFO] --- remote-resources:1.7.0:process (process-resource-bundles) @ pdfbox ---
[INFO] Preparing remote bundle org.apache:apache-jar-resource-bundle:1.4
[INFO] Copying 3 resources from 1 bundle.
[INFO] Copying appended resource: META-INF/NOTICE
[INFO] Copying appended resource: META-INF/LICENSE
[INFO]
[INFO] --- resources:3.3.0:resources (default-resources) @ pdfbox ---
[INFO] Copying 1 resource
[INFO] Copying 21 resources
[INFO] Copying 3 resources
[INFO] The encoding used to copy filtered properties files have not been set. This means that the same encoding will be used to copy filtered properties files as when copying other filtered resources. This might not be what you want! Run your build with --debug to see which files might be affected. Read more at https://maven.apache.org/plugins/maven-resources-plugin/examples/filtering-properties-files.html
[INFO]
[INFO] --- compiler:3.10.1:compile (default-compile) @ pdfbox ---
[INFO] Changes detected - recompiling the module!
[INFO] Compiling 613 source files to <https://ci-builds.apache.org/job/PDFBox/job/PDFBox-sonar2/ws/pdfbox/target/classes>
[WARNING] <https://ci-builds.apache.org/job/PDFBox/job/PDFBox-sonar2/ws/pdfbox/src/main/java/org/apache/pdfbox/pdmodel/font/PDType0Font.java>:[468,18] getHeight(int) in org.apache.pdfbox.pdmodel.font.PDFontLike has been deprecated
[WARNING] <https://ci-builds.apache.org/job/PDFBox/job/PDFBox-sonar2/ws/pdfbox/src/main/java/org/apache/pdfbox/pdmodel/font/PDType0Font.java>:[470,30] getHeight(int) in org.apache.pdfbox.pdmodel.font.PDFontLike has been deprecated
[WARNING] <https://ci-builds.apache.org/job/PDFBox/job/PDFBox-sonar2/ws/pdfbox/src/main/java/org/apache/pdfbox/pdmodel/encryption/SecurityHandler.java>:[634,19] setValue(byte[]) in org.apache.pdfbox.cos.COSString has been deprecated
[WARNING] <https://ci-builds.apache.org/job/PDFBox/job/PDFBox-sonar2/ws/pdfbox/src/main/java/org/apache/pdfbox/pdmodel/encryption/SecurityHandler.java>:[657,15] setValue(byte[]) in org.apache.pdfbox.cos.COSString has been deprecated
[WARNING] <https://ci-builds.apache.org/job/PDFBox/job/PDFBox-sonar2/ws/pdfbox/src/main/java/org/apache/pdfbox/pdmodel/font/PDType3Font.java>:[202,18] getHeight(int) in org.apache.pdfbox.pdmodel.font.PDFontLike has been deprecated
[WARNING] <https://ci-builds.apache.org/job/PDFBox/job/PDFBox-sonar2/ws/pdfbox/src/main/java/org/apache/pdfbox/pdmodel/font/PDCIDFontType0.java>:[445,18] getHeight(int) in org.apache.pdfbox.pdmodel.font.PDFontLike has been deprecated
[WARNING] <https://ci-builds.apache.org/job/PDFBox/job/PDFBox-sonar2/ws/pdfbox/src/main/java/org/apache/pdfbox/pdmodel/font/PDType1CFont.java>:[368,18] getHeight(int) in org.apache.pdfbox.pdmodel.font.PDFontLike has been deprecated
[WARNING] <https://ci-builds.apache.org/job/PDFBox/job/PDFBox-sonar2/ws/pdfbox/src/main/java/org/apache/pdfbox/pdmodel/font/PDType1Font.java>:[377,18] getHeight(int) in org.apache.pdfbox.pdmodel.font.PDFontLike has been deprecated
[WARNING] <https://ci-builds.apache.org/job/PDFBox/job/PDFBox-sonar2/ws/pdfbox/src/main/java/org/apache/pdfbox/pdmodel/font/PDCIDFontType2.java>:[324,18] getHeight(int) in org.apache.pdfbox.pdmodel.font.PDFontLike has been deprecated
[WARNING] <https://ci-builds.apache.org/job/PDFBox/job/PDFBox-sonar2/ws/pdfbox/src/main/java/org/apache/pdfbox/pdmodel/font/PDTrueTypeFont.java>:[375,18] getHeight(int) in org.apache.pdfbox.pdmodel.font.PDFontLike has been deprecated
[INFO] <https://ci-builds.apache.org/job/PDFBox/job/PDFBox-sonar2/ws/pdfbox/src/main/java/org/apache/pdfbox/pdmodel/common/PDStream.java>: Some input files use unchecked or unsafe operations.
[INFO] <https://ci-builds.apache.org/job/PDFBox/job/PDFBox-sonar2/ws/pdfbox/src/main/java/org/apache/pdfbox/pdmodel/common/PDStream.java>: Recompile with -Xlint:unchecked for details.
[INFO]
[INFO] --- download:1.7.0:wget (PDFBOX-1031-1) @ pdfbox ---
[WARNING] Error while reading from cache /home/jenkins/.m2/repository/.cache/download-maven-plugin/index.ser
[WARNING] Error while reading from cache /home/jenkins/.m2/repository/.cache/download-maven-plugin/index.ser
[WARNING] Error while reading from cache /home/jenkins/.m2/repository/.cache/download-maven-plugin/index.ser
[WARNING] Error while reading from cache /home/jenkins/.m2/repository/.cache/download-maven-plugin/index.ser
[INFO]
[INFO] --- download:1.7.0:wget (PDFBOX-1031-2) @ pdfbox ---
[WARNING] Error while reading from cache /home/jenkins/.m2/repository/.cache/download-maven-plugin/index.ser
[WARNING] Error while reading from cache /home/jenkins/.m2/repository/.cache/download-maven-plugin/index.ser
[WARNING] Error while reading from cache /home/jenkins/.m2/repository/.cache/download-maven-plugin/index.ser
[WARNING] Error while reading from cache /home/jenkins/.m2/repository/.cache/download-maven-plugin/index.ser
[INFO]
[INFO] --- download:1.7.0:wget (PDFBOX-1065-1) @ pdfbox ---
[WARNING] Error while reading from cache /home/jenkins/.m2/repository/.cache/download-maven-plugin/index.ser
[WARNING] Error while reading from cache /home/jenkins/.m2/repository/.cache/download-maven-plugin/index.ser
[WARNING] Error while reading from cache /home/jenkins/.m2/repository/.cache/download-maven-plugin/index.ser
[WARNING] Error while reading from cache /home/jenkins/.m2/repository/.cache/download-maven-plugin/index.ser
[INFO]
[INFO] --- download:1.7.0:wget (PDFBOX-1065-2) @ pdfbox ---
[WARNING] Error while reading from cache /home/jenkins/.m2/repository/.cache/download-maven-plugin/index.ser
[WARNING] Error while reading from cache /home/jenkins/.m2/repository/.cache/download-maven-plugin/index.ser
[WARNING] Error while reading from cache /home/jenkins/.m2/repository/.cache/download-maven-plugin/index.ser
[WARNING] Error while reading from cache /home/jenkins/.m2/repository/.cache/download-maven-plugin/index.ser
[INFO]
[INFO] --- download:1.7.0:wget (PDFBOX-1100-1) @ pdfbox ---
[WARNING] Error while reading from cache /home/jenkins/.m2/repository/.cache/download-maven-plugin/index.ser
[WARNING] Error while reading from cache /home/jenkins/.m2/repository/.cache/download-maven-plugin/index.ser
[WARNING] Error while reading from cache /home/jenkins/.m2/repository/.cache/download-maven-plugin/index.ser
[WARNING] Error while reading from cache /home/jenkins/.m2/repository/.cache/download-maven-plugin/index.ser
[INFO]
[INFO] --- download:1.7.0:wget (PDFBOX-1100-2) @ pdfbox ---
[WARNING] Error while reading from cache /home/jenkins/.m2/repository/.cache/download-maven-plugin/index.ser
[WARNING] Error while reading from cache /home/jenkins/.m2/repository/.cache/download-maven-plugin/index.ser
[WARNING] Error while reading from cache /home/jenkins/.m2/repository/.cache/download-maven-plugin/index.ser
[WARNING] Error while reading from cache /home/jenkins/.m2/repository/.cache/download-maven-plugin/index.ser
[INFO]
[INFO] --- download:1.7.0:wget (PDFBOX-3208) @ pdfbox ---
[WARNING] Error while reading from cache /home/jenkins/.m2/repository/.cache/download-maven-plugin/index.ser
[WARNING] Error while reading from cache /home/jenkins/.m2/repository/.cache/download-maven-plugin/index.ser
[WARNING] Error while reading from cache /home/jenkins/.m2/repository/.cache/download-maven-plugin/index.ser
[WARNING] Error while reading from cache /home/jenkins/.m2/repository/.cache/download-maven-plugin/index.ser
[INFO]
[INFO] --- download:1.7.0:wget (PDFBOX-3656) @ pdfbox ---
[WARNING] Error while reading from cache /home/jenkins/.m2/repository/.cache/download-maven-plugin/index.ser
[WARNING] Error while reading from cache /home/jenkins/.m2/repository/.cache/download-maven-plugin/index.ser
[WARNING] Error while reading from cache /home/jenkins/.m2/repository/.cache/download-maven-plugin/index.ser
[WARNING] Error while reading from cache /home/jenkins/.m2/repository/.cache/download-maven-plugin/index.ser
[INFO]
[INFO] --- download:1.7.0:wget (PDFBOX-3682) @ pdfbox ---
[WARNING] Error while reading from cache /home/jenkins/.m2/repository/.cache/download-maven-plugin/index.ser
[WARNING] Error while reading from cache /home/jenkins/.m2/repository/.cache/download-maven-plugin/index.ser
[WARNING] Error while reading from cache /home/jenkins/.m2/repository/.cache/download-maven-plugin/index.ser
[WARNING] Error while reading from cache /home/jenkins/.m2/repository/.cache/download-maven-plugin/index.ser
[INFO]
[INFO] --- download:1.7.0:wget (PDFBOX-3940) @ pdfbox ---
[WARNING] Error while reading from cache /home/jenkins/.m2/repository/.cache/download-maven-plugin/index.ser
[WARNING] Error while reading from cache /home/jenkins/.m2/repository/.cache/download-maven-plugin/index.ser
[WARNING] Error while reading from cache /home/jenkins/.m2/repository/.cache/download-maven-plugin/index.ser
[WARNING] Error while reading from cache /home/jenkins/.m2/repository/.cache/download-maven-plugin/index.ser
[INFO]
[INFO] --- download:1.7.0:wget (PDFBOX-3783) @ pdfbox ---
[WARNING] Error while reading from cache /home/jenkins/.m2/repository/.cache/download-maven-plugin/index.ser
[WARNING] Error while reading from cache /home/jenkins/.m2/repository/.cache/download-maven-plugin/index.ser
[WARNING] Error while reading from cache /home/jenkins/.m2/repository/.cache/download-maven-plugin/index.ser
[WARNING] Error while reading from cache /home/jenkins/.m2/repository/.cache/download-maven-plugin/index.ser
[INFO]
[INFO] --- download:1.7.0:wget (PDFBOX-3785) @ pdfbox ---
[WARNING] Error while reading from cache /home/jenkins/.m2/repository/.cache/download-maven-plugin/index.ser
[WARNING] Error while reading from cache /home/jenkins/.m2/repository/.cache/download-maven-plugin/index.ser
[WARNING] Error while reading from cache /home/jenkins/.m2/repository/.cache/download-maven-plugin/index.ser
[WARNING] Error while reading from cache /home/jenkins/.m2/repository/.cache/download-maven-plugin/index.ser
[INFO]
[INFO] --- download:1.7.0:wget (PDFBOX-3947) @ pdfbox ---
[WARNING] Error while reading from cache /home/jenkins/.m2/repository/.cache/download-maven-plugin/index.ser
[WARNING] Error while reading from cache /home/jenkins/.m2/repository/.cache/download-maven-plugin/index.ser
[WARNING] Error while reading from cache /home/jenkins/.m2/repository/.cache/download-maven-plugin/index.ser
[WARNING] Error while reading from cache /home/jenkins/.m2/repository/.cache/download-maven-plugin/index.ser
[INFO]
[INFO] --- download:1.7.0:wget (PDFBOX-3948) @ pdfbox ---
[WARNING] Error while reading from cache /home/jenkins/.m2/repository/.cache/download-maven-plugin/index.ser
[WARNING] Error while reading from cache /home/jenkins/.m2/repository/.cache/download-maven-plugin/index.ser
[WARNING] Error while reading from cache /home/jenkins/.m2/repository/.cache/download-maven-plugin/index.ser
[WARNING] Error while reading from cache /home/jenkins/.m2/repository/.cache/download-maven-plugin/index.ser
[INFO]
[INFO] --- download:1.7.0:wget (PDFBOX-3949) @ pdfbox ---
[WARNING] Error while reading from cache /home/jenkins/.m2/repository/.cache/download-maven-plugin/index.ser
[WARNING] Error while reading from cache /home/jenkins/.m2/repository/.cache/download-maven-plugin/index.ser
[WARNING] Error while reading from cache /home/jenkins/.m2/repository/.cache/download-maven-plugin/index.ser
[WARNING] Error while reading from cache /home/jenkins/.m2/repository/.cache/download-maven-plugin/index.ser
[INFO]
[INFO] --- download:1.7.0:wget (PDFBOX-3950) @ pdfbox ---
[WARNING] Error while reading from cache /home/jenkins/.m2/repository/.cache/download-maven-plugin/index.ser
[WARNING] Error while reading from cache /home/jenkins/.m2/repository/.cache/download-maven-plugin/index.ser
[WARNING] Error while reading from cache /home/jenkins/.m2/repository/.cache/download-maven-plugin/index.ser
[WARNING] Error while reading from cache /home/jenkins/.m2/repository/.cache/download-maven-plugin/index.ser
[INFO]
[INFO] --- download:1.7.0:wget (PDFBOX-3951) @ pdfbox ---
[WARNING] Error while reading from cache /home/jenkins/.m2/repository/.cache/download-maven-plugin/index.ser
[WARNING] Error while reading from cache /home/jenkins/.m2/repository/.cache/download-maven-plugin/index.ser
[WARNING] Error while reading from cache /home/jenkins/.m2/repository/.cache/download-maven-plugin/index.ser
[WARNING] Error while reading from cache /home/jenkins/.m2/repository/.cache/download-maven-plugin/index.ser
[INFO]
[INFO] --- download:1.7.0:wget (PDFBOX-3964) @ pdfbox ---
[WARNING] Error while reading from cache /home/jenkins/.m2/repository/.cache/download-maven-plugin/index.ser
[WARNING] Error while reading from cache /home/jenkins/.m2/repository/.cache/download-maven-plugin/index.ser
[WARNING] Error while reading from cache /home/jenkins/.m2/repository/.cache/download-maven-plugin/index.ser
[WARNING] Error while reading from cache /home/jenkins/.m2/repository/.cache/download-maven-plugin/index.ser
[INFO]
[INFO] --- download:1.7.0:wget (PDFBOX-3977) @ pdfbox ---
[WARNING] Error while reading from cache /home/jenkins/.m2/repository/.cache/download-maven-plugin/index.ser
[WARNING] Error while reading from cache /home/jenkins/.m2/repository/.cache/download-maven-plugin/index.ser
[WARNING] Error while reading from cache /home/jenkins/.m2/repository/.cache/download-maven-plugin/index.ser
[WARNING] Error while reading from cache /home/jenkins/.m2/repository/.cache/download-maven-plugin/index.ser
[INFO]
[INFO] --- download:1.7.0:wget (Genko) @ pdfbox ---
[WARNING] Error while reading from cache /home/jenkins/.m2/repository/.cache/download-maven-plugin/index.ser
[WARNING] Error while reading from cache /home/jenkins/.m2/repository/.cache/download-maven-plugin/index.ser
[WARNING] Error while reading from cache /home/jenkins/.m2/repository/.cache/download-maven-plugin/index.ser
[WARNING] Error while reading from cache /home/jenkins/.m2/repository/.cache/download-maven-plugin/index.ser
[INFO]
[INFO] --- download:1.7.0:wget (PDFBOX-3999) @ pdfbox ---
[WARNING] Error while reading from cache /home/jenkins/.m2/repository/.cache/download-maven-plugin/index.ser
[WARNING] Error while reading from cache /home/jenkins/.m2/repository/.cache/download-maven-plugin/index.ser
[WARNING] Error while reading from cache /home/jenkins/.m2/repository/.cache/download-maven-plugin/index.ser
[WARNING] Error while reading from cache /home/jenkins/.m2/repository/.cache/download-maven-plugin/index.ser
[INFO]
[INFO] --- download:1.7.0:wget (PDFBOX-4106) @ pdfbox ---
[WARNING] Error while reading from cache /home/jenkins/.m2/repository/.cache/download-maven-plugin/index.ser
[WARNING] Error while reading from cache /home/jenkins/.m2/repository/.cache/download-maven-plugin/index.ser
[WARNING] Error while reading from cache /home/jenkins/.m2/repository/.cache/download-maven-plugin/index.ser
[WARNING] Could not load index cache index file, it will be rewritten.
[INFO]
[INFO] ------------------------------------------------------------------------
[INFO] Skipping Apache PDFBox
[INFO] This project has been banned from the build due to previous failures.
[INFO] ------------------------------------------------------------------------
[INFO] ------------------------------------------------------------------------
[INFO] Reactor Summary for Apache PDFBox 3.0.0-SNAPSHOT:
[INFO]
[INFO] PDFBox parent ...................................... SUCCESS [ 13.229 s]
[INFO] Apache PDFBox io ................................... SUCCESS [ 49.219 s]
[INFO] Apache FontBox ..................................... SUCCESS [ 25.303 s]
[INFO] Apache XmpBox ...................................... SUCCESS [ 16.415 s]
[INFO] Apache PDFBox ...................................... FAILURE [01:04 min]
[INFO] Apache Preflight ................................... SKIPPED
[INFO] Apache Preflight application ....................... SKIPPED
[INFO] Apache PDFBox Debugger ............................. SKIPPED
[INFO] Apache PDFBox tools ................................ SKIPPED
[INFO] Apache PDFBox application .......................... SKIPPED
[INFO] Apache PDFBox Debugger application ................. SKIPPED
[INFO] Apache PDFBox examples ............................. SKIPPED
[INFO] Apache PDFBox ...................................... SKIPPED
[INFO] ------------------------------------------------------------------------
[INFO] BUILD FAILURE
[INFO] ------------------------------------------------------------------------
[INFO] Total time: 03:24 min
[INFO] Finished at: 2023-06-08T16:59:03Z
[INFO] ------------------------------------------------------------------------
[WARNING]
[WARNING] Plugin validation issues were detected in 10 plugin(s)
[WARNING]
[WARNING] * org.apache.maven.plugins:maven-scm-plugin:1.13.0
[WARNING] * org.apache.maven.plugins:maven-source-plugin:3.2.1
[WARNING] * org.jacoco:jacoco-maven-plugin:0.8.10
[WARNING] * org.apache.maven.plugins:maven-site-plugin:3.12.1
[WARNING] * org.apache.felix:maven-bundle-plugin:5.1.9
[WARNING] * org.apache.maven.plugins:maven-compiler-plugin:3.10.1
[WARNING] * org.apache.maven.plugins:maven-remote-resources-plugin:1.7.0
[WARNING] * org.apache.maven.plugins:maven-surefire-plugin:2.22.2
[WARNING] * org.apache.maven.plugins:maven-resources-plugin:3.3.0
[WARNING] * org.codehaus.mojo:sonar-maven-plugin:3.9.1.2184
[WARNING]
[WARNING] For more or less details, use 'maven.plugin.validation' property with one of the values (case insensitive): [BRIEF, DEFAULT, VERBOSE]
[WARNING]
Waiting for Jenkins to finish collecting data
[ERROR] Failed to execute goal com.googlecode.maven-download-plugin:download-maven-plugin:1.7.0:wget (PDFBOX-4106) on project pdfbox: General error: Not same digest as expected: expected <59535137c649a2f8bdbb463cd716426811a6003a65883ca6e45bb0af1d526b3889af0fba3a353e90bc8d373cd32b90a27ff9ff6916ecbccb42e922c09e9b046a> was <218bad54116b6f8398261d106a97e719ba9e1bf7aa27fb9491f82c6aa274a76f23cec9f265bc001f352c930d18211f0d95f8e54ca7ac1d2aae19d174e38df46e> -> [Help 1]
[ERROR]
[ERROR] To see the full stack trace of the errors, re-run Maven with the -e switch.
[ERROR] Re-run Maven using the -X switch to enable full debug logging.
[ERROR]
[ERROR] For more information about the errors and possible solutions, please read the following articles:
[ERROR] [Help 1] http://cwiki.apache.org/confluence/display/MAVEN/MojoExecutionException
[ERROR]
[ERROR] After correcting the problems, you can resume the build with the command
[ERROR] mvn <goals> -rf :pdfbox
[JENKINS] Archiving <https://ci-builds.apache.org/job/PDFBox/job/PDFBox-sonar2/ws/examples/pom.xml> to org.apache.pdfbox/pdfbox-examples/3.0.0-SNAPSHOT/pdfbox-examples-3.0.0-SNAPSHOT.pom
[JENKINS] Archiving <https://ci-builds.apache.org/job/PDFBox/job/PDFBox-sonar2/ws/parent/pom.xml> to org.apache.pdfbox/pdfbox-parent/3.0.0-SNAPSHOT/pdfbox-parent-3.0.0-SNAPSHOT.pom
[JENKINS] Archiving <https://ci-builds.apache.org/job/PDFBox/job/PDFBox-sonar2/ws/pdfbox/pom.xml> to org.apache.pdfbox/pdfbox/3.0.0-SNAPSHOT/pdfbox-3.0.0-SNAPSHOT.pom
[JENKINS] Archiving <https://ci-builds.apache.org/job/PDFBox/job/PDFBox-sonar2/ws/debugger-app/pom.xml> to org.apache.pdfbox/debugger-app/3.0.0-SNAPSHOT/debugger-app-3.0.0-SNAPSHOT.pom
[JENKINS] Archiving <https://ci-builds.apache.org/job/PDFBox/job/PDFBox-sonar2/ws/io/pom.xml> to org.apache.pdfbox/pdfbox-io/3.0.0-SNAPSHOT/pdfbox-io-3.0.0-SNAPSHOT.pom
[JENKINS] Archiving <https://ci-builds.apache.org/job/PDFBox/job/PDFBox-sonar2/ws/io/target/pdfbox-io-3.0.0-SNAPSHOT.jar> to org.apache.pdfbox/pdfbox-io/3.0.0-SNAPSHOT/pdfbox-io-3.0.0-SNAPSHOT.jar
[JENKINS] Archiving <https://ci-builds.apache.org/job/PDFBox/job/PDFBox-sonar2/ws/io/target/pdfbox-io-3.0.0-SNAPSHOT-sources.jar> to org.apache.pdfbox/pdfbox-io/3.0.0-SNAPSHOT/pdfbox-io-3.0.0-SNAPSHOT-sources.jar
[JENKINS] Archiving <https://ci-builds.apache.org/job/PDFBox/job/PDFBox-sonar2/ws/fontbox/pom.xml> to org.apache.pdfbox/fontbox/3.0.0-SNAPSHOT/fontbox-3.0.0-SNAPSHOT.pom
[JENKINS] Archiving <https://ci-builds.apache.org/job/PDFBox/job/PDFBox-sonar2/ws/fontbox/target/fontbox-3.0.0-SNAPSHOT.jar> to org.apache.pdfbox/fontbox/3.0.0-SNAPSHOT/fontbox-3.0.0-SNAPSHOT.jar
[JENKINS] Archiving <https://ci-builds.apache.org/job/PDFBox/job/PDFBox-sonar2/ws/fontbox/target/fontbox-3.0.0-SNAPSHOT-sources.jar> to org.apache.pdfbox/fontbox/3.0.0-SNAPSHOT/fontbox-3.0.0-SNAPSHOT-sources.jar
[JENKINS] Archiving <https://ci-builds.apache.org/job/PDFBox/job/PDFBox-sonar2/ws/xmpbox/pom.xml> to org.apache.pdfbox/xmpbox/3.0.0-SNAPSHOT/xmpbox-3.0.0-SNAPSHOT.pom
[JENKINS] Archiving <https://ci-builds.apache.org/job/PDFBox/job/PDFBox-sonar2/ws/xmpbox/target/xmpbox-3.0.0-SNAPSHOT.jar> to org.apache.pdfbox/xmpbox/3.0.0-SNAPSHOT/xmpbox-3.0.0-SNAPSHOT.jar
[JENKINS] Archiving <https://ci-builds.apache.org/job/PDFBox/job/PDFBox-sonar2/ws/xmpbox/target/xmpbox-3.0.0-SNAPSHOT-sources.jar> to org.apache.pdfbox/xmpbox/3.0.0-SNAPSHOT/xmpbox-3.0.0-SNAPSHOT-sources.jar
[JENKINS] Archiving <https://ci-builds.apache.org/job/PDFBox/job/PDFBox-sonar2/ws/tools/pom.xml> to org.apache.pdfbox/pdfbox-tools/3.0.0-SNAPSHOT/pdfbox-tools-3.0.0-SNAPSHOT.pom
[JENKINS] Archiving <https://ci-builds.apache.org/job/PDFBox/job/PDFBox-sonar2/ws/debugger/pom.xml> to org.apache.pdfbox/pdfbox-debugger/3.0.0-SNAPSHOT/pdfbox-debugger-3.0.0-SNAPSHOT.pom
[JENKINS] Archiving <https://ci-builds.apache.org/job/PDFBox/job/PDFBox-sonar2/ws/preflight-app/pom.xml> to org.apache.pdfbox/preflight-app/3.0.0-SNAPSHOT/preflight-app-3.0.0-SNAPSHOT.pom
[JENKINS] Archiving <https://ci-builds.apache.org/job/PDFBox/job/PDFBox-sonar2/ws/app/pom.xml> to org.apache.pdfbox/pdfbox-app/3.0.0-SNAPSHOT/pdfbox-app-3.0.0-SNAPSHOT.pom
[JENKINS] Archiving <https://ci-builds.apache.org/job/PDFBox/job/PDFBox-sonar2/ws/preflight/pom.xml> to org.apache.pdfbox/preflight/3.0.0-SNAPSHOT/preflight-3.0.0-SNAPSHOT.pom
[JENKINS] Archiving <https://ci-builds.apache.org/job/PDFBox/job/PDFBox-sonar2/ws/pom.xml> to org.apache.pdfbox/pdfbox-reactor/3.0.0-SNAPSHOT/pdfbox-reactor-3.0.0-SNAPSHOT.pom
No mail will be sent out, as 'PDFBox » PDFBox-sonar2 » Apache PDFBox examples #1053' does not have a result yet. Please make sure you set a proper result in case of pipeline/build scripts.
Sending e-mails to: dev@pdfbox.apache.org
No mail will be sent out, as 'PDFBox » PDFBox-sonar2 » Apache PDFBox Debugger application #1053' does not have a result yet. Please make sure you set a proper result in case of pipeline/build scripts.
Sending e-mails to: dev@pdfbox.apache.org
No mail will be sent out, as 'PDFBox » PDFBox-sonar2 » Apache PDFBox tools #1053' does not have a result yet. Please make sure you set a proper result in case of pipeline/build scripts.
No mail will be sent out, as 'PDFBox » PDFBox-sonar2 » Apache PDFBox Debugger #1053' does not have a result yet. Please make sure you set a proper result in case of pipeline/build scripts.
No mail will be sent out, as 'PDFBox » PDFBox-sonar2 » Apache Preflight application #1053' does not have a result yet. Please make sure you set a proper result in case of pipeline/build scripts.
No mail will be sent out, as 'PDFBox » PDFBox-sonar2 » Apache PDFBox application #1053' does not have a result yet. Please make sure you set a proper result in case of pipeline/build scripts.
No mail will be sent out, as 'PDFBox » PDFBox-sonar2 » Apache Preflight #1053' does not have a result yet. Please make sure you set a proper result in case of pipeline/build scripts.
No mail will be sent out, as 'PDFBox » PDFBox-sonar2 » Apache PDFBox #1053' does not have a result yet. Please make sure you set a proper result in case of pipeline/build scripts.
channel stopped
---------------------------------------------------------------------
To unsubscribe, e-mail: dev-unsubscribe@pdfbox.apache.org
For additional commands, e-mail: dev-help@pdfbox.apache.org