You are viewing a plain text version of this content. The canonical link for it is here.
Posted to builds@beam.apache.org by Apache Jenkins Server <je...@builds.apache.org> on 2020/08/15 00:04:42 UTC

Build failed in Jenkins: beam_PostCommit_Python35_VR_Flink #2409

See <https://ci-beam.apache.org/job/beam_PostCommit_Python35_VR_Flink/2409/display/redirect?page=changes>

Changes:

[Luke Cwik] [BEAM-10688] Euphoria assumes that all type descriptors are resolvable

[Luke Cwik] [BEAM-10670] Use fraction of remainder if consumed fraction is unknown

[Luke Cwik] [BEAM-10670] Improve splitting logic to prefer splits upto the the

[Luke Cwik] [BEAM-10670] Fix passing forward the self-checkpoint from the

[noreply] [BEAM-9547] Implement some methods for deferred Series. (#12534)


------------------------------------------
[...truncated 50.36 KB...]
Resolving github.com/xordataexchange/crypt: commit='b2862e3d0a775f18c7cfe02273500ae307b61218', urls=[https://github.com/xordataexchange/crypt.git, git@github.com:xordataexchange/crypt.git]
Resolving go.opencensus.io: commit='aa2b39d1618ef56ba156f27cfcdae9042f68f0bc', urls=[https://github.com/census-instrumentation/opencensus-go]

> Task :runners:core-construction-java:jar
> Task :sdks:java:extensions:protobuf:extractIncludeProto
> Task :sdks:java:extensions:protobuf:generateProto NO-SOURCE
> Task :sdks:java:extensions:protobuf:compileJava FROM-CACHE
> Task :sdks:java:extensions:protobuf:classes UP-TO-DATE
> Task :runners:core-java:compileJava FROM-CACHE
> Task :runners:core-java:classes UP-TO-DATE
> Task :sdks:java:extensions:protobuf:jar
> Task :sdks:java:core:jar
> Task :runners:core-java:jar
> Task :sdks:java:harness:compileJava FROM-CACHE
> Task :sdks:java:harness:classes UP-TO-DATE
> Task :sdks:java:harness:jar

> Task :sdks:java:container:pullLicenses
> Task :buildSrc:jar
> Task :buildSrc:assemble

> Task :sdks:python:test-suites:portable:py35:setupVirtualenv
Successfully installed appdirs-1.4.4 distlib-0.3.1 filelock-3.0.12 future-0.18.2 grpcio-1.31.0 grpcio-tools-1.30.0 importlib-metadata-1.7.0 importlib-resources-3.0.0 mypy-protobuf-1.18 pluggy-0.13.1 protobuf-3.12.4 py-1.9.0 six-1.15.0 toml-0.10.1 tox-3.11.1 virtualenv-20.0.30 zipp-1.2.0

> Task :sdks:go:resolveBuildDependencies
Resolving golang.org/x/crypto: commit='d9133f5469342136e669e85192a26056b587f503', urls=[https://go.googlesource.com/crypto]
Resolving golang.org/x/debug: commit='95515998a8a4bd7448134b2cb5971dbeb12e0b77', urls=[https://go.googlesource.com/debug]
Resolving golang.org/x/net: commit='2fb46b16b8dda405028c50f7c7f0f9dd1fa6bfb1', urls=[https://go.googlesource.com/net]
Resolving golang.org/x/oauth2: commit='a032972e28060ca4f5644acffae3dfc268cc09db', urls=[https://go.googlesource.com/oauth2]
Resolving golang.org/x/sync: commit='fd80eb99c8f653c847d294a001bdf2a3a6f768f5', urls=[https://go.googlesource.com/sync]
Resolving golang.org/x/sys: commit='37707fdb30a5b38865cfb95e5aab41707daec7fd', urls=[https://go.googlesource.com/sys]
Resolving cached github.com/etcd-io/etcd: commit='11214aa33bf5a47d3d9d8dafe0f6b97237dfe921', urls=[https://github.com/etcd-io/etcd.git, git@github.com:etcd-io/etcd.git]
Resolving cached github.com/etcd-io/etcd: commit='11214aa33bf5a47d3d9d8dafe0f6b97237dfe921', urls=[https://github.com/etcd-io/etcd.git, git@github.com:etcd-io/etcd.git]

> Task :sdks:java:harness:shadowJar

> Task :sdks:java:container:pullLicenses
> Task :buildSrc:spotlessGroovy
> Task :buildSrc:spotlessGroovyCheck
> Task :buildSrc:spotlessGroovyGradle
> Task :buildSrc:spotlessGroovyGradleCheck
> Task :buildSrc:spotlessCheck
> Task :buildSrc:pluginUnderTestMetadata
> Task :buildSrc:compileTestJava NO-SOURCE
> Task :buildSrc:compileTestGroovy NO-SOURCE
> Task :buildSrc:processTestResources NO-SOURCE
> Task :buildSrc:testClasses UP-TO-DATE
> Task :buildSrc:test NO-SOURCE
> Task :buildSrc:validateTaskProperties
> Task :buildSrc:check
> Task :buildSrc:build
Configuration on demand is an incubating feature.

> Configure project :sdks:java:container
Found go 1.12 in /usr/bin/go, use it.

> Configure project :sdks:go
Found go 1.12 in /usr/bin/go, use it.

> Task :runners:java-fn-execution:compileJava FROM-CACHE
> Task :runners:java-fn-execution:classes UP-TO-DATE
> Task :runners:java-fn-execution:jar

> Task :sdks:java:container:pullLicenses

> Configure project :sdks:go:container
Found go 1.12 in /usr/bin/go, use it.

> Task :sdks:java:expansion-service:compileJava FROM-CACHE
> Task :sdks:java:expansion-service:classes UP-TO-DATE
> Task :sdks:java:expansion-service:jar
> Task :runners:direct-java:compileJava FROM-CACHE
> Task :runners:direct-java:classes UP-TO-DATE
> Task :runners:java-job-service:compileJava FROM-CACHE
> Task :runners:java-job-service:classes UP-TO-DATE
> Task :runners:java-job-service:jar
> Task :sdks:java:io:kafka:compileJava FROM-CACHE
> Task :sdks:java:io:kafka:classes UP-TO-DATE
> Task :sdks:java:io:kafka:jar
> Task :runners:flink:1.10:compileJava FROM-CACHE
> Task :runners:flink:1.10:classes
> Task :sdks:java:io:google-cloud-platform:compileJava FROM-CACHE
> Task :sdks:java:io:google-cloud-platform:classes UP-TO-DATE
> Task :runners:flink:1.10:jar
> Task :runners:flink:1.10:job-server:compileJava NO-SOURCE
> Task :runners:flink:1.10:job-server:classes UP-TO-DATE
> Task :sdks:java:io:google-cloud-platform:jar
> Task :runners:direct-java:shadowJar

> Task :sdks:java:container:pullLicenses

> Configure project :sdks:go:examples
Found go 1.12 in /usr/bin/go, use it.

> Configure project :sdks:go:test
Found go 1.12 in /usr/bin/go, use it.

> Configure project :sdks:python:container
Found go 1.12 in /usr/bin/go, use it.

> Task :sdks:java:extensions:sql:compileJava FROM-CACHE
> Task :sdks:java:extensions:sql:classes
> Task :sdks:java:extensions:sql:jar
> Task :sdks:java:extensions:sql:zetasql:compileJava FROM-CACHE
> Task :sdks:java:extensions:sql:zetasql:classes UP-TO-DATE
> Task :sdks:java:extensions:sql:zetasql:jar
> Task :sdks:java:extensions:sql:expansion-service:compileJava FROM-CACHE
> Task :sdks:java:extensions:sql:expansion-service:classes UP-TO-DATE
> Task :sdks:java:extensions:sql:expansion-service:jar

> Task :sdks:java:container:pullLicenses

> Task :sdks:java:container:generateLicenseReport

Deprecated Gradle features were used in this build, making it incompatible with Gradle 6.0.
Use '--warning-mode all' to show the individual deprecation warnings.
See https://docs.gradle.org/5.2.1/userguide/command_line_interface.html#sec:command_line_warnings

BUILD SUCCESSFUL in 1m 11s
1 actionable task: 1 executed

Publishing build scan...
https://gradle.com/s/cnqfqk6chza3m

Already using interpreter /usr/bin/python3
Using base prefix '/usr'
New python executable in <https://ci-beam.apache.org/job/beam_PostCommit_Python35_VR_Flink/ws/src/sdks/java/container/build/virtualenv/bin/python3>
Also creating executable in <https://ci-beam.apache.org/job/beam_PostCommit_Python35_VR_Flink/ws/src/sdks/java/container/build/virtualenv/bin/python>
Installing setuptools, pip, wheel...
done.
Collecting beautifulsoup4<5.0,>=4.9.0
  Using cached beautifulsoup4-4.9.1-py3-none-any.whl (115 kB)
Processing /home/jenkins/.cache/pip/wheels/c4/f0/ae/d4689c4532d1f111462ed6a884a7767d502e511ee65f0d8e1b/future-0.18.2-py3-none-any.whl
Processing /home/jenkins/.cache/pip/wheels/57/d0/2c/e2003abb5bc1a94c2e8a6fe1c03b8055d074e34c13672e7eb7/PyYAML-5.3.1-cp35-cp35m-linux_x86_64.whl
Collecting tenacity<6.0,>=5.0.2
  Using cached tenacity-5.1.5-py2.py3-none-any.whl (34 kB)
Collecting soupsieve>1.2
  Using cached soupsieve-2.0.1-py3-none-any.whl (32 kB)
Collecting six>=1.9.0
  Using cached six-1.15.0-py2.py3-none-any.whl (10 kB)
Installing collected packages: soupsieve, beautifulsoup4, future, pyyaml, six, tenacity

> Task :sdks:java:extensions:sql:expansion-service:shadowJar

> Task :sdks:java:container:pullLicenses
Successfully installed beautifulsoup4-4.9.1 future-0.18.2 pyyaml-5.3.1 six-1.15.0 soupsieve-2.0.1 tenacity-5.1.5
Executing <https://ci-beam.apache.org/job/beam_PostCommit_Python35_VR_Flink/ws/src/sdks/java/container/build/virtualenv/bin/python> <https://ci-beam.apache.org/job/beam_PostCommit_Python35_VR_Flink/ws/src/sdks/java/container/license_scripts/pull_licenses_java.py> --license_dir=<https://ci-beam.apache.org/job/beam_PostCommit_Python35_VR_Flink/ws/src/java_third_party_licenses>        --dep_url_yaml=<https://ci-beam.apache.org/job/beam_PostCommit_Python35_VR_Flink/ws/src/sdks/java/container/license_scripts/dep_urls_java.yaml> 
INFO:root:Pulling license for 176 dependencies using 16 threads.
INFO:root:pull_licenses_java.py succeed. It took 2.752346 seconds with 16 threads.
Copy licenses to <https://ci-beam.apache.org/job/beam_PostCommit_Python35_VR_Flink/ws/src/sdks/java/container/build/target/third_party_licenses.>
Finished license_scripts.sh

> Task :sdks:java:container:copyDockerfileDependencies
> Task :runners:flink:1.10:job-server:shadowJar

> Task :sdks:go:resolveBuildDependencies
Resolving google.golang.org/api: commit='386d4e5f4f92f86e6aec85985761bba4b938a2d5', urls=[https://code.googlesource.com/google-api-go-client]
Resolving google.golang.org/genproto: commit='2b5a72b8730b0b16380010cfe5286c42108d88e7', urls=[https://github.com/google/go-genproto]
Resolving google.golang.org/grpc: commit='7646b5360d049a7ca31e9133315db43456f39e2e', urls=[https://github.com/grpc/grpc-go]
Resolving cached github.com/etcd-io/etcd: commit='11214aa33bf5a47d3d9d8dafe0f6b97237dfe921', urls=[https://github.com/etcd-io/etcd.git, git@github.com:etcd-io/etcd.git]
Resolving cached github.com/etcd-io/etcd: commit='11214aa33bf5a47d3d9d8dafe0f6b97237dfe921', urls=[https://github.com/etcd-io/etcd.git, git@github.com:etcd-io/etcd.git]

> Task :sdks:go:installDependencies
.gogradle/project_gopath/src/github.com/apache/beam/sdks/go/vendor/github.com/golang/protobuf/proto/buffer.go:11:2: cannot find package "google.golang.org/protobuf/encoding/prototext" in any of:
	<https://ci-beam.apache.org/job/beam_PostCommit_Python35_VR_Flink/ws/src/sdks/go/.gogradle/project_gopath/src/github.com/apache/beam/sdks/go/vendor/google.golang.org/protobuf/encoding/prototext> (vendor tree)
	/usr/lib/go-1.12/src/google.golang.org/protobuf/encoding/prototext (from $GOROOT)
	<https://ci-beam.apache.org/job/beam_PostCommit_Python35_VR_Flink/ws/src/sdks/go/.gogradle/project_gopath/src/google.golang.org/protobuf/encoding/prototext> (from $GOPATH)
.gogradle/project_gopath/src/github.com/apache/beam/sdks/go/vendor/github.com/golang/protobuf/proto/buffer.go:12:2: cannot find package "google.golang.org/protobuf/encoding/protowire" in any of:
	<https://ci-beam.apache.org/job/beam_PostCommit_Python35_VR_Flink/ws/src/sdks/go/.gogradle/project_gopath/src/github.com/apache/beam/sdks/go/vendor/google.golang.org/protobuf/encoding/protowire> (vendor tree)
	/usr/lib/go-1.12/src/google.golang.org/protobuf/encoding/protowire (from $GOROOT)
	<https://ci-beam.apache.org/job/beam_PostCommit_Python35_VR_Flink/ws/src/sdks/go/.gogradle/project_gopath/src/google.golang.org/protobuf/encoding/protowire> (from $GOPATH)
.gogradle/project_gopath/src/github.com/apache/beam/sdks/go/vendor/github.com/golang/protobuf/proto/deprecated.go:13:2: cannot find package "google.golang.org/protobuf/proto" in any of:
	<https://ci-beam.apache.org/job/beam_PostCommit_Python35_VR_Flink/ws/src/sdks/go/.gogradle/project_gopath/src/github.com/apache/beam/sdks/go/vendor/google.golang.org/protobuf/proto> (vendor tree)
	/usr/lib/go-1.12/src/google.golang.org/protobuf/proto (from $GOROOT)
	<https://ci-beam.apache.org/job/beam_PostCommit_Python35_VR_Flink/ws/src/sdks/go/.gogradle/project_gopath/src/google.golang.org/protobuf/proto> (from $GOPATH)
.gogradle/project_gopath/src/github.com/apache/beam/sdks/go/vendor/github.com/golang/protobuf/proto/defaults.go:8:2: cannot find package "google.golang.org/protobuf/reflect/protoreflect" in any of:
	<https://ci-beam.apache.org/job/beam_PostCommit_Python35_VR_Flink/ws/src/sdks/go/.gogradle/project_gopath/src/github.com/apache/beam/sdks/go/vendor/google.golang.org/protobuf/reflect/protoreflect> (vendor tree)
	/usr/lib/go-1.12/src/google.golang.org/protobuf/reflect/protoreflect (from $GOROOT)
	<https://ci-beam.apache.org/job/beam_PostCommit_Python35_VR_Flink/ws/src/sdks/go/.gogradle/project_gopath/src/google.golang.org/protobuf/reflect/protoreflect> (from $GOPATH)
.gogradle/project_gopath/src/github.com/apache/beam/sdks/go/vendor/github.com/golang/protobuf/proto/extensions.go:15:2: cannot find package "google.golang.org/protobuf/reflect/protoregistry" in any of:
	<https://ci-beam.apache.org/job/beam_PostCommit_Python35_VR_Flink/ws/src/sdks/go/.gogradle/project_gopath/src/github.com/apache/beam/sdks/go/vendor/google.golang.org/protobuf/reflect/protoregistry> (vendor tree)
	/usr/lib/go-1.12/src/google.golang.org/protobuf/reflect/protoregistry (from $GOROOT)
	<https://ci-beam.apache.org/job/beam_PostCommit_Python35_VR_Flink/ws/src/sdks/go/.gogradle/project_gopath/src/google.golang.org/protobuf/reflect/protoregistry> (from $GOPATH)
.gogradle/project_gopath/src/github.com/apache/beam/sdks/go/vendor/github.com/golang/protobuf/proto/extensions.go:16:2: cannot find package "google.golang.org/protobuf/runtime/protoiface" in any of:
	<https://ci-beam.apache.org/job/beam_PostCommit_Python35_VR_Flink/ws/src/sdks/go/.gogradle/project_gopath/src/github.com/apache/beam/sdks/go/vendor/google.golang.org/protobuf/runtime/protoiface> (vendor tree)
	/usr/lib/go-1.12/src/google.golang.org/protobuf/runtime/protoiface (from $GOROOT)
	<https://ci-beam.apache.org/job/beam_PostCommit_Python35_VR_Flink/ws/src/sdks/go/.gogradle/project_gopath/src/google.golang.org/protobuf/runtime/protoiface> (from $GOPATH)
.gogradle/project_gopath/src/github.com/apache/beam/sdks/go/vendor/github.com/golang/protobuf/proto/buffer.go:13:2: cannot find package "google.golang.org/protobuf/runtime/protoimpl" in any of:
	<https://ci-beam.apache.org/job/beam_PostCommit_Python35_VR_Flink/ws/src/sdks/go/.gogradle/project_gopath/src/github.com/apache/beam/sdks/go/vendor/google.golang.org/protobuf/runtime/protoimpl> (vendor tree)
	/usr/lib/go-1.12/src/google.golang.org/protobuf/runtime/protoimpl (from $GOROOT)
	<https://ci-beam.apache.org/job/beam_PostCommit_Python35_VR_Flink/ws/src/sdks/go/.gogradle/project_gopath/src/google.golang.org/protobuf/runtime/protoimpl> (from $GOPATH)
.gogradle/project_gopath/src/github.com/apache/beam/sdks/go/vendor/github.com/golang/protobuf/protoc-gen-go/descriptor/descriptor.pb.go:9:2: cannot find package "google.golang.org/protobuf/types/descriptorpb" in any of:
	<https://ci-beam.apache.org/job/beam_PostCommit_Python35_VR_Flink/ws/src/sdks/go/.gogradle/project_gopath/src/github.com/apache/beam/sdks/go/vendor/google.golang.org/protobuf/types/descriptorpb> (vendor tree)
	/usr/lib/go-1.12/src/google.golang.org/protobuf/types/descriptorpb (from $GOROOT)
	<https://ci-beam.apache.org/job/beam_PostCommit_Python35_VR_Flink/ws/src/sdks/go/.gogradle/project_gopath/src/google.golang.org/protobuf/types/descriptorpb> (from $GOPATH)
.gogradle/project_gopath/src/github.com/apache/beam/sdks/go/vendor/github.com/golang/protobuf/ptypes/any/any.pb.go:9:2: cannot find package "google.golang.org/protobuf/types/known/anypb" in any of:
	<https://ci-beam.apache.org/job/beam_PostCommit_Python35_VR_Flink/ws/src/sdks/go/.gogradle/project_gopath/src/github.com/apache/beam/sdks/go/vendor/google.golang.org/protobuf/types/known/anypb> (vendor tree)
	/usr/lib/go-1.12/src/google.golang.org/protobuf/types/known/anypb (from $GOROOT)
	<https://ci-beam.apache.org/job/beam_PostCommit_Python35_VR_Flink/ws/src/sdks/go/.gogradle/project_gopath/src/google.golang.org/protobuf/types/known/anypb> (from $GOPATH)
.gogradle/project_gopath/src/github.com/apache/beam/sdks/go/vendor/github.com/golang/protobuf/ptypes/duration/duration.pb.go:9:2: cannot find package "google.golang.org/protobuf/types/known/durationpb" in any of:
	<https://ci-beam.apache.org/job/beam_PostCommit_Python35_VR_Flink/ws/src/sdks/go/.gogradle/project_gopath/src/github.com/apache/beam/sdks/go/vendor/google.golang.org/protobuf/types/known/durationpb> (vendor tree)
	/usr/lib/go-1.12/src/google.golang.org/protobuf/types/known/durationpb (from $GOROOT)
	<https://ci-beam.apache.org/job/beam_PostCommit_Python35_VR_Flink/ws/src/sdks/go/.gogradle/project_gopath/src/google.golang.org/protobuf/types/known/durationpb> (from $GOPATH)
.gogradle/project_gopath/src/github.com/apache/beam/sdks/go/vendor/github.com/golang/protobuf/ptypes/struct/struct.pb.go:9:2: cannot find package "google.golang.org/protobuf/types/known/structpb" in any of:
	<https://ci-beam.apache.org/job/beam_PostCommit_Python35_VR_Flink/ws/src/sdks/go/.gogradle/project_gopath/src/github.com/apache/beam/sdks/go/vendor/google.golang.org/protobuf/types/known/structpb> (vendor tree)
	/usr/lib/go-1.12/src/google.golang.org/protobuf/types/known/structpb (from $GOROOT)
	<https://ci-beam.apache.org/job/beam_PostCommit_Python35_VR_Flink/ws/src/sdks/go/.gogradle/project_gopath/src/google.golang.org/protobuf/types/known/structpb> (from $GOPATH)
.gogradle/project_gopath/src/github.com/apache/beam/sdks/go/vendor/github.com/golang/protobuf/ptypes/timestamp/timestamp.pb.go:9:2: cannot find package "google.golang.org/protobuf/types/known/timestamppb" in any of:
	<https://ci-beam.apache.org/job/beam_PostCommit_Python35_VR_Flink/ws/src/sdks/go/.gogradle/project_gopath/src/github.com/apache/beam/sdks/go/vendor/google.golang.org/protobuf/types/known/timestamppb> (vendor tree)
	/usr/lib/go-1.12/src/google.golang.org/protobuf/types/known/timestamppb (from $GOROOT)
	<https://ci-beam.apache.org/job/beam_PostCommit_Python35_VR_Flink/ws/src/sdks/go/.gogradle/project_gopath/src/google.golang.org/protobuf/types/known/timestamppb> (from $GOPATH)
.gogradle/project_gopath/src/github.com/apache/beam/sdks/go/vendor/github.com/golang/protobuf/ptypes/wrappers/wrappers.pb.go:9:2: cannot find package "google.golang.org/protobuf/types/known/wrapperspb" in any of:
	<https://ci-beam.apache.org/job/beam_PostCommit_Python35_VR_Flink/ws/src/sdks/go/.gogradle/project_gopath/src/github.com/apache/beam/sdks/go/vendor/google.golang.org/protobuf/types/known/wrapperspb> (vendor tree)
	/usr/lib/go-1.12/src/google.golang.org/protobuf/types/known/wrapperspb (from $GOROOT)
	<https://ci-beam.apache.org/job/beam_PostCommit_Python35_VR_Flink/ws/src/sdks/go/.gogradle/project_gopath/src/google.golang.org/protobuf/types/known/wrapperspb> (from $GOPATH)
> Task :sdks:go:buildLinuxAmd64 FAILED
> Task :sdks:java:container:installDependencies

FAILURE: Build failed with an exception.

* What went wrong:
Execution failed for task ':sdks:go:buildLinuxAmd64'.
> Build failed due to return code 1 of: 
  Command:
   /usr/bin/go build -o ./build/bin/beamctl github.com/apache/beam/sdks/go/cmd/beamctl
  Env:
   GOEXE=
   GOPATH=<https://ci-beam.apache.org/job/beam_PostCommit_Python35_VR_Flink/ws/src/sdks/go/.gogradle/project_gopath>
   GOROOT=/usr/lib/go-1.12
   GOOS=linux
   GOARCH=amd64

* Try:
Run with --stacktrace option to get the stack trace. Run with --info or --debug option to get more log output. Run with --scan to get full insights.

* Get more help at https://help.gradle.org

Deprecated Gradle features were used in this build, making it incompatible with Gradle 6.0.
Use '--warning-mode all' to show the individual deprecation warnings.
See https://docs.gradle.org/5.2.1/userguide/command_line_interface.html#sec:command_line_warnings

BUILD FAILED in 4m 14s
99 actionable tasks: 70 executed, 28 from cache, 1 up-to-date

Publishing build scan...
https://gradle.com/s/ala3se4saezlg

Build step 'Invoke Gradle script' changed build result to FAILURE
Build step 'Invoke Gradle script' marked build as failure

---------------------------------------------------------------------
To unsubscribe, e-mail: builds-unsubscribe@beam.apache.org
For additional commands, e-mail: builds-help@beam.apache.org


Jenkins build is back to normal : beam_PostCommit_Python35_VR_Flink #2414

Posted by Apache Jenkins Server <je...@builds.apache.org>.
See <https://ci-beam.apache.org/job/beam_PostCommit_Python35_VR_Flink/2414/display/redirect?page=changes>


---------------------------------------------------------------------
To unsubscribe, e-mail: builds-unsubscribe@beam.apache.org
For additional commands, e-mail: builds-help@beam.apache.org


Build failed in Jenkins: beam_PostCommit_Python35_VR_Flink #2413

Posted by Apache Jenkins Server <je...@builds.apache.org>.
See <https://ci-beam.apache.org/job/beam_PostCommit_Python35_VR_Flink/2413/display/redirect?page=changes>

Changes:

[Luke Cwik] [BEAM-10670] Make Read execute as a splittable DoFn by default for the


------------------------------------------
[...truncated 3.01 MB...]
    self.threadsafe_restriction_tracker.check_done()
  File "<https://ci-beam.apache.org/job/beam_PostCommit_Python35_VR_Flink/ws/src/sdks/python/apache_beam/runners/sdf_utils.py",> line 115, in check_done
    return self._restriction_tracker.check_done()
  File "<https://ci-beam.apache.org/job/beam_PostCommit_Python35_VR_Flink/ws/src/sdks/python/apache_beam/io/restriction_trackers.py",> line 106, in check_done
    self._range.stop))
ValueError: OffsetRestrictionTracker is not done since work in range [0, 3) has not been claimed.

	at org.apache.beam.runners.fnexecution.control.FnApiControlClient$ResponseStreamObserver.onNext(FnApiControlClient.java:177)
	at org.apache.beam.runners.fnexecution.control.FnApiControlClient$ResponseStreamObserver.onNext(FnApiControlClient.java:157)
	at org.apache.beam.vendor.grpc.v1p26p0.io.grpc.stub.ServerCalls$StreamingServerCallHandler$StreamingServerCallListener.onMessage(ServerCalls.java:251)
	at org.apache.beam.vendor.grpc.v1p26p0.io.grpc.ForwardingServerCallListener.onMessage(ForwardingServerCallListener.java:33)
	at org.apache.beam.vendor.grpc.v1p26p0.io.grpc.Contexts$ContextualizedServerCallListener.onMessage(Contexts.java:76)
	at org.apache.beam.vendor.grpc.v1p26p0.io.grpc.internal.ServerCallImpl$ServerStreamListenerImpl.messagesAvailableInternal(ServerCallImpl.java:309)
	at org.apache.beam.vendor.grpc.v1p26p0.io.grpc.internal.ServerCallImpl$ServerStreamListenerImpl.messagesAvailable(ServerCallImpl.java:292)
	at org.apache.beam.vendor.grpc.v1p26p0.io.grpc.internal.ServerImpl$JumpToApplicationThreadServerStreamListener$1MessagesAvailable.runInContext(ServerImpl.java:782)
	at org.apache.beam.vendor.grpc.v1p26p0.io.grpc.internal.ContextRunnable.run(ContextRunnable.java:37)
	at org.apache.beam.vendor.grpc.v1p26p0.io.grpc.internal.SerializingExecutor.run(SerializingExecutor.java:123)
	at java.util.concurrent.ThreadPoolExecutor.runWorker(ThreadPoolExecutor.java:1149)
	at java.util.concurrent.ThreadPoolExecutor$Worker.run(ThreadPoolExecutor.java:624)
	... 1 more
ERROR:root:java.lang.RuntimeException: Error received from SDK harness for instruction 5: Traceback (most recent call last):
  File "<https://ci-beam.apache.org/job/beam_PostCommit_Python35_VR_Flink/ws/src/sdks/python/apache_beam/runners/worker/sdk_worker.py",> line 256, in _execute
    response = task()
  File "<https://ci-beam.apache.org/job/beam_PostCommit_Python35_VR_Flink/ws/src/sdks/python/apache_beam/runners/worker/sdk_worker.py",> line 313, in <lambda>
    lambda: self.create_worker().do_instruction(request), request)
  File "<https://ci-beam.apache.org/job/beam_PostCommit_Python35_VR_Flink/ws/src/sdks/python/apache_beam/runners/worker/sdk_worker.py",> line 483, in do_instruction
    getattr(request, request_type), request.instruction_id)
  File "<https://ci-beam.apache.org/job/beam_PostCommit_Python35_VR_Flink/ws/src/sdks/python/apache_beam/runners/worker/sdk_worker.py",> line 518, in process_bundle
    bundle_processor.process_bundle(instruction_id))
  File "<https://ci-beam.apache.org/job/beam_PostCommit_Python35_VR_Flink/ws/src/sdks/python/apache_beam/runners/worker/bundle_processor.py",> line 983, in process_bundle
    element.data)
  File "<https://ci-beam.apache.org/job/beam_PostCommit_Python35_VR_Flink/ws/src/sdks/python/apache_beam/runners/worker/bundle_processor.py",> line 219, in process_encoded
    self.output(decoded_value)
  File "<https://ci-beam.apache.org/job/beam_PostCommit_Python35_VR_Flink/ws/src/sdks/python/apache_beam/runners/worker/operations.py",> line 332, in output
    cython.cast(Receiver, self.receivers[output_index]).receive(windowed_value)
  File "<https://ci-beam.apache.org/job/beam_PostCommit_Python35_VR_Flink/ws/src/sdks/python/apache_beam/runners/worker/operations.py",> line 195, in receive
    self.consumer.process(windowed_value)
  File "<https://ci-beam.apache.org/job/beam_PostCommit_Python35_VR_Flink/ws/src/sdks/python/apache_beam/runners/worker/operations.py",> line 779, in process
    o)
  File "<https://ci-beam.apache.org/job/beam_PostCommit_Python35_VR_Flink/ws/src/sdks/python/apache_beam/runners/common.py",> line 1224, in process_with_sized_restriction
    watermark_estimator_state=estimator_state)
  File "<https://ci-beam.apache.org/job/beam_PostCommit_Python35_VR_Flink/ws/src/sdks/python/apache_beam/runners/common.py",> line 723, in invoke_process
    windowed_value, additional_args, additional_kwargs)
  File "<https://ci-beam.apache.org/job/beam_PostCommit_Python35_VR_Flink/ws/src/sdks/python/apache_beam/runners/common.py",> line 872, in _invoke_process_per_window
    self.threadsafe_restriction_tracker.check_done()
  File "<https://ci-beam.apache.org/job/beam_PostCommit_Python35_VR_Flink/ws/src/sdks/python/apache_beam/runners/sdf_utils.py",> line 115, in check_done
    return self._restriction_tracker.check_done()
  File "<https://ci-beam.apache.org/job/beam_PostCommit_Python35_VR_Flink/ws/src/sdks/python/apache_beam/io/restriction_trackers.py",> line 106, in check_done
    self._range.stop))
ValueError: OffsetRestrictionTracker is not done since work in range [0, 3) has not been claimed.

INFO:apache_beam.runners.portability.portable_runner:Job state changed to FAILED
.sssssINFO:apache_beam.runners.worker.worker_pool_main:Listening for workers at localhost:39851
WARNING:root:Make sure that locally built Python SDK docker image has Python 3.5 interpreter.
INFO:root:Using Python SDK docker image: apache/beam_python3.5_sdk:2.25.0.dev. If the image is not available at local, we will try to pull from hub.docker.com
INFO:apache_beam.runners.portability.portable_runner:Environment "LOOPBACK" has started a component necessary for the execution. Be sure to run the pipeline using
  with Pipeline() as p:
    p.apply(..)
This ensures that the pipeline finishes before this program exits.
INFO:apache_beam.runners.portability.portable_runner:Job state changed to STOPPED
INFO:apache_beam.runners.portability.portable_runner:Job state changed to STARTING
INFO:apache_beam.runners.portability.portable_runner:Job state changed to RUNNING
[flink-runner-job-invoker] WARN org.apache.flink.runtime.webmonitor.WebMonitorUtils - Log file environment variable 'log.file' is not set.
[flink-runner-job-invoker] WARN org.apache.flink.runtime.webmonitor.WebMonitorUtils - JobManager log files are unavailable in the web dashboard. Log file location not found in environment variable 'log.file' or configuration key 'Key: 'web.log.path' , default: null (fallback keys: [{key=jobmanager.web.log.path, isDeprecated=true}])'.
[[5]{Create, Map(<lambda at fn_runner_test.py:490>), WindowInto(WindowIntoFn), Map(<lambda at fn_runner_test.py:493>)} (1/2)] WARN org.apache.flink.metrics.MetricGroup - The operator name [5]{Create, Map(<lambda at fn_runner_test.py:490>), WindowInto(WindowIntoFn), Map(<lambda at fn_runner_test.py:493>)} exceeded the 80 characters length limit and was truncated.
[[5]{Create, Map(<lambda at fn_runner_test.py:490>), WindowInto(WindowIntoFn), Map(<lambda at fn_runner_test.py:493>)} (2/2)] WARN org.apache.flink.metrics.MetricGroup - The operator name [5]{Create, Map(<lambda at fn_runner_test.py:490>), WindowInto(WindowIntoFn), Map(<lambda at fn_runner_test.py:493>)} exceeded the 80 characters length limit and was truncated.
INFO:apache_beam.runners.worker.statecache:Creating state cache with size 0
INFO:apache_beam.runners.worker.sdk_worker:Creating insecure control channel for localhost:35477.
INFO:apache_beam.runners.worker.sdk_worker:Control channel established.
INFO:apache_beam.runners.worker.sdk_worker:Initializing SDKHarness with unbounded number of workers.
INFO:apache_beam.runners.worker.sdk_worker:Creating insecure state channel for localhost:41027.
INFO:apache_beam.runners.worker.sdk_worker:State channel established.
INFO:apache_beam.runners.worker.data_plane:Creating client data channel for localhost:42973
INFO:apache_beam.runners.worker.sdk_worker:No more requests from control plane
INFO:apache_beam.runners.worker.sdk_worker:SDK Harness waiting for in-flight requests to complete
INFO:apache_beam.runners.worker.data_plane:Closing all cached grpc data channels.
INFO:apache_beam.runners.worker.sdk_worker:Closing all cached gRPC state handlers.
[assert_that/Group/GroupByKey -> [3]assert_that/{Group, Unkey, Match} (1/2)] WARN org.apache.beam.sdk.fn.data.BeamFnDataGrpcMultiplexer - Hanged up for unknown endpoint.
INFO:apache_beam.runners.worker.sdk_worker:Done consuming work.
[assert_that/Group/GroupByKey -> [3]assert_that/{Group, Unkey, Match} (1/2)] WARN org.apache.beam.runners.fnexecution.control.DefaultJobBundleFactory - Error cleaning up servers urn: "beam:env:external:v1"
payload: "\n\021\n\017localhost:39851"
capabilities: "beam:coder:double:v1"
capabilities: "beam:coder:bytes:v1"
capabilities: "beam:coder:windowed_value:v1"
capabilities: "beam:coder:timer:v1"
capabilities: "beam:coder:param_windowed_value:v1"
capabilities: "beam:coder:string_utf8:v1"
capabilities: "beam:coder:length_prefix:v1"
capabilities: "beam:coder:state_backed_iterable:v1"
capabilities: "beam:coder:global_window:v1"
capabilities: "beam:coder:row:v1"
capabilities: "beam:coder:varint:v1"
capabilities: "beam:coder:iterable:v1"
capabilities: "beam:coder:bool:v1"
capabilities: "beam:coder:interval_window:v1"
capabilities: "beam:coder:kv:v1"
capabilities: "beam:protocol:progress_reporting:v0"
capabilities: "beam:protocol:worker_status:v1"
capabilities: "beam:version:sdk_base:apache/beam_python3.5_sdk:2.25.0.dev"

java.lang.IllegalStateException: call already closed
	at org.apache.beam.vendor.grpc.v1p26p0.com.google.common.base.Preconditions.checkState(Preconditions.java:511)
	at org.apache.beam.vendor.grpc.v1p26p0.io.grpc.internal.ServerCallImpl.closeInternal(ServerCallImpl.java:209)
	at org.apache.beam.vendor.grpc.v1p26p0.io.grpc.internal.ServerCallImpl.close(ServerCallImpl.java:202)
	at org.apache.beam.vendor.grpc.v1p26p0.io.grpc.stub.ServerCalls$ServerCallStreamObserverImpl.onCompleted(ServerCalls.java:371)
	at org.apache.beam.runners.fnexecution.state.GrpcStateService.close(GrpcStateService.java:63)
	at org.apache.beam.runners.fnexecution.GrpcFnServer.close(GrpcFnServer.java:151)
	at org.apache.beam.runners.fnexecution.control.DefaultJobBundleFactory$WrappedSdkHarnessClient.$closeResource(DefaultJobBundleFactory.java:629)
	at org.apache.beam.runners.fnexecution.control.DefaultJobBundleFactory$WrappedSdkHarnessClient.close(DefaultJobBundleFactory.java:629)
	at org.apache.beam.runners.fnexecution.control.DefaultJobBundleFactory$WrappedSdkHarnessClient.unref(DefaultJobBundleFactory.java:645)
	at org.apache.beam.runners.fnexecution.control.DefaultJobBundleFactory$WrappedSdkHarnessClient.access$400(DefaultJobBundleFactory.java:576)
	at org.apache.beam.runners.fnexecution.control.DefaultJobBundleFactory.lambda$createEnvironmentCaches$3(DefaultJobBundleFactory.java:208)
	at org.apache.beam.vendor.guava.v26_0_jre.com.google.common.cache.LocalCache.processPendingNotifications(LocalCache.java:1809)
	at org.apache.beam.vendor.guava.v26_0_jre.com.google.common.cache.LocalCache$Segment.runUnlockedCleanup(LocalCache.java:3462)
	at org.apache.beam.vendor.guava.v26_0_jre.com.google.common.cache.LocalCache$Segment.postWriteCleanup(LocalCache.java:3438)
	at org.apache.beam.vendor.guava.v26_0_jre.com.google.common.cache.LocalCache$Segment.clear(LocalCache.java:3215)
	at org.apache.beam.vendor.guava.v26_0_jre.com.google.common.cache.LocalCache.clear(LocalCache.java:4270)
	at org.apache.beam.vendor.guava.v26_0_jre.com.google.common.cache.LocalCache$LocalManualCache.invalidateAll(LocalCache.java:4909)
	at org.apache.beam.runners.fnexecution.control.DefaultJobBundleFactory.close(DefaultJobBundleFactory.java:315)
	at org.apache.beam.runners.fnexecution.control.DefaultExecutableStageContext.close(DefaultExecutableStageContext.java:43)
	at org.apache.beam.runners.fnexecution.control.ReferenceCountingExecutableStageContextFactory$WrappedContext.closeActual(ReferenceCountingExecutableStageContextFactory.java:209)
	at org.apache.beam.runners.fnexecution.control.ReferenceCountingExecutableStageContextFactory$WrappedContext.access$200(ReferenceCountingExecutableStageContextFactory.java:185)
	at org.apache.beam.runners.fnexecution.control.ReferenceCountingExecutableStageContextFactory.release(ReferenceCountingExecutableStageContextFactory.java:174)
	at org.apache.beam.runners.fnexecution.control.ReferenceCountingExecutableStageContextFactory.scheduleRelease(ReferenceCountingExecutableStageContextFactory.java:133)
	at org.apache.beam.runners.fnexecution.control.ReferenceCountingExecutableStageContextFactory.access$300(ReferenceCountingExecutableStageContextFactory.java:45)
	at org.apache.beam.runners.fnexecution.control.ReferenceCountingExecutableStageContextFactory$WrappedContext.close(ReferenceCountingExecutableStageContextFactory.java:205)
	at org.apache.beam.runners.flink.translation.wrappers.streaming.ExecutableStageDoFnOperator.$closeResource(ExecutableStageDoFnOperator.java:466)
	at org.apache.beam.runners.flink.translation.wrappers.streaming.ExecutableStageDoFnOperator.dispose(ExecutableStageDoFnOperator.java:505)
	at org.apache.flink.streaming.runtime.tasks.StreamTask.disposeAllOperators(StreamTask.java:647)
	at org.apache.flink.streaming.runtime.tasks.StreamTask.afterInvoke(StreamTask.java:523)
	at org.apache.flink.streaming.runtime.tasks.StreamTask.invoke(StreamTask.java:477)
	at org.apache.flink.runtime.taskmanager.Task.doRun(Task.java:708)
	at org.apache.flink.runtime.taskmanager.Task.run(Task.java:533)
	at java.lang.Thread.run(Thread.java:748)
INFO:apache_beam.runners.portability.portable_runner:Job state changed to DONE
.INFO:apache_beam.runners.worker.worker_pool_main:Listening for workers at localhost:41823
WARNING:root:Make sure that locally built Python SDK docker image has Python 3.5 interpreter.
INFO:root:Using Python SDK docker image: apache/beam_python3.5_sdk:2.25.0.dev. If the image is not available at local, we will try to pull from hub.docker.com
INFO:apache_beam.runners.portability.portable_runner:Environment "LOOPBACK" has started a component necessary for the execution. Be sure to run the pipeline using
  with Pipeline() as p:
    p.apply(..)
This ensures that the pipeline finishes before this program exits.
INFO:apache_beam.runners.portability.portable_runner:Job state changed to STOPPED
INFO:apache_beam.runners.portability.portable_runner:Job state changed to STARTING
INFO:apache_beam.runners.portability.portable_runner:Job state changed to RUNNING
[flink-runner-job-invoker] WARN org.apache.flink.runtime.webmonitor.WebMonitorUtils - Log file environment variable 'log.file' is not set.
[flink-runner-job-invoker] WARN org.apache.flink.runtime.webmonitor.WebMonitorUtils - JobManager log files are unavailable in the web dashboard. Log file location not found in environment variable 'log.file' or configuration key 'Key: 'web.log.path' , default: null (fallback keys: [{key=jobmanager.web.log.path, isDeprecated=true}])'.
INFO:apache_beam.runners.worker.statecache:Creating state cache with size 0
INFO:apache_beam.runners.worker.sdk_worker:Creating insecure control channel for localhost:41999.
INFO:apache_beam.runners.worker.sdk_worker:Control channel established.
INFO:apache_beam.runners.worker.sdk_worker:Initializing SDKHarness with unbounded number of workers.
INFO:apache_beam.runners.worker.sdk_worker:Creating insecure state channel for localhost:44275.
INFO:apache_beam.runners.worker.sdk_worker:State channel established.
INFO:apache_beam.runners.worker.data_plane:Creating client data channel for localhost:45385
INFO:apache_beam.runners.worker.sdk_worker:No more requests from control plane
INFO:apache_beam.runners.worker.sdk_worker:SDK Harness waiting for in-flight requests to complete
INFO:apache_beam.runners.worker.data_plane:Closing all cached grpc data channels.
INFO:apache_beam.runners.worker.sdk_worker:Closing all cached gRPC state handlers.
[assert_that/Group/GroupByKey -> [3]assert_that/{Group, Unkey, Match} (1/2)] WARN org.apache.beam.sdk.fn.data.BeamFnDataGrpcMultiplexer - Hanged up for unknown endpoint.
INFO:apache_beam.runners.worker.sdk_worker:Done consuming work.
[assert_that/Group/GroupByKey -> [3]assert_that/{Group, Unkey, Match} (1/2)] WARN org.apache.beam.runners.fnexecution.control.DefaultJobBundleFactory - Error cleaning up servers urn: "beam:env:external:v1"
payload: "\n\021\n\017localhost:41823"
capabilities: "beam:coder:double:v1"
capabilities: "beam:coder:bytes:v1"
capabilities: "beam:coder:windowed_value:v1"
capabilities: "beam:coder:timer:v1"
capabilities: "beam:coder:param_windowed_value:v1"
capabilities: "beam:coder:string_utf8:v1"
capabilities: "beam:coder:length_prefix:v1"
capabilities: "beam:coder:state_backed_iterable:v1"
capabilities: "beam:coder:global_window:v1"
capabilities: "beam:coder:row:v1"
capabilities: "beam:coder:varint:v1"
capabilities: "beam:coder:iterable:v1"
capabilities: "beam:coder:bool:v1"
capabilities: "beam:coder:interval_window:v1"
capabilities: "beam:coder:kv:v1"
capabilities: "beam:protocol:progress_reporting:v0"
capabilities: "beam:protocol:worker_status:v1"
capabilities: "beam:version:sdk_base:apache/beam_python3.5_sdk:2.25.0.dev"

java.lang.IllegalStateException: call already closed
	at org.apache.beam.vendor.grpc.v1p26p0.com.google.common.base.Preconditions.checkState(Preconditions.java:511)
	at org.apache.beam.vendor.grpc.v1p26p0.io.grpc.internal.ServerCallImpl.closeInternal(ServerCallImpl.java:209)
	at org.apache.beam.vendor.grpc.v1p26p0.io.grpc.internal.ServerCallImpl.close(ServerCallImpl.java:202)
	at org.apache.beam.vendor.grpc.v1p26p0.io.grpc.stub.ServerCalls$ServerCallStreamObserverImpl.onCompleted(ServerCalls.java:371)
	at org.apache.beam.runners.fnexecution.state.GrpcStateService.close(GrpcStateService.java:63)
	at org.apache.beam.runners.fnexecution.GrpcFnServer.close(GrpcFnServer.java:151)
	at org.apache.beam.runners.fnexecution.control.DefaultJobBundleFactory$WrappedSdkHarnessClient.$closeResource(DefaultJobBundleFactory.java:629)
	at org.apache.beam.runners.fnexecution.control.DefaultJobBundleFactory$WrappedSdkHarnessClient.close(DefaultJobBundleFactory.java:629)
	at org.apache.beam.runners.fnexecution.control.DefaultJobBundleFactory$WrappedSdkHarnessClient.unref(DefaultJobBundleFactory.java:645)
	at org.apache.beam.runners.fnexecution.control.DefaultJobBundleFactory$WrappedSdkHarnessClient.access$400(DefaultJobBundleFactory.java:576)
	at org.apache.beam.runners.fnexecution.control.DefaultJobBundleFactory.lambda$createEnvironmentCaches$3(DefaultJobBundleFactory.java:208)
	at org.apache.beam.vendor.guava.v26_0_jre.com.google.common.cache.LocalCache.processPendingNotifications(LocalCache.java:1809)
	at org.apache.beam.vendor.guava.v26_0_jre.com.google.common.cache.LocalCache$Segment.runUnlockedCleanup(LocalCache.java:3462)
	at org.apache.beam.vendor.guava.v26_0_jre.com.google.common.cache.LocalCache$Segment.postWriteCleanup(LocalCache.java:3438)
	at org.apache.beam.vendor.guava.v26_0_jre.com.google.common.cache.LocalCache$Segment.clear(LocalCache.java:3215)
	at org.apache.beam.vendor.guava.v26_0_jre.com.google.common.cache.LocalCache.clear(LocalCache.java:4270)
	at org.apache.beam.vendor.guava.v26_0_jre.com.google.common.cache.LocalCache$LocalManualCache.invalidateAll(LocalCache.java:4909)
	at org.apache.beam.runners.fnexecution.control.DefaultJobBundleFactory.close(DefaultJobBundleFactory.java:315)
	at org.apache.beam.runners.fnexecution.control.DefaultExecutableStageContext.close(DefaultExecutableStageContext.java:43)
	at org.apache.beam.runners.fnexecution.control.ReferenceCountingExecutableStageContextFactory$WrappedContext.closeActual(ReferenceCountingExecutableStageContextFactory.java:209)
	at org.apache.beam.runners.fnexecution.control.ReferenceCountingExecutableStageContextFactory$WrappedContext.access$200(ReferenceCountingExecutableStageContextFactory.java:185)
	at org.apache.beam.runners.fnexecution.control.ReferenceCountingExecutableStageContextFactory.release(ReferenceCountingExecutableStageContextFactory.java:174)
	at org.apache.beam.runners.fnexecution.control.ReferenceCountingExecutableStageContextFactory.scheduleRelease(ReferenceCountingExecutableStageContextFactory.java:133)
	at org.apache.beam.runners.fnexecution.control.ReferenceCountingExecutableStageContextFactory.access$300(ReferenceCountingExecutableStageContextFactory.java:45)
	at org.apache.beam.runners.fnexecution.control.ReferenceCountingExecutableStageContextFactory$WrappedContext.close(ReferenceCountingExecutableStageContextFactory.java:205)
	at org.apache.beam.runners.flink.translation.wrappers.streaming.ExecutableStageDoFnOperator.$closeResource(ExecutableStageDoFnOperator.java:466)
	at org.apache.beam.runners.flink.translation.wrappers.streaming.ExecutableStageDoFnOperator.dispose(ExecutableStageDoFnOperator.java:505)
	at org.apache.flink.streaming.runtime.tasks.StreamTask.disposeAllOperators(StreamTask.java:647)
	at org.apache.flink.streaming.runtime.tasks.StreamTask.afterInvoke(StreamTask.java:523)
	at org.apache.flink.streaming.runtime.tasks.StreamTask.invoke(StreamTask.java:477)
	at org.apache.flink.runtime.taskmanager.Task.doRun(Task.java:708)
	at org.apache.flink.runtime.taskmanager.Task.run(Task.java:533)
	at java.lang.Thread.run(Thread.java:748)
INFO:apache_beam.runners.portability.portable_runner:Job state changed to DONE
.INFO:__main__:removing conf dir: /tmp/flinktest-confzg93puk9

----------------------------------------------------------------------
Ran 100 tests in 404.802s

OK (skipped=26)

FAILURE: Build failed with an exception.

* Where:
Script '<https://ci-beam.apache.org/job/beam_PostCommit_Python35_VR_Flink/ws/src/sdks/python/test-suites/portable/common.gradle'> line: 57

* What went wrong:
Execution failed for task ':sdks:python:test-suites:portable:py35:flinkCompatibilityMatrixBatchLOOPBACK'.
> Process 'command 'sh'' finished with non-zero exit value 1

* Try:
Run with --stacktrace option to get the stack trace. Run with --info or --debug option to get more log output. Run with --scan to get full insights.

* Get more help at https://help.gradle.org

Deprecated Gradle features were used in this build, making it incompatible with Gradle 6.0.
Use '--warning-mode all' to show the individual deprecation warnings.
See https://docs.gradle.org/5.2.1/userguide/command_line_interface.html#sec:command_line_warnings

BUILD FAILED in 52m 46s
108 actionable tasks: 100 executed, 7 from cache, 1 up-to-date

Publishing build scan...
https://gradle.com/s/7ueheutaotqg6

Build step 'Invoke Gradle script' changed build result to FAILURE
Build step 'Invoke Gradle script' marked build as failure

---------------------------------------------------------------------
To unsubscribe, e-mail: builds-unsubscribe@beam.apache.org
For additional commands, e-mail: builds-help@beam.apache.org


Build failed in Jenkins: beam_PostCommit_Python35_VR_Flink #2412

Posted by Apache Jenkins Server <je...@builds.apache.org>.
See <https://ci-beam.apache.org/job/beam_PostCommit_Python35_VR_Flink/2412/display/redirect>

Changes:


------------------------------------------
[...truncated 2.99 MB...]
	at akka.dispatch.forkjoin.ForkJoinPool$WorkQueue.runTask(ForkJoinPool.java:1339)
	at akka.dispatch.forkjoin.ForkJoinPool.runWorker(ForkJoinPool.java:1979)
	at akka.dispatch.forkjoin.ForkJoinWorkerThread.run(ForkJoinWorkerThread.java:107)
Caused by: org.apache.flink.runtime.JobException: Recovery is suppressed by NoRestartBackoffTimeStrategy
	at org.apache.flink.runtime.executiongraph.failover.flip1.ExecutionFailureHandler.handleFailure(ExecutionFailureHandler.java:110)
	at org.apache.flink.runtime.executiongraph.failover.flip1.ExecutionFailureHandler.getFailureHandlingResult(ExecutionFailureHandler.java:76)
	at org.apache.flink.runtime.scheduler.DefaultScheduler.handleTaskFailure(DefaultScheduler.java:192)
	at org.apache.flink.runtime.scheduler.DefaultScheduler.maybeHandleTaskFailure(DefaultScheduler.java:186)
	at org.apache.flink.runtime.scheduler.DefaultScheduler.updateTaskExecutionStateInternal(DefaultScheduler.java:180)
	at org.apache.flink.runtime.scheduler.SchedulerBase.updateTaskExecutionState(SchedulerBase.java:496)
	at org.apache.flink.runtime.jobmaster.JobMaster.updateTaskExecutionState(JobMaster.java:380)
	at sun.reflect.GeneratedMethodAccessor29.invoke(Unknown Source)
	at sun.reflect.DelegatingMethodAccessorImpl.invoke(DelegatingMethodAccessorImpl.java:43)
	at java.lang.reflect.Method.invoke(Method.java:498)
	at org.apache.flink.runtime.rpc.akka.AkkaRpcActor.handleRpcInvocation(AkkaRpcActor.java:284)
	at org.apache.flink.runtime.rpc.akka.AkkaRpcActor.handleRpcMessage(AkkaRpcActor.java:199)
	at org.apache.flink.runtime.rpc.akka.FencedAkkaRpcActor.handleRpcMessage(FencedAkkaRpcActor.java:74)
	at org.apache.flink.runtime.rpc.akka.AkkaRpcActor.handleMessage(AkkaRpcActor.java:152)
	at akka.japi.pf.UnitCaseStatement.apply(CaseStatements.scala:26)
	at akka.japi.pf.UnitCaseStatement.apply(CaseStatements.scala:21)
	at scala.PartialFunction$class.applyOrElse(PartialFunction.scala:123)
	at akka.japi.pf.UnitCaseStatement.applyOrElse(CaseStatements.scala:21)
	at scala.PartialFunction$OrElse.applyOrElse(PartialFunction.scala:170)
	at scala.PartialFunction$OrElse.applyOrElse(PartialFunction.scala:171)
	at scala.PartialFunction$OrElse.applyOrElse(PartialFunction.scala:171)
	at akka.actor.Actor$class.aroundReceive(Actor.scala:517)
	at akka.actor.AbstractActor.aroundReceive(AbstractActor.scala:225)
	at akka.actor.ActorCell.receiveMessage(ActorCell.scala:592)
	at akka.actor.ActorCell.invoke(ActorCell.scala:561)
	at akka.dispatch.Mailbox.processMailbox(Mailbox.scala:258)
	at akka.dispatch.Mailbox.run(Mailbox.scala:225)
	at akka.dispatch.Mailbox.exec(Mailbox.scala:235)
	... 4 more
Caused by: java.lang.RuntimeException: Failed to finish remote bundle
	at org.apache.beam.runners.flink.translation.wrappers.streaming.ExecutableStageDoFnOperator$SdkHarnessDoFnRunner.finishBundle(ExecutableStageDoFnOperator.java:769)
	at org.apache.beam.runners.flink.metrics.DoFnRunnerWithMetricsUpdate.finishBundle(DoFnRunnerWithMetricsUpdate.java:89)
	at org.apache.beam.runners.core.SimplePushbackSideInputDoFnRunner.finishBundle(SimplePushbackSideInputDoFnRunner.java:124)
	at org.apache.beam.runners.flink.translation.wrappers.streaming.DoFnOperator.invokeFinishBundle(DoFnOperator.java:841)
	at org.apache.beam.runners.flink.translation.wrappers.streaming.ExecutableStageDoFnOperator.close(ExecutableStageDoFnOperator.java:489)
	at org.apache.flink.streaming.runtime.tasks.StreamTask.closeAllOperators(StreamTask.java:618)
	at org.apache.flink.streaming.runtime.tasks.StreamTask.lambda$afterInvoke$1(StreamTask.java:498)
	at org.apache.flink.streaming.runtime.tasks.StreamTaskActionExecutor$SynchronizedStreamTaskActionExecutor.runThrowing(StreamTaskActionExecutor.java:94)
	at org.apache.flink.streaming.runtime.tasks.StreamTask.afterInvoke(StreamTask.java:496)
	at org.apache.flink.streaming.runtime.tasks.StreamTask.invoke(StreamTask.java:477)
	at org.apache.flink.runtime.taskmanager.Task.doRun(Task.java:708)
	at org.apache.flink.runtime.taskmanager.Task.run(Task.java:533)
	at java.lang.Thread.run(Thread.java:748)
Caused by: java.util.concurrent.ExecutionException: java.lang.RuntimeException: Error received from SDK harness for instruction 5: Traceback (most recent call last):
  File "<https://ci-beam.apache.org/job/beam_PostCommit_Python35_VR_Flink/ws/src/sdks/python/apache_beam/runners/worker/sdk_worker.py",> line 256, in _execute
    response = task()
  File "<https://ci-beam.apache.org/job/beam_PostCommit_Python35_VR_Flink/ws/src/sdks/python/apache_beam/runners/worker/sdk_worker.py",> line 313, in <lambda>
    lambda: self.create_worker().do_instruction(request), request)
  File "<https://ci-beam.apache.org/job/beam_PostCommit_Python35_VR_Flink/ws/src/sdks/python/apache_beam/runners/worker/sdk_worker.py",> line 483, in do_instruction
    getattr(request, request_type), request.instruction_id)
  File "<https://ci-beam.apache.org/job/beam_PostCommit_Python35_VR_Flink/ws/src/sdks/python/apache_beam/runners/worker/sdk_worker.py",> line 518, in process_bundle
    bundle_processor.process_bundle(instruction_id))
  File "<https://ci-beam.apache.org/job/beam_PostCommit_Python35_VR_Flink/ws/src/sdks/python/apache_beam/runners/worker/bundle_processor.py",> line 983, in process_bundle
    element.data)
  File "<https://ci-beam.apache.org/job/beam_PostCommit_Python35_VR_Flink/ws/src/sdks/python/apache_beam/runners/worker/bundle_processor.py",> line 219, in process_encoded
    self.output(decoded_value)
  File "<https://ci-beam.apache.org/job/beam_PostCommit_Python35_VR_Flink/ws/src/sdks/python/apache_beam/runners/worker/operations.py",> line 332, in output
    cython.cast(Receiver, self.receivers[output_index]).receive(windowed_value)
  File "<https://ci-beam.apache.org/job/beam_PostCommit_Python35_VR_Flink/ws/src/sdks/python/apache_beam/runners/worker/operations.py",> line 195, in receive
    self.consumer.process(windowed_value)
  File "<https://ci-beam.apache.org/job/beam_PostCommit_Python35_VR_Flink/ws/src/sdks/python/apache_beam/runners/worker/operations.py",> line 779, in process
    o)
  File "<https://ci-beam.apache.org/job/beam_PostCommit_Python35_VR_Flink/ws/src/sdks/python/apache_beam/runners/common.py",> line 1224, in process_with_sized_restriction
    watermark_estimator_state=estimator_state)
  File "<https://ci-beam.apache.org/job/beam_PostCommit_Python35_VR_Flink/ws/src/sdks/python/apache_beam/runners/common.py",> line 723, in invoke_process
    windowed_value, additional_args, additional_kwargs)
  File "<https://ci-beam.apache.org/job/beam_PostCommit_Python35_VR_Flink/ws/src/sdks/python/apache_beam/runners/common.py",> line 872, in _invoke_process_per_window
    self.threadsafe_restriction_tracker.check_done()
  File "<https://ci-beam.apache.org/job/beam_PostCommit_Python35_VR_Flink/ws/src/sdks/python/apache_beam/runners/sdf_utils.py",> line 115, in check_done
    return self._restriction_tracker.check_done()
  File "<https://ci-beam.apache.org/job/beam_PostCommit_Python35_VR_Flink/ws/src/sdks/python/apache_beam/io/restriction_trackers.py",> line 106, in check_done
    self._range.stop))
ValueError: OffsetRestrictionTracker is not done since work in range [0, 6) has not been claimed.

	at java.util.concurrent.CompletableFuture.reportGet(CompletableFuture.java:357)
	at java.util.concurrent.CompletableFuture.get(CompletableFuture.java:1908)
	at org.apache.beam.sdk.util.MoreFutures.get(MoreFutures.java:57)
	at org.apache.beam.runners.fnexecution.control.SdkHarnessClient$BundleProcessor$ActiveBundle.close(SdkHarnessClient.java:493)
	at org.apache.beam.runners.fnexecution.control.DefaultJobBundleFactory$SimpleStageBundleFactory$1.close(DefaultJobBundleFactory.java:547)
	at org.apache.beam.runners.flink.translation.wrappers.streaming.ExecutableStageDoFnOperator$SdkHarnessDoFnRunner.finishBundle(ExecutableStageDoFnOperator.java:763)
	... 12 more
Caused by: java.lang.RuntimeException: Error received from SDK harness for instruction 5: Traceback (most recent call last):
  File "<https://ci-beam.apache.org/job/beam_PostCommit_Python35_VR_Flink/ws/src/sdks/python/apache_beam/runners/worker/sdk_worker.py",> line 256, in _execute
    response = task()
  File "<https://ci-beam.apache.org/job/beam_PostCommit_Python35_VR_Flink/ws/src/sdks/python/apache_beam/runners/worker/sdk_worker.py",> line 313, in <lambda>
    lambda: self.create_worker().do_instruction(request), request)
  File "<https://ci-beam.apache.org/job/beam_PostCommit_Python35_VR_Flink/ws/src/sdks/python/apache_beam/runners/worker/sdk_worker.py",> line 483, in do_instruction
    getattr(request, request_type), request.instruction_id)
  File "<https://ci-beam.apache.org/job/beam_PostCommit_Python35_VR_Flink/ws/src/sdks/python/apache_beam/runners/worker/sdk_worker.py",> line 518, in process_bundle
    bundle_processor.process_bundle(instruction_id))
  File "<https://ci-beam.apache.org/job/beam_PostCommit_Python35_VR_Flink/ws/src/sdks/python/apache_beam/runners/worker/bundle_processor.py",> line 983, in process_bundle
    element.data)
  File "<https://ci-beam.apache.org/job/beam_PostCommit_Python35_VR_Flink/ws/src/sdks/python/apache_beam/runners/worker/bundle_processor.py",> line 219, in process_encoded
    self.output(decoded_value)
  File "<https://ci-beam.apache.org/job/beam_PostCommit_Python35_VR_Flink/ws/src/sdks/python/apache_beam/runners/worker/operations.py",> line 332, in output
    cython.cast(Receiver, self.receivers[output_index]).receive(windowed_value)
  File "<https://ci-beam.apache.org/job/beam_PostCommit_Python35_VR_Flink/ws/src/sdks/python/apache_beam/runners/worker/operations.py",> line 195, in receive
    self.consumer.process(windowed_value)
  File "<https://ci-beam.apache.org/job/beam_PostCommit_Python35_VR_Flink/ws/src/sdks/python/apache_beam/runners/worker/operations.py",> line 779, in process
    o)
  File "<https://ci-beam.apache.org/job/beam_PostCommit_Python35_VR_Flink/ws/src/sdks/python/apache_beam/runners/common.py",> line 1224, in process_with_sized_restriction
    watermark_estimator_state=estimator_state)
  File "<https://ci-beam.apache.org/job/beam_PostCommit_Python35_VR_Flink/ws/src/sdks/python/apache_beam/runners/common.py",> line 723, in invoke_process
    windowed_value, additional_args, additional_kwargs)
  File "<https://ci-beam.apache.org/job/beam_PostCommit_Python35_VR_Flink/ws/src/sdks/python/apache_beam/runners/common.py",> line 872, in _invoke_process_per_window
    self.threadsafe_restriction_tracker.check_done()
  File "<https://ci-beam.apache.org/job/beam_PostCommit_Python35_VR_Flink/ws/src/sdks/python/apache_beam/runners/sdf_utils.py",> line 115, in check_done
    return self._restriction_tracker.check_done()
  File "<https://ci-beam.apache.org/job/beam_PostCommit_Python35_VR_Flink/ws/src/sdks/python/apache_beam/io/restriction_trackers.py",> line 106, in check_done
    self._range.stop))
ValueError: OffsetRestrictionTracker is not done since work in range [0, 6) has not been claimed.

	at org.apache.beam.runners.fnexecution.control.FnApiControlClient$ResponseStreamObserver.onNext(FnApiControlClient.java:177)
	at org.apache.beam.runners.fnexecution.control.FnApiControlClient$ResponseStreamObserver.onNext(FnApiControlClient.java:157)
	at org.apache.beam.vendor.grpc.v1p26p0.io.grpc.stub.ServerCalls$StreamingServerCallHandler$StreamingServerCallListener.onMessage(ServerCalls.java:251)
	at org.apache.beam.vendor.grpc.v1p26p0.io.grpc.ForwardingServerCallListener.onMessage(ForwardingServerCallListener.java:33)
	at org.apache.beam.vendor.grpc.v1p26p0.io.grpc.Contexts$ContextualizedServerCallListener.onMessage(Contexts.java:76)
	at org.apache.beam.vendor.grpc.v1p26p0.io.grpc.internal.ServerCallImpl$ServerStreamListenerImpl.messagesAvailableInternal(ServerCallImpl.java:309)
	at org.apache.beam.vendor.grpc.v1p26p0.io.grpc.internal.ServerCallImpl$ServerStreamListenerImpl.messagesAvailable(ServerCallImpl.java:292)
	at org.apache.beam.vendor.grpc.v1p26p0.io.grpc.internal.ServerImpl$JumpToApplicationThreadServerStreamListener$1MessagesAvailable.runInContext(ServerImpl.java:782)
	at org.apache.beam.vendor.grpc.v1p26p0.io.grpc.internal.ContextRunnable.run(ContextRunnable.java:37)
	at org.apache.beam.vendor.grpc.v1p26p0.io.grpc.internal.SerializingExecutor.run(SerializingExecutor.java:123)
	at java.util.concurrent.ThreadPoolExecutor.runWorker(ThreadPoolExecutor.java:1149)
	at java.util.concurrent.ThreadPoolExecutor$Worker.run(ThreadPoolExecutor.java:624)
	... 1 more
ERROR:root:java.lang.RuntimeException: Error received from SDK harness for instruction 5: Traceback (most recent call last):
  File "<https://ci-beam.apache.org/job/beam_PostCommit_Python35_VR_Flink/ws/src/sdks/python/apache_beam/runners/worker/sdk_worker.py",> line 256, in _execute
    response = task()
  File "<https://ci-beam.apache.org/job/beam_PostCommit_Python35_VR_Flink/ws/src/sdks/python/apache_beam/runners/worker/sdk_worker.py",> line 313, in <lambda>
    lambda: self.create_worker().do_instruction(request), request)
  File "<https://ci-beam.apache.org/job/beam_PostCommit_Python35_VR_Flink/ws/src/sdks/python/apache_beam/runners/worker/sdk_worker.py",> line 483, in do_instruction
    getattr(request, request_type), request.instruction_id)
  File "<https://ci-beam.apache.org/job/beam_PostCommit_Python35_VR_Flink/ws/src/sdks/python/apache_beam/runners/worker/sdk_worker.py",> line 518, in process_bundle
    bundle_processor.process_bundle(instruction_id))
  File "<https://ci-beam.apache.org/job/beam_PostCommit_Python35_VR_Flink/ws/src/sdks/python/apache_beam/runners/worker/bundle_processor.py",> line 983, in process_bundle
    element.data)
  File "<https://ci-beam.apache.org/job/beam_PostCommit_Python35_VR_Flink/ws/src/sdks/python/apache_beam/runners/worker/bundle_processor.py",> line 219, in process_encoded
    self.output(decoded_value)
  File "<https://ci-beam.apache.org/job/beam_PostCommit_Python35_VR_Flink/ws/src/sdks/python/apache_beam/runners/worker/operations.py",> line 332, in output
    cython.cast(Receiver, self.receivers[output_index]).receive(windowed_value)
  File "<https://ci-beam.apache.org/job/beam_PostCommit_Python35_VR_Flink/ws/src/sdks/python/apache_beam/runners/worker/operations.py",> line 195, in receive
    self.consumer.process(windowed_value)
  File "<https://ci-beam.apache.org/job/beam_PostCommit_Python35_VR_Flink/ws/src/sdks/python/apache_beam/runners/worker/operations.py",> line 779, in process
    o)
  File "<https://ci-beam.apache.org/job/beam_PostCommit_Python35_VR_Flink/ws/src/sdks/python/apache_beam/runners/common.py",> line 1224, in process_with_sized_restriction
    watermark_estimator_state=estimator_state)
  File "<https://ci-beam.apache.org/job/beam_PostCommit_Python35_VR_Flink/ws/src/sdks/python/apache_beam/runners/common.py",> line 723, in invoke_process
    windowed_value, additional_args, additional_kwargs)
  File "<https://ci-beam.apache.org/job/beam_PostCommit_Python35_VR_Flink/ws/src/sdks/python/apache_beam/runners/common.py",> line 872, in _invoke_process_per_window
    self.threadsafe_restriction_tracker.check_done()
  File "<https://ci-beam.apache.org/job/beam_PostCommit_Python35_VR_Flink/ws/src/sdks/python/apache_beam/runners/sdf_utils.py",> line 115, in check_done
    return self._restriction_tracker.check_done()
  File "<https://ci-beam.apache.org/job/beam_PostCommit_Python35_VR_Flink/ws/src/sdks/python/apache_beam/io/restriction_trackers.py",> line 106, in check_done
    self._range.stop))
ValueError: OffsetRestrictionTracker is not done since work in range [0, 6) has not been claimed.

INFO:apache_beam.runners.portability.portable_runner:Job state changed to FAILED
.sssssINFO:apache_beam.runners.worker.worker_pool_main:Listening for workers at localhost:35501
WARNING:root:Make sure that locally built Python SDK docker image has Python 3.5 interpreter.
INFO:root:Using Python SDK docker image: apache/beam_python3.5_sdk:2.25.0.dev. If the image is not available at local, we will try to pull from hub.docker.com
INFO:apache_beam.runners.portability.portable_runner:Environment "LOOPBACK" has started a component necessary for the execution. Be sure to run the pipeline using
  with Pipeline() as p:
    p.apply(..)
This ensures that the pipeline finishes before this program exits.
INFO:apache_beam.runners.portability.portable_runner:Job state changed to STOPPED
INFO:apache_beam.runners.portability.portable_runner:Job state changed to STARTING
INFO:apache_beam.runners.portability.portable_runner:Job state changed to RUNNING
[flink-runner-job-invoker] WARN org.apache.flink.runtime.webmonitor.WebMonitorUtils - Log file environment variable 'log.file' is not set.
[flink-runner-job-invoker] WARN org.apache.flink.runtime.webmonitor.WebMonitorUtils - JobManager log files are unavailable in the web dashboard. Log file location not found in environment variable 'log.file' or configuration key 'Key: 'web.log.path' , default: null (fallback keys: [{key=jobmanager.web.log.path, isDeprecated=true}])'.
[[5]{Create, Map(<lambda at fn_runner_test.py:490>), WindowInto(WindowIntoFn), Map(<lambda at fn_runner_test.py:493>)} (2/2)] WARN org.apache.flink.metrics.MetricGroup - The operator name [5]{Create, Map(<lambda at fn_runner_test.py:490>), WindowInto(WindowIntoFn), Map(<lambda at fn_runner_test.py:493>)} exceeded the 80 characters length limit and was truncated.
[[5]{Create, Map(<lambda at fn_runner_test.py:490>), WindowInto(WindowIntoFn), Map(<lambda at fn_runner_test.py:493>)} (1/2)] WARN org.apache.flink.metrics.MetricGroup - The operator name [5]{Create, Map(<lambda at fn_runner_test.py:490>), WindowInto(WindowIntoFn), Map(<lambda at fn_runner_test.py:493>)} exceeded the 80 characters length limit and was truncated.
INFO:apache_beam.runners.worker.statecache:Creating state cache with size 0
INFO:apache_beam.runners.worker.sdk_worker:Creating insecure control channel for localhost:46101.
INFO:apache_beam.runners.worker.sdk_worker:Control channel established.
INFO:apache_beam.runners.worker.sdk_worker:Initializing SDKHarness with unbounded number of workers.
INFO:apache_beam.runners.worker.sdk_worker:Creating insecure state channel for localhost:35381.
INFO:apache_beam.runners.worker.sdk_worker:State channel established.
INFO:apache_beam.runners.worker.data_plane:Creating client data channel for localhost:39987
INFO:apache_beam.runners.worker.sdk_worker:No more requests from control plane
INFO:apache_beam.runners.worker.sdk_worker:SDK Harness waiting for in-flight requests to complete
INFO:apache_beam.runners.worker.data_plane:Closing all cached grpc data channels.
INFO:apache_beam.runners.worker.sdk_worker:Closing all cached gRPC state handlers.
[assert_that/Group/GroupByKey -> [3]assert_that/{Group, Unkey, Match} (1/2)] WARN org.apache.beam.sdk.fn.data.BeamFnDataGrpcMultiplexer - Hanged up for unknown endpoint.
[grpc-default-executor-0] WARN org.apache.beam.sdk.fn.data.BeamFnDataGrpcMultiplexer - Hanged up for unknown endpoint.
INFO:apache_beam.runners.worker.sdk_worker:Done consuming work.
INFO:apache_beam.runners.portability.portable_runner:Job state changed to DONE
.INFO:apache_beam.runners.worker.worker_pool_main:Listening for workers at localhost:44841
WARNING:root:Make sure that locally built Python SDK docker image has Python 3.5 interpreter.
INFO:root:Using Python SDK docker image: apache/beam_python3.5_sdk:2.25.0.dev. If the image is not available at local, we will try to pull from hub.docker.com
INFO:apache_beam.runners.portability.portable_runner:Environment "LOOPBACK" has started a component necessary for the execution. Be sure to run the pipeline using
  with Pipeline() as p:
    p.apply(..)
This ensures that the pipeline finishes before this program exits.
INFO:apache_beam.runners.portability.portable_runner:Job state changed to STOPPED
INFO:apache_beam.runners.portability.portable_runner:Job state changed to STARTING
INFO:apache_beam.runners.portability.portable_runner:Job state changed to RUNNING
[flink-runner-job-invoker] WARN org.apache.flink.runtime.webmonitor.WebMonitorUtils - Log file environment variable 'log.file' is not set.
[flink-runner-job-invoker] WARN org.apache.flink.runtime.webmonitor.WebMonitorUtils - JobManager log files are unavailable in the web dashboard. Log file location not found in environment variable 'log.file' or configuration key 'Key: 'web.log.path' , default: null (fallback keys: [{key=jobmanager.web.log.path, isDeprecated=true}])'.
INFO:apache_beam.runners.worker.statecache:Creating state cache with size 0
INFO:apache_beam.runners.worker.sdk_worker:Creating insecure control channel for localhost:37221.
INFO:apache_beam.runners.worker.sdk_worker:Control channel established.
INFO:apache_beam.runners.worker.sdk_worker:Initializing SDKHarness with unbounded number of workers.
INFO:apache_beam.runners.worker.sdk_worker:Creating insecure state channel for localhost:45657.
INFO:apache_beam.runners.worker.sdk_worker:State channel established.
INFO:apache_beam.runners.worker.data_plane:Creating client data channel for localhost:42535
INFO:apache_beam.runners.worker.sdk_worker:No more requests from control plane
INFO:apache_beam.runners.worker.sdk_worker:SDK Harness waiting for in-flight requests to complete
INFO:apache_beam.runners.worker.data_plane:Closing all cached grpc data channels.
INFO:apache_beam.runners.worker.sdk_worker:Closing all cached gRPC state handlers.
[assert_that/Group/GroupByKey -> [3]assert_that/{Group, Unkey, Match} (1/2)] WARN org.apache.beam.sdk.fn.data.BeamFnDataGrpcMultiplexer - Hanged up for unknown endpoint.
INFO:apache_beam.runners.worker.sdk_worker:Done consuming work.
INFO:apache_beam.runners.portability.portable_runner:Job state changed to DONE
.INFO:__main__:removing conf dir: /tmp/flinktest-confgajluoij

----------------------------------------------------------------------
Ran 100 tests in 402.655s

OK (skipped=26)

FAILURE: Build failed with an exception.

* Where:
Script '<https://ci-beam.apache.org/job/beam_PostCommit_Python35_VR_Flink/ws/src/sdks/python/test-suites/portable/common.gradle'> line: 57

* What went wrong:
Execution failed for task ':sdks:python:test-suites:portable:py35:flinkCompatibilityMatrixBatchLOOPBACK'.
> Process 'command 'sh'' finished with non-zero exit value 1

* Try:
Run with --stacktrace option to get the stack trace. Run with --info or --debug option to get more log output. Run with --scan to get full insights.

* Get more help at https://help.gradle.org

Deprecated Gradle features were used in this build, making it incompatible with Gradle 6.0.
Use '--warning-mode all' to show the individual deprecation warnings.
See https://docs.gradle.org/5.2.1/userguide/command_line_interface.html#sec:command_line_warnings

BUILD FAILED in 46m 7s
108 actionable tasks: 79 executed, 28 from cache, 1 up-to-date

Publishing build scan...
https://gradle.com/s/oa3na7kam6gnq

Build step 'Invoke Gradle script' changed build result to FAILURE
Build step 'Invoke Gradle script' marked build as failure

---------------------------------------------------------------------
To unsubscribe, e-mail: builds-unsubscribe@beam.apache.org
For additional commands, e-mail: builds-help@beam.apache.org


Build failed in Jenkins: beam_PostCommit_Python35_VR_Flink #2411

Posted by Apache Jenkins Server <je...@builds.apache.org>.
See <https://ci-beam.apache.org/job/beam_PostCommit_Python35_VR_Flink/2411/display/redirect?page=changes>

Changes:

[neville.lyh] [BEAM-10612] Add flink 1.11 runner

[Luke Cwik] [BEAM-8025] Update tests to use TemporaryFolder instead of rolling their


------------------------------------------
[...truncated 3.04 MB...]
	at scala.PartialFunction$class.applyOrElse(PartialFunction.scala:123)
	at akka.japi.pf.UnitCaseStatement.applyOrElse(CaseStatements.scala:21)
	at scala.PartialFunction$OrElse.applyOrElse(PartialFunction.scala:170)
	at scala.PartialFunction$OrElse.applyOrElse(PartialFunction.scala:171)
	at scala.PartialFunction$OrElse.applyOrElse(PartialFunction.scala:171)
	at akka.actor.Actor$class.aroundReceive(Actor.scala:517)
	at akka.actor.AbstractActor.aroundReceive(AbstractActor.scala:225)
	at akka.actor.ActorCell.receiveMessage(ActorCell.scala:592)
	at akka.actor.ActorCell.invoke(ActorCell.scala:561)
	at akka.dispatch.Mailbox.processMailbox(Mailbox.scala:258)
	at akka.dispatch.Mailbox.run(Mailbox.scala:225)
	at akka.dispatch.Mailbox.exec(Mailbox.scala:235)
	... 4 more
Caused by: java.lang.RuntimeException: Failed to finish remote bundle
	at org.apache.beam.runners.flink.translation.wrappers.streaming.ExecutableStageDoFnOperator$SdkHarnessDoFnRunner.finishBundle(ExecutableStageDoFnOperator.java:769)
	at org.apache.beam.runners.flink.metrics.DoFnRunnerWithMetricsUpdate.finishBundle(DoFnRunnerWithMetricsUpdate.java:89)
	at org.apache.beam.runners.core.SimplePushbackSideInputDoFnRunner.finishBundle(SimplePushbackSideInputDoFnRunner.java:124)
	at org.apache.beam.runners.flink.translation.wrappers.streaming.DoFnOperator.invokeFinishBundle(DoFnOperator.java:841)
	at org.apache.beam.runners.flink.translation.wrappers.streaming.ExecutableStageDoFnOperator.close(ExecutableStageDoFnOperator.java:489)
	at org.apache.flink.streaming.runtime.tasks.StreamTask.closeAllOperators(StreamTask.java:618)
	at org.apache.flink.streaming.runtime.tasks.StreamTask.lambda$afterInvoke$1(StreamTask.java:498)
	at org.apache.flink.streaming.runtime.tasks.StreamTaskActionExecutor$SynchronizedStreamTaskActionExecutor.runThrowing(StreamTaskActionExecutor.java:94)
	at org.apache.flink.streaming.runtime.tasks.StreamTask.afterInvoke(StreamTask.java:496)
	at org.apache.flink.streaming.runtime.tasks.StreamTask.invoke(StreamTask.java:477)
	at org.apache.flink.runtime.taskmanager.Task.doRun(Task.java:708)
	at org.apache.flink.runtime.taskmanager.Task.run(Task.java:533)
	at java.lang.Thread.run(Thread.java:748)
Caused by: java.util.concurrent.ExecutionException: java.lang.RuntimeException: Error received from SDK harness for instruction 5: Traceback (most recent call last):
  File "<https://ci-beam.apache.org/job/beam_PostCommit_Python35_VR_Flink/ws/src/sdks/python/apache_beam/runners/worker/sdk_worker.py",> line 256, in _execute
    response = task()
  File "<https://ci-beam.apache.org/job/beam_PostCommit_Python35_VR_Flink/ws/src/sdks/python/apache_beam/runners/worker/sdk_worker.py",> line 313, in <lambda>
    lambda: self.create_worker().do_instruction(request), request)
  File "<https://ci-beam.apache.org/job/beam_PostCommit_Python35_VR_Flink/ws/src/sdks/python/apache_beam/runners/worker/sdk_worker.py",> line 483, in do_instruction
    getattr(request, request_type), request.instruction_id)
  File "<https://ci-beam.apache.org/job/beam_PostCommit_Python35_VR_Flink/ws/src/sdks/python/apache_beam/runners/worker/sdk_worker.py",> line 518, in process_bundle
    bundle_processor.process_bundle(instruction_id))
  File "<https://ci-beam.apache.org/job/beam_PostCommit_Python35_VR_Flink/ws/src/sdks/python/apache_beam/runners/worker/bundle_processor.py",> line 983, in process_bundle
    element.data)
  File "<https://ci-beam.apache.org/job/beam_PostCommit_Python35_VR_Flink/ws/src/sdks/python/apache_beam/runners/worker/bundle_processor.py",> line 219, in process_encoded
    self.output(decoded_value)
  File "<https://ci-beam.apache.org/job/beam_PostCommit_Python35_VR_Flink/ws/src/sdks/python/apache_beam/runners/worker/operations.py",> line 332, in output
    cython.cast(Receiver, self.receivers[output_index]).receive(windowed_value)
  File "<https://ci-beam.apache.org/job/beam_PostCommit_Python35_VR_Flink/ws/src/sdks/python/apache_beam/runners/worker/operations.py",> line 195, in receive
    self.consumer.process(windowed_value)
  File "<https://ci-beam.apache.org/job/beam_PostCommit_Python35_VR_Flink/ws/src/sdks/python/apache_beam/runners/worker/operations.py",> line 779, in process
    o)
  File "<https://ci-beam.apache.org/job/beam_PostCommit_Python35_VR_Flink/ws/src/sdks/python/apache_beam/runners/common.py",> line 1224, in process_with_sized_restriction
    watermark_estimator_state=estimator_state)
  File "<https://ci-beam.apache.org/job/beam_PostCommit_Python35_VR_Flink/ws/src/sdks/python/apache_beam/runners/common.py",> line 723, in invoke_process
    windowed_value, additional_args, additional_kwargs)
  File "<https://ci-beam.apache.org/job/beam_PostCommit_Python35_VR_Flink/ws/src/sdks/python/apache_beam/runners/common.py",> line 872, in _invoke_process_per_window
    self.threadsafe_restriction_tracker.check_done()
  File "<https://ci-beam.apache.org/job/beam_PostCommit_Python35_VR_Flink/ws/src/sdks/python/apache_beam/runners/sdf_utils.py",> line 115, in check_done
    return self._restriction_tracker.check_done()
  File "<https://ci-beam.apache.org/job/beam_PostCommit_Python35_VR_Flink/ws/src/sdks/python/apache_beam/io/restriction_trackers.py",> line 106, in check_done
    self._range.stop))
ValueError: OffsetRestrictionTracker is not done since work in range [0, 3) has not been claimed.

	at java.util.concurrent.CompletableFuture.reportGet(CompletableFuture.java:357)
	at java.util.concurrent.CompletableFuture.get(CompletableFuture.java:1908)
	at org.apache.beam.sdk.util.MoreFutures.get(MoreFutures.java:57)
	at org.apache.beam.runners.fnexecution.control.SdkHarnessClient$BundleProcessor$ActiveBundle.close(SdkHarnessClient.java:493)
	at org.apache.beam.runners.fnexecution.control.DefaultJobBundleFactory$SimpleStageBundleFactory$1.close(DefaultJobBundleFactory.java:547)
	at org.apache.beam.runners.flink.translation.wrappers.streaming.ExecutableStageDoFnOperator$SdkHarnessDoFnRunner.finishBundle(ExecutableStageDoFnOperator.java:763)
	... 12 more
Caused by: java.lang.RuntimeException: Error received from SDK harness for instruction 5: Traceback (most recent call last):
  File "<https://ci-beam.apache.org/job/beam_PostCommit_Python35_VR_Flink/ws/src/sdks/python/apache_beam/runners/worker/sdk_worker.py",> line 256, in _execute
    response = task()
  File "<https://ci-beam.apache.org/job/beam_PostCommit_Python35_VR_Flink/ws/src/sdks/python/apache_beam/runners/worker/sdk_worker.py",> line 313, in <lambda>
    lambda: self.create_worker().do_instruction(request), request)
  File "<https://ci-beam.apache.org/job/beam_PostCommit_Python35_VR_Flink/ws/src/sdks/python/apache_beam/runners/worker/sdk_worker.py",> line 483, in do_instruction
    getattr(request, request_type), request.instruction_id)
  File "<https://ci-beam.apache.org/job/beam_PostCommit_Python35_VR_Flink/ws/src/sdks/python/apache_beam/runners/worker/sdk_worker.py",> line 518, in process_bundle
    bundle_processor.process_bundle(instruction_id))
  File "<https://ci-beam.apache.org/job/beam_PostCommit_Python35_VR_Flink/ws/src/sdks/python/apache_beam/runners/worker/bundle_processor.py",> line 983, in process_bundle
    element.data)
  File "<https://ci-beam.apache.org/job/beam_PostCommit_Python35_VR_Flink/ws/src/sdks/python/apache_beam/runners/worker/bundle_processor.py",> line 219, in process_encoded
    self.output(decoded_value)
  File "<https://ci-beam.apache.org/job/beam_PostCommit_Python35_VR_Flink/ws/src/sdks/python/apache_beam/runners/worker/operations.py",> line 332, in output
    cython.cast(Receiver, self.receivers[output_index]).receive(windowed_value)
  File "<https://ci-beam.apache.org/job/beam_PostCommit_Python35_VR_Flink/ws/src/sdks/python/apache_beam/runners/worker/operations.py",> line 195, in receive
    self.consumer.process(windowed_value)
  File "<https://ci-beam.apache.org/job/beam_PostCommit_Python35_VR_Flink/ws/src/sdks/python/apache_beam/runners/worker/operations.py",> line 779, in process
    o)
  File "<https://ci-beam.apache.org/job/beam_PostCommit_Python35_VR_Flink/ws/src/sdks/python/apache_beam/runners/common.py",> line 1224, in process_with_sized_restriction
    watermark_estimator_state=estimator_state)
  File "<https://ci-beam.apache.org/job/beam_PostCommit_Python35_VR_Flink/ws/src/sdks/python/apache_beam/runners/common.py",> line 723, in invoke_process
    windowed_value, additional_args, additional_kwargs)
  File "<https://ci-beam.apache.org/job/beam_PostCommit_Python35_VR_Flink/ws/src/sdks/python/apache_beam/runners/common.py",> line 872, in _invoke_process_per_window
    self.threadsafe_restriction_tracker.check_done()
  File "<https://ci-beam.apache.org/job/beam_PostCommit_Python35_VR_Flink/ws/src/sdks/python/apache_beam/runners/sdf_utils.py",> line 115, in check_done
    return self._restriction_tracker.check_done()
  File "<https://ci-beam.apache.org/job/beam_PostCommit_Python35_VR_Flink/ws/src/sdks/python/apache_beam/io/restriction_trackers.py",> line 106, in check_done
    self._range.stop))
ValueError: OffsetRestrictionTracker is not done since work in range [0, 3) has not been claimed.

	at org.apache.beam.runners.fnexecution.control.FnApiControlClient$ResponseStreamObserver.onNext(FnApiControlClient.java:177)
	at org.apache.beam.runners.fnexecution.control.FnApiControlClient$ResponseStreamObserver.onNext(FnApiControlClient.java:157)
	at org.apache.beam.vendor.grpc.v1p26p0.io.grpc.stub.ServerCalls$StreamingServerCallHandler$StreamingServerCallListener.onMessage(ServerCalls.java:251)
	at org.apache.beam.vendor.grpc.v1p26p0.io.grpc.ForwardingServerCallListener.onMessage(ForwardingServerCallListener.java:33)
	at org.apache.beam.vendor.grpc.v1p26p0.io.grpc.Contexts$ContextualizedServerCallListener.onMessage(Contexts.java:76)
	at org.apache.beam.vendor.grpc.v1p26p0.io.grpc.internal.ServerCallImpl$ServerStreamListenerImpl.messagesAvailableInternal(ServerCallImpl.java:309)
	at org.apache.beam.vendor.grpc.v1p26p0.io.grpc.internal.ServerCallImpl$ServerStreamListenerImpl.messagesAvailable(ServerCallImpl.java:292)
	at org.apache.beam.vendor.grpc.v1p26p0.io.grpc.internal.ServerImpl$JumpToApplicationThreadServerStreamListener$1MessagesAvailable.runInContext(ServerImpl.java:782)
	at org.apache.beam.vendor.grpc.v1p26p0.io.grpc.internal.ContextRunnable.run(ContextRunnable.java:37)
	at org.apache.beam.vendor.grpc.v1p26p0.io.grpc.internal.SerializingExecutor.run(SerializingExecutor.java:123)
	at java.util.concurrent.ThreadPoolExecutor.runWorker(ThreadPoolExecutor.java:1149)
	at java.util.concurrent.ThreadPoolExecutor$Worker.run(ThreadPoolExecutor.java:624)
	... 1 more
ERROR:root:java.lang.RuntimeException: Error received from SDK harness for instruction 5: Traceback (most recent call last):
  File "<https://ci-beam.apache.org/job/beam_PostCommit_Python35_VR_Flink/ws/src/sdks/python/apache_beam/runners/worker/sdk_worker.py",> line 256, in _execute
    response = task()
  File "<https://ci-beam.apache.org/job/beam_PostCommit_Python35_VR_Flink/ws/src/sdks/python/apache_beam/runners/worker/sdk_worker.py",> line 313, in <lambda>
    lambda: self.create_worker().do_instruction(request), request)
  File "<https://ci-beam.apache.org/job/beam_PostCommit_Python35_VR_Flink/ws/src/sdks/python/apache_beam/runners/worker/sdk_worker.py",> line 483, in do_instruction
    getattr(request, request_type), request.instruction_id)
  File "<https://ci-beam.apache.org/job/beam_PostCommit_Python35_VR_Flink/ws/src/sdks/python/apache_beam/runners/worker/sdk_worker.py",> line 518, in process_bundle
    bundle_processor.process_bundle(instruction_id))
  File "<https://ci-beam.apache.org/job/beam_PostCommit_Python35_VR_Flink/ws/src/sdks/python/apache_beam/runners/worker/bundle_processor.py",> line 983, in process_bundle
    element.data)
  File "<https://ci-beam.apache.org/job/beam_PostCommit_Python35_VR_Flink/ws/src/sdks/python/apache_beam/runners/worker/bundle_processor.py",> line 219, in process_encoded
    self.output(decoded_value)
  File "<https://ci-beam.apache.org/job/beam_PostCommit_Python35_VR_Flink/ws/src/sdks/python/apache_beam/runners/worker/operations.py",> line 332, in output
    cython.cast(Receiver, self.receivers[output_index]).receive(windowed_value)
  File "<https://ci-beam.apache.org/job/beam_PostCommit_Python35_VR_Flink/ws/src/sdks/python/apache_beam/runners/worker/operations.py",> line 195, in receive
    self.consumer.process(windowed_value)
  File "<https://ci-beam.apache.org/job/beam_PostCommit_Python35_VR_Flink/ws/src/sdks/python/apache_beam/runners/worker/operations.py",> line 779, in process
    o)
  File "<https://ci-beam.apache.org/job/beam_PostCommit_Python35_VR_Flink/ws/src/sdks/python/apache_beam/runners/common.py",> line 1224, in process_with_sized_restriction
    watermark_estimator_state=estimator_state)
  File "<https://ci-beam.apache.org/job/beam_PostCommit_Python35_VR_Flink/ws/src/sdks/python/apache_beam/runners/common.py",> line 723, in invoke_process
    windowed_value, additional_args, additional_kwargs)
  File "<https://ci-beam.apache.org/job/beam_PostCommit_Python35_VR_Flink/ws/src/sdks/python/apache_beam/runners/common.py",> line 872, in _invoke_process_per_window
    self.threadsafe_restriction_tracker.check_done()
  File "<https://ci-beam.apache.org/job/beam_PostCommit_Python35_VR_Flink/ws/src/sdks/python/apache_beam/runners/sdf_utils.py",> line 115, in check_done
    return self._restriction_tracker.check_done()
  File "<https://ci-beam.apache.org/job/beam_PostCommit_Python35_VR_Flink/ws/src/sdks/python/apache_beam/io/restriction_trackers.py",> line 106, in check_done
    self._range.stop))
ValueError: OffsetRestrictionTracker is not done since work in range [0, 3) has not been claimed.

INFO:apache_beam.runners.portability.portable_runner:Job state changed to FAILED
.sssssINFO:apache_beam.runners.worker.worker_pool_main:Listening for workers at localhost:41115
WARNING:root:Make sure that locally built Python SDK docker image has Python 3.5 interpreter.
INFO:root:Using Python SDK docker image: apache/beam_python3.5_sdk:2.25.0.dev. If the image is not available at local, we will try to pull from hub.docker.com
INFO:apache_beam.runners.portability.portable_runner:Environment "LOOPBACK" has started a component necessary for the execution. Be sure to run the pipeline using
  with Pipeline() as p:
    p.apply(..)
This ensures that the pipeline finishes before this program exits.
INFO:apache_beam.runners.portability.portable_runner:Job state changed to STOPPED
INFO:apache_beam.runners.portability.portable_runner:Job state changed to STARTING
INFO:apache_beam.runners.portability.portable_runner:Job state changed to RUNNING
[flink-runner-job-invoker] WARN org.apache.flink.runtime.webmonitor.WebMonitorUtils - Log file environment variable 'log.file' is not set.
[flink-runner-job-invoker] WARN org.apache.flink.runtime.webmonitor.WebMonitorUtils - JobManager log files are unavailable in the web dashboard. Log file location not found in environment variable 'log.file' or configuration key 'Key: 'web.log.path' , default: null (fallback keys: [{key=jobmanager.web.log.path, isDeprecated=true}])'.
[[5]{Create, Map(<lambda at fn_runner_test.py:490>), WindowInto(WindowIntoFn), Map(<lambda at fn_runner_test.py:493>)} (1/2)] WARN org.apache.flink.metrics.MetricGroup - The operator name [5]{Create, Map(<lambda at fn_runner_test.py:490>), WindowInto(WindowIntoFn), Map(<lambda at fn_runner_test.py:493>)} exceeded the 80 characters length limit and was truncated.
[[5]{Create, Map(<lambda at fn_runner_test.py:490>), WindowInto(WindowIntoFn), Map(<lambda at fn_runner_test.py:493>)} (2/2)] WARN org.apache.flink.metrics.MetricGroup - The operator name [5]{Create, Map(<lambda at fn_runner_test.py:490>), WindowInto(WindowIntoFn), Map(<lambda at fn_runner_test.py:493>)} exceeded the 80 characters length limit and was truncated.
INFO:apache_beam.runners.worker.statecache:Creating state cache with size 0
INFO:apache_beam.runners.worker.sdk_worker:Creating insecure control channel for localhost:39381.
INFO:apache_beam.runners.worker.sdk_worker:Control channel established.
INFO:apache_beam.runners.worker.sdk_worker:Initializing SDKHarness with unbounded number of workers.
INFO:apache_beam.runners.worker.sdk_worker:Creating insecure state channel for localhost:37371.
INFO:apache_beam.runners.worker.sdk_worker:State channel established.
INFO:apache_beam.runners.worker.data_plane:Creating client data channel for localhost:40159
INFO:apache_beam.runners.worker.sdk_worker:No more requests from control plane
INFO:apache_beam.runners.worker.sdk_worker:SDK Harness waiting for in-flight requests to complete
[assert_that/Group/GroupByKey -> [3]assert_that/{Group, Unkey, Match} (1/2)] WARN org.apache.beam.sdk.fn.data.BeamFnDataGrpcMultiplexer - Hanged up for unknown endpoint.
INFO:apache_beam.runners.worker.data_plane:Closing all cached grpc data channels.
INFO:apache_beam.runners.worker.sdk_worker:Closing all cached gRPC state handlers.
INFO:apache_beam.runners.worker.sdk_worker:Done consuming work.
INFO:apache_beam.runners.portability.portable_runner:Job state changed to DONE
.INFO:apache_beam.runners.worker.worker_pool_main:Listening for workers at localhost:38417
WARNING:root:Make sure that locally built Python SDK docker image has Python 3.5 interpreter.
INFO:root:Using Python SDK docker image: apache/beam_python3.5_sdk:2.25.0.dev. If the image is not available at local, we will try to pull from hub.docker.com
INFO:apache_beam.runners.portability.portable_runner:Environment "LOOPBACK" has started a component necessary for the execution. Be sure to run the pipeline using
  with Pipeline() as p:
    p.apply(..)
This ensures that the pipeline finishes before this program exits.
INFO:apache_beam.runners.portability.portable_runner:Job state changed to STOPPED
INFO:apache_beam.runners.portability.portable_runner:Job state changed to STARTING
INFO:apache_beam.runners.portability.portable_runner:Job state changed to RUNNING
[flink-runner-job-invoker] WARN org.apache.flink.runtime.webmonitor.WebMonitorUtils - Log file environment variable 'log.file' is not set.
[flink-runner-job-invoker] WARN org.apache.flink.runtime.webmonitor.WebMonitorUtils - JobManager log files are unavailable in the web dashboard. Log file location not found in environment variable 'log.file' or configuration key 'Key: 'web.log.path' , default: null (fallback keys: [{key=jobmanager.web.log.path, isDeprecated=true}])'.
INFO:apache_beam.runners.worker.statecache:Creating state cache with size 0
INFO:apache_beam.runners.worker.sdk_worker:Creating insecure control channel for localhost:33805.
INFO:apache_beam.runners.worker.sdk_worker:Control channel established.
INFO:apache_beam.runners.worker.sdk_worker:Initializing SDKHarness with unbounded number of workers.
INFO:apache_beam.runners.worker.sdk_worker:Creating insecure state channel for localhost:35147.
INFO:apache_beam.runners.worker.sdk_worker:State channel established.
INFO:apache_beam.runners.worker.data_plane:Creating client data channel for localhost:33731
INFO:apache_beam.runners.worker.sdk_worker:No more requests from control plane
INFO:apache_beam.runners.worker.sdk_worker:SDK Harness waiting for in-flight requests to complete
INFO:apache_beam.runners.worker.data_plane:Closing all cached grpc data channels.
[assert_that/Group/GroupByKey -> [3]assert_that/{Group, Unkey, Match} (1/2)] WARN org.apache.beam.sdk.fn.data.BeamFnDataGrpcMultiplexer - Hanged up for unknown endpoint.
INFO:apache_beam.runners.worker.sdk_worker:Closing all cached gRPC state handlers.
INFO:apache_beam.runners.worker.sdk_worker:Done consuming work.
Aug 15, 2020 12:51:23 PM org.apache.beam.vendor.grpc.v1p26p0.io.grpc.internal.SerializingExecutor run
SEVERE: Exception while executing runnable org.apache.beam.vendor.grpc.v1p26p0.io.grpc.internal.ServerImpl$JumpToApplicationThreadServerStreamListener$1HalfClosed@3278d44d
java.lang.IllegalStateException: call already closed
	at org.apache.beam.vendor.grpc.v1p26p0.com.google.common.base.Preconditions.checkState(Preconditions.java:511)
	at org.apache.beam.vendor.grpc.v1p26p0.io.grpc.internal.ServerCallImpl.closeInternal(ServerCallImpl.java:209)
	at org.apache.beam.vendor.grpc.v1p26p0.io.grpc.internal.ServerCallImpl.close(ServerCallImpl.java:202)
	at org.apache.beam.vendor.grpc.v1p26p0.io.grpc.stub.ServerCalls$ServerCallStreamObserverImpl.onCompleted(ServerCalls.java:371)
	at org.apache.beam.runners.fnexecution.state.GrpcStateService$Inbound.onCompleted(GrpcStateService.java:150)
	at org.apache.beam.vendor.grpc.v1p26p0.io.grpc.stub.ServerCalls$StreamingServerCallHandler$StreamingServerCallListener.onHalfClose(ServerCalls.java:262)
	at org.apache.beam.vendor.grpc.v1p26p0.io.grpc.PartialForwardingServerCallListener.onHalfClose(PartialForwardingServerCallListener.java:35)
	at org.apache.beam.vendor.grpc.v1p26p0.io.grpc.ForwardingServerCallListener.onHalfClose(ForwardingServerCallListener.java:23)
	at org.apache.beam.vendor.grpc.v1p26p0.io.grpc.ForwardingServerCallListener$SimpleForwardingServerCallListener.onHalfClose(ForwardingServerCallListener.java:40)
	at org.apache.beam.vendor.grpc.v1p26p0.io.grpc.Contexts$ContextualizedServerCallListener.onHalfClose(Contexts.java:86)
	at org.apache.beam.vendor.grpc.v1p26p0.io.grpc.internal.ServerCallImpl$ServerStreamListenerImpl.halfClosed(ServerCallImpl.java:331)
	at org.apache.beam.vendor.grpc.v1p26p0.io.grpc.internal.ServerImpl$JumpToApplicationThreadServerStreamListener$1HalfClosed.runInContext(ServerImpl.java:817)
	at org.apache.beam.vendor.grpc.v1p26p0.io.grpc.internal.ContextRunnable.run(ContextRunnable.java:37)
	at org.apache.beam.vendor.grpc.v1p26p0.io.grpc.internal.SerializingExecutor.run(SerializingExecutor.java:123)
	at java.util.concurrent.ThreadPoolExecutor.runWorker(ThreadPoolExecutor.java:1149)
	at java.util.concurrent.ThreadPoolExecutor$Worker.run(ThreadPoolExecutor.java:624)
	at java.lang.Thread.run(Thread.java:748)

INFO:apache_beam.runners.portability.portable_runner:Job state changed to DONE
.INFO:__main__:removing conf dir: /tmp/flinktest-conf2oxcs3or

----------------------------------------------------------------------
Ran 100 tests in 336.745s

OK (skipped=26)

FAILURE: Build failed with an exception.

* Where:
Script '<https://ci-beam.apache.org/job/beam_PostCommit_Python35_VR_Flink/ws/src/sdks/python/test-suites/portable/common.gradle'> line: 57

* What went wrong:
Execution failed for task ':sdks:python:test-suites:portable:py35:flinkCompatibilityMatrixBatchLOOPBACK'.
> Process 'command 'sh'' finished with non-zero exit value 1

* Try:
Run with --stacktrace option to get the stack trace. Run with --info or --debug option to get more log output. Run with --scan to get full insights.

* Get more help at https://help.gradle.org

Deprecated Gradle features were used in this build, making it incompatible with Gradle 6.0.
Use '--warning-mode all' to show the individual deprecation warnings.
See https://docs.gradle.org/5.2.1/userguide/command_line_interface.html#sec:command_line_warnings

BUILD FAILED in 50m 56s
108 actionable tasks: 79 executed, 28 from cache, 1 up-to-date

Publishing build scan...
https://gradle.com/s/iignuru5zqhog

Build step 'Invoke Gradle script' changed build result to FAILURE
Build step 'Invoke Gradle script' marked build as failure

---------------------------------------------------------------------
To unsubscribe, e-mail: builds-unsubscribe@beam.apache.org
For additional commands, e-mail: builds-help@beam.apache.org


Build failed in Jenkins: beam_PostCommit_Python35_VR_Flink #2410

Posted by Apache Jenkins Server <je...@builds.apache.org>.
See <https://ci-beam.apache.org/job/beam_PostCommit_Python35_VR_Flink/2410/display/redirect?page=changes>

Changes:

[Boyuan Zhang] Scale progress with respect to windows observation.

[Robert Burke] Fix broken build.


------------------------------------------
[...truncated 3.04 MB...]
	at akka.dispatch.forkjoin.ForkJoinPool.runWorker(ForkJoinPool.java:1979)
	at akka.dispatch.forkjoin.ForkJoinWorkerThread.run(ForkJoinWorkerThread.java:107)
Caused by: org.apache.flink.runtime.JobException: Recovery is suppressed by NoRestartBackoffTimeStrategy
	at org.apache.flink.runtime.executiongraph.failover.flip1.ExecutionFailureHandler.handleFailure(ExecutionFailureHandler.java:110)
	at org.apache.flink.runtime.executiongraph.failover.flip1.ExecutionFailureHandler.getFailureHandlingResult(ExecutionFailureHandler.java:76)
	at org.apache.flink.runtime.scheduler.DefaultScheduler.handleTaskFailure(DefaultScheduler.java:192)
	at org.apache.flink.runtime.scheduler.DefaultScheduler.maybeHandleTaskFailure(DefaultScheduler.java:186)
	at org.apache.flink.runtime.scheduler.DefaultScheduler.updateTaskExecutionStateInternal(DefaultScheduler.java:180)
	at org.apache.flink.runtime.scheduler.SchedulerBase.updateTaskExecutionState(SchedulerBase.java:496)
	at org.apache.flink.runtime.jobmaster.JobMaster.updateTaskExecutionState(JobMaster.java:380)
	at sun.reflect.GeneratedMethodAccessor28.invoke(Unknown Source)
	at sun.reflect.DelegatingMethodAccessorImpl.invoke(DelegatingMethodAccessorImpl.java:43)
	at java.lang.reflect.Method.invoke(Method.java:498)
	at org.apache.flink.runtime.rpc.akka.AkkaRpcActor.handleRpcInvocation(AkkaRpcActor.java:284)
	at org.apache.flink.runtime.rpc.akka.AkkaRpcActor.handleRpcMessage(AkkaRpcActor.java:199)
	at org.apache.flink.runtime.rpc.akka.FencedAkkaRpcActor.handleRpcMessage(FencedAkkaRpcActor.java:74)
	at org.apache.flink.runtime.rpc.akka.AkkaRpcActor.handleMessage(AkkaRpcActor.java:152)
	at akka.japi.pf.UnitCaseStatement.apply(CaseStatements.scala:26)
	at akka.japi.pf.UnitCaseStatement.apply(CaseStatements.scala:21)
	at scala.PartialFunction$class.applyOrElse(PartialFunction.scala:123)
	at akka.japi.pf.UnitCaseStatement.applyOrElse(CaseStatements.scala:21)
	at scala.PartialFunction$OrElse.applyOrElse(PartialFunction.scala:170)
	at scala.PartialFunction$OrElse.applyOrElse(PartialFunction.scala:171)
	at scala.PartialFunction$OrElse.applyOrElse(PartialFunction.scala:171)
	at akka.actor.Actor$class.aroundReceive(Actor.scala:517)
	at akka.actor.AbstractActor.aroundReceive(AbstractActor.scala:225)
	at akka.actor.ActorCell.receiveMessage(ActorCell.scala:592)
	at akka.actor.ActorCell.invoke(ActorCell.scala:561)
	at akka.dispatch.Mailbox.processMailbox(Mailbox.scala:258)
	at akka.dispatch.Mailbox.run(Mailbox.scala:225)
	at akka.dispatch.Mailbox.exec(Mailbox.scala:235)
	... 4 more
Caused by: java.lang.RuntimeException: Failed to finish remote bundle
	at org.apache.beam.runners.flink.translation.wrappers.streaming.ExecutableStageDoFnOperator$SdkHarnessDoFnRunner.finishBundle(ExecutableStageDoFnOperator.java:769)
	at org.apache.beam.runners.flink.metrics.DoFnRunnerWithMetricsUpdate.finishBundle(DoFnRunnerWithMetricsUpdate.java:89)
	at org.apache.beam.runners.core.SimplePushbackSideInputDoFnRunner.finishBundle(SimplePushbackSideInputDoFnRunner.java:124)
	at org.apache.beam.runners.flink.translation.wrappers.streaming.DoFnOperator.invokeFinishBundle(DoFnOperator.java:838)
	at org.apache.beam.runners.flink.translation.wrappers.streaming.ExecutableStageDoFnOperator.close(ExecutableStageDoFnOperator.java:489)
	at org.apache.flink.streaming.runtime.tasks.StreamTask.closeAllOperators(StreamTask.java:618)
	at org.apache.flink.streaming.runtime.tasks.StreamTask.lambda$afterInvoke$1(StreamTask.java:498)
	at org.apache.flink.streaming.runtime.tasks.StreamTaskActionExecutor$SynchronizedStreamTaskActionExecutor.runThrowing(StreamTaskActionExecutor.java:94)
	at org.apache.flink.streaming.runtime.tasks.StreamTask.afterInvoke(StreamTask.java:496)
	at org.apache.flink.streaming.runtime.tasks.StreamTask.invoke(StreamTask.java:477)
	at org.apache.flink.runtime.taskmanager.Task.doRun(Task.java:708)
	at org.apache.flink.runtime.taskmanager.Task.run(Task.java:533)
	at java.lang.Thread.run(Thread.java:748)
Caused by: java.util.concurrent.ExecutionException: java.lang.RuntimeException: Error received from SDK harness for instruction 4: Traceback (most recent call last):
  File "<https://ci-beam.apache.org/job/beam_PostCommit_Python35_VR_Flink/ws/src/sdks/python/apache_beam/runners/worker/sdk_worker.py",> line 256, in _execute
    response = task()
  File "<https://ci-beam.apache.org/job/beam_PostCommit_Python35_VR_Flink/ws/src/sdks/python/apache_beam/runners/worker/sdk_worker.py",> line 313, in <lambda>
    lambda: self.create_worker().do_instruction(request), request)
  File "<https://ci-beam.apache.org/job/beam_PostCommit_Python35_VR_Flink/ws/src/sdks/python/apache_beam/runners/worker/sdk_worker.py",> line 483, in do_instruction
    getattr(request, request_type), request.instruction_id)
  File "<https://ci-beam.apache.org/job/beam_PostCommit_Python35_VR_Flink/ws/src/sdks/python/apache_beam/runners/worker/sdk_worker.py",> line 518, in process_bundle
    bundle_processor.process_bundle(instruction_id))
  File "<https://ci-beam.apache.org/job/beam_PostCommit_Python35_VR_Flink/ws/src/sdks/python/apache_beam/runners/worker/bundle_processor.py",> line 983, in process_bundle
    element.data)
  File "<https://ci-beam.apache.org/job/beam_PostCommit_Python35_VR_Flink/ws/src/sdks/python/apache_beam/runners/worker/bundle_processor.py",> line 219, in process_encoded
    self.output(decoded_value)
  File "<https://ci-beam.apache.org/job/beam_PostCommit_Python35_VR_Flink/ws/src/sdks/python/apache_beam/runners/worker/operations.py",> line 332, in output
    cython.cast(Receiver, self.receivers[output_index]).receive(windowed_value)
  File "<https://ci-beam.apache.org/job/beam_PostCommit_Python35_VR_Flink/ws/src/sdks/python/apache_beam/runners/worker/operations.py",> line 195, in receive
    self.consumer.process(windowed_value)
  File "<https://ci-beam.apache.org/job/beam_PostCommit_Python35_VR_Flink/ws/src/sdks/python/apache_beam/runners/worker/operations.py",> line 779, in process
    o)
  File "<https://ci-beam.apache.org/job/beam_PostCommit_Python35_VR_Flink/ws/src/sdks/python/apache_beam/runners/common.py",> line 1224, in process_with_sized_restriction
    watermark_estimator_state=estimator_state)
  File "<https://ci-beam.apache.org/job/beam_PostCommit_Python35_VR_Flink/ws/src/sdks/python/apache_beam/runners/common.py",> line 723, in invoke_process
    windowed_value, additional_args, additional_kwargs)
  File "<https://ci-beam.apache.org/job/beam_PostCommit_Python35_VR_Flink/ws/src/sdks/python/apache_beam/runners/common.py",> line 872, in _invoke_process_per_window
    self.threadsafe_restriction_tracker.check_done()
  File "<https://ci-beam.apache.org/job/beam_PostCommit_Python35_VR_Flink/ws/src/sdks/python/apache_beam/runners/sdf_utils.py",> line 115, in check_done
    return self._restriction_tracker.check_done()
  File "<https://ci-beam.apache.org/job/beam_PostCommit_Python35_VR_Flink/ws/src/sdks/python/apache_beam/io/restriction_trackers.py",> line 106, in check_done
    self._range.stop))
ValueError: OffsetRestrictionTracker is not done since work in range [0, 6) has not been claimed.

	at java.util.concurrent.CompletableFuture.reportGet(CompletableFuture.java:357)
	at java.util.concurrent.CompletableFuture.get(CompletableFuture.java:1908)
	at org.apache.beam.sdk.util.MoreFutures.get(MoreFutures.java:57)
	at org.apache.beam.runners.fnexecution.control.SdkHarnessClient$BundleProcessor$ActiveBundle.close(SdkHarnessClient.java:493)
	at org.apache.beam.runners.fnexecution.control.DefaultJobBundleFactory$SimpleStageBundleFactory$1.close(DefaultJobBundleFactory.java:547)
	at org.apache.beam.runners.flink.translation.wrappers.streaming.ExecutableStageDoFnOperator$SdkHarnessDoFnRunner.finishBundle(ExecutableStageDoFnOperator.java:763)
	... 12 more
Caused by: java.lang.RuntimeException: Error received from SDK harness for instruction 4: Traceback (most recent call last):
  File "<https://ci-beam.apache.org/job/beam_PostCommit_Python35_VR_Flink/ws/src/sdks/python/apache_beam/runners/worker/sdk_worker.py",> line 256, in _execute
    response = task()
  File "<https://ci-beam.apache.org/job/beam_PostCommit_Python35_VR_Flink/ws/src/sdks/python/apache_beam/runners/worker/sdk_worker.py",> line 313, in <lambda>
    lambda: self.create_worker().do_instruction(request), request)
  File "<https://ci-beam.apache.org/job/beam_PostCommit_Python35_VR_Flink/ws/src/sdks/python/apache_beam/runners/worker/sdk_worker.py",> line 483, in do_instruction
    getattr(request, request_type), request.instruction_id)
  File "<https://ci-beam.apache.org/job/beam_PostCommit_Python35_VR_Flink/ws/src/sdks/python/apache_beam/runners/worker/sdk_worker.py",> line 518, in process_bundle
    bundle_processor.process_bundle(instruction_id))
  File "<https://ci-beam.apache.org/job/beam_PostCommit_Python35_VR_Flink/ws/src/sdks/python/apache_beam/runners/worker/bundle_processor.py",> line 983, in process_bundle
    element.data)
  File "<https://ci-beam.apache.org/job/beam_PostCommit_Python35_VR_Flink/ws/src/sdks/python/apache_beam/runners/worker/bundle_processor.py",> line 219, in process_encoded
    self.output(decoded_value)
  File "<https://ci-beam.apache.org/job/beam_PostCommit_Python35_VR_Flink/ws/src/sdks/python/apache_beam/runners/worker/operations.py",> line 332, in output
    cython.cast(Receiver, self.receivers[output_index]).receive(windowed_value)
  File "<https://ci-beam.apache.org/job/beam_PostCommit_Python35_VR_Flink/ws/src/sdks/python/apache_beam/runners/worker/operations.py",> line 195, in receive
    self.consumer.process(windowed_value)
  File "<https://ci-beam.apache.org/job/beam_PostCommit_Python35_VR_Flink/ws/src/sdks/python/apache_beam/runners/worker/operations.py",> line 779, in process
    o)
  File "<https://ci-beam.apache.org/job/beam_PostCommit_Python35_VR_Flink/ws/src/sdks/python/apache_beam/runners/common.py",> line 1224, in process_with_sized_restriction
    watermark_estimator_state=estimator_state)
  File "<https://ci-beam.apache.org/job/beam_PostCommit_Python35_VR_Flink/ws/src/sdks/python/apache_beam/runners/common.py",> line 723, in invoke_process
    windowed_value, additional_args, additional_kwargs)
  File "<https://ci-beam.apache.org/job/beam_PostCommit_Python35_VR_Flink/ws/src/sdks/python/apache_beam/runners/common.py",> line 872, in _invoke_process_per_window
    self.threadsafe_restriction_tracker.check_done()
  File "<https://ci-beam.apache.org/job/beam_PostCommit_Python35_VR_Flink/ws/src/sdks/python/apache_beam/runners/sdf_utils.py",> line 115, in check_done
    return self._restriction_tracker.check_done()
  File "<https://ci-beam.apache.org/job/beam_PostCommit_Python35_VR_Flink/ws/src/sdks/python/apache_beam/io/restriction_trackers.py",> line 106, in check_done
    self._range.stop))
ValueError: OffsetRestrictionTracker is not done since work in range [0, 6) has not been claimed.

	at org.apache.beam.runners.fnexecution.control.FnApiControlClient$ResponseStreamObserver.onNext(FnApiControlClient.java:177)
	at org.apache.beam.runners.fnexecution.control.FnApiControlClient$ResponseStreamObserver.onNext(FnApiControlClient.java:157)
	at org.apache.beam.vendor.grpc.v1p26p0.io.grpc.stub.ServerCalls$StreamingServerCallHandler$StreamingServerCallListener.onMessage(ServerCalls.java:251)
	at org.apache.beam.vendor.grpc.v1p26p0.io.grpc.ForwardingServerCallListener.onMessage(ForwardingServerCallListener.java:33)
	at org.apache.beam.vendor.grpc.v1p26p0.io.grpc.Contexts$ContextualizedServerCallListener.onMessage(Contexts.java:76)
	at org.apache.beam.vendor.grpc.v1p26p0.io.grpc.internal.ServerCallImpl$ServerStreamListenerImpl.messagesAvailableInternal(ServerCallImpl.java:309)
	at org.apache.beam.vendor.grpc.v1p26p0.io.grpc.internal.ServerCallImpl$ServerStreamListenerImpl.messagesAvailable(ServerCallImpl.java:292)
	at org.apache.beam.vendor.grpc.v1p26p0.io.grpc.internal.ServerImpl$JumpToApplicationThreadServerStreamListener$1MessagesAvailable.runInContext(ServerImpl.java:782)
	at org.apache.beam.vendor.grpc.v1p26p0.io.grpc.internal.ContextRunnable.run(ContextRunnable.java:37)
	at org.apache.beam.vendor.grpc.v1p26p0.io.grpc.internal.SerializingExecutor.run(SerializingExecutor.java:123)
	at java.util.concurrent.ThreadPoolExecutor.runWorker(ThreadPoolExecutor.java:1149)
	at java.util.concurrent.ThreadPoolExecutor$Worker.run(ThreadPoolExecutor.java:624)
	... 1 more
ERROR:root:java.lang.RuntimeException: Error received from SDK harness for instruction 4: Traceback (most recent call last):
  File "<https://ci-beam.apache.org/job/beam_PostCommit_Python35_VR_Flink/ws/src/sdks/python/apache_beam/runners/worker/sdk_worker.py",> line 256, in _execute
    response = task()
  File "<https://ci-beam.apache.org/job/beam_PostCommit_Python35_VR_Flink/ws/src/sdks/python/apache_beam/runners/worker/sdk_worker.py",> line 313, in <lambda>
    lambda: self.create_worker().do_instruction(request), request)
  File "<https://ci-beam.apache.org/job/beam_PostCommit_Python35_VR_Flink/ws/src/sdks/python/apache_beam/runners/worker/sdk_worker.py",> line 483, in do_instruction
    getattr(request, request_type), request.instruction_id)
  File "<https://ci-beam.apache.org/job/beam_PostCommit_Python35_VR_Flink/ws/src/sdks/python/apache_beam/runners/worker/sdk_worker.py",> line 518, in process_bundle
    bundle_processor.process_bundle(instruction_id))
  File "<https://ci-beam.apache.org/job/beam_PostCommit_Python35_VR_Flink/ws/src/sdks/python/apache_beam/runners/worker/bundle_processor.py",> line 983, in process_bundle
    element.data)
  File "<https://ci-beam.apache.org/job/beam_PostCommit_Python35_VR_Flink/ws/src/sdks/python/apache_beam/runners/worker/bundle_processor.py",> line 219, in process_encoded
    self.output(decoded_value)
  File "<https://ci-beam.apache.org/job/beam_PostCommit_Python35_VR_Flink/ws/src/sdks/python/apache_beam/runners/worker/operations.py",> line 332, in output
    cython.cast(Receiver, self.receivers[output_index]).receive(windowed_value)
  File "<https://ci-beam.apache.org/job/beam_PostCommit_Python35_VR_Flink/ws/src/sdks/python/apache_beam/runners/worker/operations.py",> line 195, in receive
    self.consumer.process(windowed_value)
  File "<https://ci-beam.apache.org/job/beam_PostCommit_Python35_VR_Flink/ws/src/sdks/python/apache_beam/runners/worker/operations.py",> line 779, in process
    o)
  File "<https://ci-beam.apache.org/job/beam_PostCommit_Python35_VR_Flink/ws/src/sdks/python/apache_beam/runners/common.py",> line 1224, in process_with_sized_restriction
    watermark_estimator_state=estimator_state)
  File "<https://ci-beam.apache.org/job/beam_PostCommit_Python35_VR_Flink/ws/src/sdks/python/apache_beam/runners/common.py",> line 723, in invoke_process
    windowed_value, additional_args, additional_kwargs)
  File "<https://ci-beam.apache.org/job/beam_PostCommit_Python35_VR_Flink/ws/src/sdks/python/apache_beam/runners/common.py",> line 872, in _invoke_process_per_window
    self.threadsafe_restriction_tracker.check_done()
  File "<https://ci-beam.apache.org/job/beam_PostCommit_Python35_VR_Flink/ws/src/sdks/python/apache_beam/runners/sdf_utils.py",> line 115, in check_done
    return self._restriction_tracker.check_done()
  File "<https://ci-beam.apache.org/job/beam_PostCommit_Python35_VR_Flink/ws/src/sdks/python/apache_beam/io/restriction_trackers.py",> line 106, in check_done
    self._range.stop))
ValueError: OffsetRestrictionTracker is not done since work in range [0, 6) has not been claimed.

INFO:apache_beam.runners.portability.portable_runner:Job state changed to FAILED
.sssssINFO:apache_beam.runners.worker.worker_pool_main:Listening for workers at localhost:44179
WARNING:root:Make sure that locally built Python SDK docker image has Python 3.5 interpreter.
INFO:root:Using Python SDK docker image: apache/beam_python3.5_sdk:2.25.0.dev. If the image is not available at local, we will try to pull from hub.docker.com
INFO:apache_beam.runners.portability.portable_runner:Environment "LOOPBACK" has started a component necessary for the execution. Be sure to run the pipeline using
  with Pipeline() as p:
    p.apply(..)
This ensures that the pipeline finishes before this program exits.
INFO:apache_beam.runners.portability.portable_runner:Job state changed to STOPPED
INFO:apache_beam.runners.portability.portable_runner:Job state changed to STARTING
INFO:apache_beam.runners.portability.portable_runner:Job state changed to RUNNING
[flink-runner-job-invoker] WARN org.apache.flink.runtime.webmonitor.WebMonitorUtils - Log file environment variable 'log.file' is not set.
[flink-runner-job-invoker] WARN org.apache.flink.runtime.webmonitor.WebMonitorUtils - JobManager log files are unavailable in the web dashboard. Log file location not found in environment variable 'log.file' or configuration key 'Key: 'web.log.path' , default: null (fallback keys: [{key=jobmanager.web.log.path, isDeprecated=true}])'.
[[5]{Create, Map(<lambda at fn_runner_test.py:490>), WindowInto(WindowIntoFn), Map(<lambda at fn_runner_test.py:493>)} (2/2)] WARN org.apache.flink.metrics.MetricGroup - The operator name [5]{Create, Map(<lambda at fn_runner_test.py:490>), WindowInto(WindowIntoFn), Map(<lambda at fn_runner_test.py:493>)} exceeded the 80 characters length limit and was truncated.
[[5]{Create, Map(<lambda at fn_runner_test.py:490>), WindowInto(WindowIntoFn), Map(<lambda at fn_runner_test.py:493>)} (1/2)] WARN org.apache.flink.metrics.MetricGroup - The operator name [5]{Create, Map(<lambda at fn_runner_test.py:490>), WindowInto(WindowIntoFn), Map(<lambda at fn_runner_test.py:493>)} exceeded the 80 characters length limit and was truncated.
INFO:apache_beam.runners.worker.statecache:Creating state cache with size 0
INFO:apache_beam.runners.worker.sdk_worker:Creating insecure control channel for localhost:45985.
INFO:apache_beam.runners.worker.sdk_worker:Control channel established.
INFO:apache_beam.runners.worker.sdk_worker:Initializing SDKHarness with unbounded number of workers.
INFO:apache_beam.runners.worker.sdk_worker:Creating insecure state channel for localhost:34729.
INFO:apache_beam.runners.worker.sdk_worker:State channel established.
INFO:apache_beam.runners.worker.data_plane:Creating client data channel for localhost:46649
INFO:apache_beam.runners.worker.sdk_worker:No more requests from control plane
INFO:apache_beam.runners.worker.sdk_worker:SDK Harness waiting for in-flight requests to complete
INFO:apache_beam.runners.worker.data_plane:Closing all cached grpc data channels.
INFO:apache_beam.runners.worker.sdk_worker:Closing all cached gRPC state handlers.
[assert_that/Group/GroupByKey -> [3]assert_that/{Group, Unkey, Match} (1/2)] WARN org.apache.beam.sdk.fn.data.BeamFnDataGrpcMultiplexer - Hanged up for unknown endpoint.
[grpc-default-executor-2] WARN org.apache.beam.sdk.fn.data.BeamFnDataGrpcMultiplexer - Hanged up for unknown endpoint.
INFO:apache_beam.runners.worker.sdk_worker:Done consuming work.
INFO:apache_beam.runners.portability.portable_runner:Job state changed to DONE
.INFO:apache_beam.runners.worker.worker_pool_main:Listening for workers at localhost:36219
WARNING:root:Make sure that locally built Python SDK docker image has Python 3.5 interpreter.
INFO:root:Using Python SDK docker image: apache/beam_python3.5_sdk:2.25.0.dev. If the image is not available at local, we will try to pull from hub.docker.com
INFO:apache_beam.runners.portability.portable_runner:Environment "LOOPBACK" has started a component necessary for the execution. Be sure to run the pipeline using
  with Pipeline() as p:
    p.apply(..)
This ensures that the pipeline finishes before this program exits.
INFO:apache_beam.runners.portability.portable_runner:Job state changed to STOPPED
INFO:apache_beam.runners.portability.portable_runner:Job state changed to STARTING
INFO:apache_beam.runners.portability.portable_runner:Job state changed to RUNNING
[flink-runner-job-invoker] WARN org.apache.flink.runtime.webmonitor.WebMonitorUtils - Log file environment variable 'log.file' is not set.
[flink-runner-job-invoker] WARN org.apache.flink.runtime.webmonitor.WebMonitorUtils - JobManager log files are unavailable in the web dashboard. Log file location not found in environment variable 'log.file' or configuration key 'Key: 'web.log.path' , default: null (fallback keys: [{key=jobmanager.web.log.path, isDeprecated=true}])'.
INFO:apache_beam.runners.worker.statecache:Creating state cache with size 0
INFO:apache_beam.runners.worker.sdk_worker:Creating insecure control channel for localhost:40051.
INFO:apache_beam.runners.worker.sdk_worker:Control channel established.
INFO:apache_beam.runners.worker.sdk_worker:Initializing SDKHarness with unbounded number of workers.
INFO:apache_beam.runners.worker.sdk_worker:Creating insecure state channel for localhost:39095.
INFO:apache_beam.runners.worker.sdk_worker:State channel established.
INFO:apache_beam.runners.worker.data_plane:Creating client data channel for localhost:37677
INFO:apache_beam.runners.worker.sdk_worker:No more requests from control plane
INFO:apache_beam.runners.worker.sdk_worker:SDK Harness waiting for in-flight requests to complete
INFO:apache_beam.runners.worker.data_plane:Closing all cached grpc data channels.
INFO:apache_beam.runners.worker.sdk_worker:Closing all cached gRPC state handlers.
INFO:apache_beam.runners.worker.sdk_worker:Done consuming work.
[assert_that/Group/GroupByKey -> [3]assert_that/{Group, Unkey, Match} (1/2)] WARN org.apache.beam.sdk.fn.data.BeamFnDataGrpcMultiplexer - Hanged up for unknown endpoint.
[grpc-default-executor-1] WARN org.apache.beam.sdk.fn.data.BeamFnDataGrpcMultiplexer - Hanged up for unknown endpoint.
INFO:apache_beam.runners.portability.portable_runner:Job state changed to DONE
.INFO:__main__:removing conf dir: /tmp/flinktest-confbuddcqje

----------------------------------------------------------------------
Ran 100 tests in 418.305s

OK (skipped=26)

FAILURE: Build failed with an exception.

* Where:
Script '<https://ci-beam.apache.org/job/beam_PostCommit_Python35_VR_Flink/ws/src/sdks/python/test-suites/portable/common.gradle'> line: 57

* What went wrong:
Execution failed for task ':sdks:python:test-suites:portable:py35:flinkCompatibilityMatrixBatchLOOPBACK'.
> Process 'command 'sh'' finished with non-zero exit value 1

* Try:
Run with --stacktrace option to get the stack trace. Run with --info or --debug option to get more log output. Run with --scan to get full insights.

* Get more help at https://help.gradle.org

Deprecated Gradle features were used in this build, making it incompatible with Gradle 6.0.
Use '--warning-mode all' to show the individual deprecation warnings.
See https://docs.gradle.org/5.2.1/userguide/command_line_interface.html#sec:command_line_warnings

BUILD FAILED in 1h 8m 4s
108 actionable tasks: 81 executed, 26 from cache, 1 up-to-date

Publishing build scan...
https://gradle.com/s/e4vfsygy7pbxs

Build step 'Invoke Gradle script' changed build result to FAILURE
Build step 'Invoke Gradle script' marked build as failure

---------------------------------------------------------------------
To unsubscribe, e-mail: builds-unsubscribe@beam.apache.org
For additional commands, e-mail: builds-help@beam.apache.org