You are viewing a plain text version of this content. The canonical link for it is here.
Posted to dev@poi.apache.org by Apache Jenkins Server <je...@builds.apache.org> on 2017/10/08 07:08:05 UTC
Build failed in Jenkins: POI-DSL-OpenJDK #286
See <https://builds.apache.org/job/POI-DSL-OpenJDK/286/display/redirect>
------------------------------------------
[...truncated 609.57 KB...]
[java] at org.apache.poi.poifs.filesystem.NPOIFSFileSystem.<init>(NPOIFSFileSystem.java:310)
[java] at org.apache.poi.hssf.usermodel.HSSFWorkbook.<init>(HSSFWorkbook.java:413)
[java] at org.apache.poi.hssf.usermodel.HSSFWorkbook.<init>(HSSFWorkbook.java:394)
[java] at org.apache.poi.hssf.HSSFTestDataSamples.writeOutAndReadBack(HSSFTestDataSamples.java:65)
[java] at org.apache.poi.hssf.HSSFITestDataProvider.writeOutAndReadBack(HSSFITestDataProvider.java:55)
[java] at org.apache.poi.xssf.usermodel.TestXSSFCell.testEncodingBelowAscii(TestXSSFCell.java:525)
[java] at sun.reflect.NativeMethodAccessorImpl.invoke0(Native Method)
[java] at sun.reflect.NativeMethodAccessorImpl.invoke(NativeMethodAccessorImpl.java:62)
[java] at sun.reflect.DelegatingMethodAccessorImpl.invoke(DelegatingMethodAccessorImpl.java:43)
[java] at java.lang.reflect.Method.invoke(Method.java:498)
[java] at org.junit.runners.model.FrameworkMethod$1.runReflectiveCall(FrameworkMethod.java:50)
[java] at org.junit.internal.runners.model.ReflectiveCallable.run(ReflectiveCallable.java:12)
[java] at org.junit.runners.model.FrameworkMethod.invokeExplosively(FrameworkMethod.java:47)
[java] at org.junit.internal.runners.statements.InvokeMethod.evaluate(InvokeMethod.java:17)
[java] at org.junit.runners.ParentRunner.runLeaf(ParentRunner.java:325)
[java] at org.junit.runners.BlockJUnit4ClassRunner.runChild(BlockJUnit4ClassRunner.java:78)
[java] at org.junit.runners.BlockJUnit4ClassRunner.runChild(BlockJUnit4ClassRunner.java:57)
[java] at org.junit.runners.ParentRunner$3.run(ParentRunner.java:290)
[java] at org.junit.runners.ParentRunner$1.schedule(ParentRunner.java:71)
[java] at org.junit.runners.ParentRunner.runChildren(ParentRunner.java:288)
[java] at org.junit.runners.ParentRunner.access$000(ParentRunner.java:58)
[java] at org.junit.runners.ParentRunner$2.evaluate(ParentRunner.java:268)
[java] at org.junit.runners.ParentRunner.run(ParentRunner.java:363)
[java] at org.junit.runners.Suite.runChild(Suite.java:128)
[java] at org.junit.runners.Suite.runChild(Suite.java:27)
[java] at org.junit.runners.ParentRunner$3.run(ParentRunner.java:290)
[java] at org.junit.runners.ParentRunner$1.schedule(ParentRunner.java:71)
[java] at org.junit.runners.ParentRunner.runChildren(ParentRunner.java:288)
[java] at org.junit.runners.ParentRunner.access$000(ParentRunner.java:58)
[java] at org.junit.runners.ParentRunner$2.evaluate(ParentRunner.java:268)
[java] at org.junit.runners.ParentRunner.run(ParentRunner.java:363)
[java] at org.junit.runner.JUnitCore.run(JUnitCore.java:137)
[java] at org.junit.runner.JUnitCore.run(JUnitCore.java:115)
[java] at org.junit.runner.JUnitCore.run(JUnitCore.java:105)
[java] at org.junit.runner.JUnitCore.run(JUnitCore.java:94)
[java] at org.apache.poi.util.OOXMLLite.build(OOXMLLite.java:149)
[java] at org.apache.poi.util.OOXMLLite.main(OOXMLLite.java:94)
[java] 147) testMultiSheetAreasHSSFandXSSF(org.apache.poi.xssf.usermodel.TestXSSFFormulaEvaluation)
[java] java.lang.NoSuchMethodError: java.nio.ByteBuffer.position(I)Ljava/nio/ByteBuffer;
[java] at org.apache.poi.poifs.filesystem.NPOIFSFileSystem.<init>(NPOIFSFileSystem.java:310)
[java] at org.apache.poi.hssf.usermodel.HSSFWorkbook.<init>(HSSFWorkbook.java:413)
[java] at org.apache.poi.hssf.usermodel.HSSFWorkbook.<init>(HSSFWorkbook.java:394)
[java] at org.apache.poi.hssf.HSSFTestDataSamples.openSampleWorkbook(HSSFTestDataSamples.java:50)
[java] at org.apache.poi.xssf.usermodel.TestXSSFFormulaEvaluation.testMultiSheetAreasHSSFandXSSF(TestXSSFFormulaEvaluation.java:333)
[java] at sun.reflect.NativeMethodAccessorImpl.invoke0(Native Method)
[java] at sun.reflect.NativeMethodAccessorImpl.invoke(NativeMethodAccessorImpl.java:62)
[java] at sun.reflect.DelegatingMethodAccessorImpl.invoke(DelegatingMethodAccessorImpl.java:43)
[java] at java.lang.reflect.Method.invoke(Method.java:498)
[java] at org.junit.runners.model.FrameworkMethod$1.runReflectiveCall(FrameworkMethod.java:50)
[java] at org.junit.internal.runners.model.ReflectiveCallable.run(ReflectiveCallable.java:12)
[java] at org.junit.runners.model.FrameworkMethod.invokeExplosively(FrameworkMethod.java:47)
[java] at org.junit.internal.runners.statements.InvokeMethod.evaluate(InvokeMethod.java:17)
[java] at org.junit.runners.ParentRunner.runLeaf(ParentRunner.java:325)
[java] at org.junit.runners.BlockJUnit4ClassRunner.runChild(BlockJUnit4ClassRunner.java:78)
[java] at org.junit.runners.BlockJUnit4ClassRunner.runChild(BlockJUnit4ClassRunner.java:57)
[java] at org.junit.runners.ParentRunner$3.run(ParentRunner.java:290)
[java] at org.junit.runners.ParentRunner$1.schedule(ParentRunner.java:71)
[java] at org.junit.runners.ParentRunner.runChildren(ParentRunner.java:288)
[java] at org.junit.runners.ParentRunner.access$000(ParentRunner.java:58)
[java] at org.junit.runners.ParentRunner$2.evaluate(ParentRunner.java:268)
[java] at org.junit.runners.ParentRunner.run(ParentRunner.java:363)
[java] at org.junit.runners.Suite.runChild(Suite.java:128)
[java] at org.junit.runners.Suite.runChild(Suite.java:27)
[java] at org.junit.runners.ParentRunner$3.run(ParentRunner.java:290)
[java] at org.junit.runners.ParentRunner$1.schedule(ParentRunner.java:71)
[java] at org.junit.runners.ParentRunner.runChildren(ParentRunner.java:288)
[java] at org.junit.runners.ParentRunner.access$000(ParentRunner.java:58)
[java] at org.junit.runners.ParentRunner$2.evaluate(ParentRunner.java:268)
[java] at org.junit.runners.ParentRunner.run(ParentRunner.java:363)
[java] at org.junit.runner.JUnitCore.run(JUnitCore.java:137)
[java] at org.junit.runner.JUnitCore.run(JUnitCore.java:115)
[java] at org.junit.runner.JUnitCore.run(JUnitCore.java:105)
[java] at org.junit.runner.JUnitCore.run(JUnitCore.java:94)
[java] at org.apache.poi.util.OOXMLLite.build(OOXMLLite.java:149)
[java] at org.apache.poi.util.OOXMLLite.main(OOXMLLite.java:94)
[java] 148) testReferencesToOtherWorkbooks(org.apache.poi.xssf.usermodel.TestXSSFFormulaEvaluation)
[java] java.lang.NoSuchMethodError: java.nio.ByteBuffer.position(I)Ljava/nio/ByteBuffer;
[java] at org.apache.poi.poifs.filesystem.NPOIFSFileSystem.<init>(NPOIFSFileSystem.java:310)
[java] at org.apache.poi.hssf.usermodel.HSSFWorkbook.<init>(HSSFWorkbook.java:413)
[java] at org.apache.poi.hssf.usermodel.HSSFWorkbook.<init>(HSSFWorkbook.java:394)
[java] at org.apache.poi.hssf.HSSFTestDataSamples.openSampleWorkbook(HSSFTestDataSamples.java:50)
[java] at org.apache.poi.xssf.usermodel.TestXSSFFormulaEvaluation.testReferencesToOtherWorkbooks(TestXSSFFormulaEvaluation.java:165)
[java] at sun.reflect.NativeMethodAccessorImpl.invoke0(Native Method)
[java] at sun.reflect.NativeMethodAccessorImpl.invoke(NativeMethodAccessorImpl.java:62)
[java] at sun.reflect.DelegatingMethodAccessorImpl.invoke(DelegatingMethodAccessorImpl.java:43)
[java] at java.lang.reflect.Method.invoke(Method.java:498)
[java] at org.junit.runners.model.FrameworkMethod$1.runReflectiveCall(FrameworkMethod.java:50)
[java] at org.junit.internal.runners.model.ReflectiveCallable.run(ReflectiveCallable.java:12)
[java] at org.junit.runners.model.FrameworkMethod.invokeExplosively(FrameworkMethod.java:47)
[java] at org.junit.internal.runners.statements.InvokeMethod.evaluate(InvokeMethod.java:17)
[java] at org.junit.runners.ParentRunner.runLeaf(ParentRunner.java:325)
[java] at org.junit.runners.BlockJUnit4ClassRunner.runChild(BlockJUnit4ClassRunner.java:78)
[java] at org.junit.runners.BlockJUnit4ClassRunner.runChild(BlockJUnit4ClassRunner.java:57)
[java] at org.junit.runners.ParentRunner$3.run(ParentRunner.java:290)
[java] at org.junit.runners.ParentRunner$1.schedule(ParentRunner.java:71)
[java] at org.junit.runners.ParentRunner.runChildren(ParentRunner.java:288)
[java] at org.junit.runners.ParentRunner.access$000(ParentRunner.java:58)
[java] at org.junit.runners.ParentRunner$2.evaluate(ParentRunner.java:268)
[java] at org.junit.runners.ParentRunner.run(ParentRunner.java:363)
[java] at org.junit.runners.Suite.runChild(Suite.java:128)
[java] at org.junit.runners.Suite.runChild(Suite.java:27)
[java] at org.junit.runners.ParentRunner$3.run(ParentRunner.java:290)
[java] at org.junit.runners.ParentRunner$1.schedule(ParentRunner.java:71)
[java] at org.junit.runners.ParentRunner.runChildren(ParentRunner.java:288)
[java] at org.junit.runners.ParentRunner.access$000(ParentRunner.java:58)
[java] at org.junit.runners.ParentRunner$2.evaluate(ParentRunner.java:268)
[java] at org.junit.runners.ParentRunner.run(ParentRunner.java:363)
[java] at org.junit.runner.JUnitCore.run(JUnitCore.java:137)
[java] at org.junit.runner.JUnitCore.run(JUnitCore.java:115)
[java] at org.junit.runner.JUnitCore.run(JUnitCore.java:105)
[java] at org.junit.runner.JUnitCore.run(JUnitCore.java:94)
[java] at org.apache.poi.util.OOXMLLite.build(OOXMLLite.java:149)
[java] at org.apache.poi.util.OOXMLLite.main(OOXMLLite.java:94)
[java] 149) testMultiSheetReferencesHSSFandXSSF(org.apache.poi.xssf.usermodel.TestXSSFFormulaEvaluation)
[java] java.lang.NoSuchMethodError: java.nio.ByteBuffer.position(I)Ljava/nio/ByteBuffer;
[java] at org.apache.poi.poifs.filesystem.NPOIFSFileSystem.<init>(NPOIFSFileSystem.java:310)
[java] at org.apache.poi.hssf.usermodel.HSSFWorkbook.<init>(HSSFWorkbook.java:413)
[java] at org.apache.poi.hssf.usermodel.HSSFWorkbook.<init>(HSSFWorkbook.java:394)
[java] at org.apache.poi.hssf.HSSFTestDataSamples.openSampleWorkbook(HSSFTestDataSamples.java:50)
[java] at org.apache.poi.xssf.usermodel.TestXSSFFormulaEvaluation.testMultiSheetReferencesHSSFandXSSF(TestXSSFFormulaEvaluation.java:266)
[java] at sun.reflect.NativeMethodAccessorImpl.invoke0(Native Method)
[java] at sun.reflect.NativeMethodAccessorImpl.invoke(NativeMethodAccessorImpl.java:62)
[java] at sun.reflect.DelegatingMethodAccessorImpl.invoke(DelegatingMethodAccessorImpl.java:43)
[java] at java.lang.reflect.Method.invoke(Method.java:498)
[java] at org.junit.runners.model.FrameworkMethod$1.runReflectiveCall(FrameworkMethod.java:50)
[java] at org.junit.internal.runners.model.ReflectiveCallable.run(ReflectiveCallable.java:12)
[java] at org.junit.runners.model.FrameworkMethod.invokeExplosively(FrameworkMethod.java:47)
[java] at org.junit.internal.runners.statements.InvokeMethod.evaluate(InvokeMethod.java:17)
[java] at org.junit.runners.ParentRunner.runLeaf(ParentRunner.java:325)
[java] at org.junit.runners.BlockJUnit4ClassRunner.runChild(BlockJUnit4ClassRunner.java:78)
[java] at org.junit.runners.BlockJUnit4ClassRunner.runChild(BlockJUnit4ClassRunner.java:57)
[java] at org.junit.runners.ParentRunner$3.run(ParentRunner.java:290)
[java] at org.junit.runners.ParentRunner$1.schedule(ParentRunner.java:71)
[java] at org.junit.runners.ParentRunner.runChildren(ParentRunner.java:288)
[java] at org.junit.runners.ParentRunner.access$000(ParentRunner.java:58)
[java] at org.junit.runners.ParentRunner$2.evaluate(ParentRunner.java:268)
[java] at org.junit.runners.ParentRunner.run(ParentRunner.java:363)
[java] at org.junit.runners.Suite.runChild(Suite.java:128)
[java] at org.junit.runners.Suite.runChild(Suite.java:27)
[java] at org.junit.runners.ParentRunner$3.run(ParentRunner.java:290)
[java] at org.junit.runners.ParentRunner$1.schedule(ParentRunner.java:71)
[java] at org.junit.runners.ParentRunner.runChildren(ParentRunner.java:288)
[java] at org.junit.runners.ParentRunner.access$000(ParentRunner.java:58)
[java] at org.junit.runners.ParentRunner$2.evaluate(ParentRunner.java:268)
[java] at org.junit.runners.ParentRunner.run(ParentRunner.java:363)
[java] at org.junit.runner.JUnitCore.run(JUnitCore.java:137)
[java] at org.junit.runner.JUnitCore.run(JUnitCore.java:115)
[java] at org.junit.runner.JUnitCore.run(JUnitCore.java:105)
[java] at org.junit.runner.JUnitCore.run(JUnitCore.java:94)
[java] at org.apache.poi.util.OOXMLLite.build(OOXMLLite.java:149)
[java] at org.apache.poi.util.OOXMLLite.main(OOXMLLite.java:94)
[java] 150) bug54607(org.apache.poi.xssf.usermodel.TestXSSFSheet)
[java] java.lang.NoSuchMethodError: java.nio.ByteBuffer.position(I)Ljava/nio/ByteBuffer;
[java] at org.apache.poi.poifs.filesystem.NPOIFSFileSystem.<init>(NPOIFSFileSystem.java:310)
[java] at org.apache.poi.hssf.usermodel.HSSFWorkbook.<init>(HSSFWorkbook.java:413)
[java] at org.apache.poi.hssf.usermodel.HSSFWorkbook.<init>(HSSFWorkbook.java:394)
[java] at org.apache.poi.hssf.HSSFTestDataSamples.openSampleWorkbook(HSSFTestDataSamples.java:50)
[java] at org.apache.poi.xssf.usermodel.TestXSSFSheet.runGetTopRow(TestXSSFSheet.java:1203)
[java] at org.apache.poi.xssf.usermodel.TestXSSFSheet.bug54607(TestXSSFSheet.java:1196)
[java] at sun.reflect.NativeMethodAccessorImpl.invoke0(Native Method)
[java] at sun.reflect.NativeMethodAccessorImpl.invoke(NativeMethodAccessorImpl.java:62)
[java] at sun.reflect.DelegatingMethodAccessorImpl.invoke(DelegatingMethodAccessorImpl.java:43)
[java] at java.lang.reflect.Method.invoke(Method.java:498)
[java] at org.junit.runners.model.FrameworkMethod$1.runReflectiveCall(FrameworkMethod.java:50)
[java] at org.junit.internal.runners.model.ReflectiveCallable.run(ReflectiveCallable.java:12)
[java] at org.junit.runners.model.FrameworkMethod.invokeExplosively(FrameworkMethod.java:47)
[java] at org.junit.internal.runners.statements.InvokeMethod.evaluate(InvokeMethod.java:17)
[java] at org.junit.rules.ExpectedException$ExpectedExceptionStatement.evaluate(ExpectedException.java:239)
[java] at org.junit.rules.RunRules.evaluate(RunRules.java:20)
[java] at org.junit.runners.ParentRunner.runLeaf(ParentRunner.java:325)
[java] at org.junit.runners.BlockJUnit4ClassRunner.runChild(BlockJUnit4ClassRunner.java:78)
[java] at org.junit.runners.BlockJUnit4ClassRunner.runChild(BlockJUnit4ClassRunner.java:57)
[java] at org.junit.runners.ParentRunner$3.run(ParentRunner.java:290)
[java] at org.junit.runners.ParentRunner$1.schedule(ParentRunner.java:71)
[java] at org.junit.runners.ParentRunner.runChildren(ParentRunner.java:288)
[java] at org.junit.runners.ParentRunner.access$000(ParentRunner.java:58)
[java] at org.junit.runners.ParentRunner$2.evaluate(ParentRunner.java:268)
[java] at org.junit.runners.ParentRunner.run(ParentRunner.java:363)
[java] at org.junit.runners.Suite.runChild(Suite.java:128)
[java] at org.junit.runners.Suite.runChild(Suite.java:27)
[java] at org.junit.runners.ParentRunner$3.run(ParentRunner.java:290)
[java] at org.junit.runners.ParentRunner$1.schedule(ParentRunner.java:71)
[java] at org.junit.runners.ParentRunner.runChildren(ParentRunner.java:288)
[java] at org.junit.runners.ParentRunner.access$000(ParentRunner.java:58)
[java] at org.junit.runners.ParentRunner$2.evaluate(ParentRunner.java:268)
[java] at org.junit.runners.ParentRunner.run(ParentRunner.java:363)
[java] at org.junit.runner.JUnitCore.run(JUnitCore.java:137)
[java] at org.junit.runner.JUnitCore.run(JUnitCore.java:115)
[java] at org.junit.runner.JUnitCore.run(JUnitCore.java:105)
[java] at org.junit.runner.JUnitCore.run(JUnitCore.java:94)
[java] at org.apache.poi.util.OOXMLLite.build(OOXMLLite.java:149)
[java] at org.apache.poi.util.OOXMLLite.main(OOXMLLite.java:94)
[java] 151) testTooShortFilterStreams(org.apache.poi.openxml4j.opc.TestPackage)
[java] java.lang.NoSuchMethodError: java.nio.ByteBuffer.position(I)Ljava/nio/ByteBuffer;
[java] at org.apache.poi.poifs.filesystem.NPOIFSFileSystem.<init>(NPOIFSFileSystem.java:310)
[java] at org.apache.poi.ss.usermodel.WorkbookFactory.create(WorkbookFactory.java:181)
[java] at org.apache.poi.ss.usermodel.WorkbookFactory.create(WorkbookFactory.java:149)
[java] at org.apache.poi.openxml4j.opc.TestPackage.testTooShortFilterStreams(TestPackage.java:971)
[java] at sun.reflect.NativeMethodAccessorImpl.invoke0(Native Method)
[java] at sun.reflect.NativeMethodAccessorImpl.invoke(NativeMethodAccessorImpl.java:62)
[java] at sun.reflect.DelegatingMethodAccessorImpl.invoke(DelegatingMethodAccessorImpl.java:43)
[java] at java.lang.reflect.Method.invoke(Method.java:498)
[java] at org.junit.runners.model.FrameworkMethod$1.runReflectiveCall(FrameworkMethod.java:50)
[java] at org.junit.internal.runners.model.ReflectiveCallable.run(ReflectiveCallable.java:12)
[java] at org.junit.runners.model.FrameworkMethod.invokeExplosively(FrameworkMethod.java:47)
[java] at org.junit.internal.runners.statements.InvokeMethod.evaluate(InvokeMethod.java:17)
[java] at org.junit.runners.ParentRunner.runLeaf(ParentRunner.java:325)
[java] at org.junit.runners.BlockJUnit4ClassRunner.runChild(BlockJUnit4ClassRunner.java:78)
[java] at org.junit.runners.BlockJUnit4ClassRunner.runChild(BlockJUnit4ClassRunner.java:57)
[java] at org.junit.runners.ParentRunner$3.run(ParentRunner.java:290)
[java] at org.junit.runners.ParentRunner$1.schedule(ParentRunner.java:71)
[java] at org.junit.runners.ParentRunner.runChildren(ParentRunner.java:288)
[java] at org.junit.runners.ParentRunner.access$000(ParentRunner.java:58)
[java] at org.junit.runners.ParentRunner$2.evaluate(ParentRunner.java:268)
[java] at org.junit.runners.ParentRunner.run(ParentRunner.java:363)
[java] at org.junit.runners.Suite.runChild(Suite.java:128)
[java] at org.junit.runners.Suite.runChild(Suite.java:27)
[java] at org.junit.runners.ParentRunner$3.run(ParentRunner.java:290)
[java] at org.junit.runners.ParentRunner$1.schedule(ParentRunner.java:71)
[java] at org.junit.runners.ParentRunner.runChildren(ParentRunner.java:288)
[java] at org.junit.runners.ParentRunner.access$000(ParentRunner.java:58)
[java] at org.junit.runners.ParentRunner$2.evaluate(ParentRunner.java:268)
[java] at org.junit.runners.ParentRunner.run(ParentRunner.java:363)
[java] at org.junit.runner.JUnitCore.run(JUnitCore.java:137)
[java] at org.junit.runner.JUnitCore.run(JUnitCore.java:115)
[java] at org.junit.runner.JUnitCore.run(JUnitCore.java:105)
[java] at org.junit.runner.JUnitCore.run(JUnitCore.java:94)
[java] at org.apache.poi.util.OOXMLLite.build(OOXMLLite.java:149)
[java] at org.apache.poi.util.OOXMLLite.main(OOXMLLite.java:94)
[java]
[java] FAILURES!!!
[java] Tests run: 2285, Failures: 151
[java]
[java] Exception in thread "main" java.lang.RuntimeException: Tests did not succeed, cannot build ooxml-lite jar
[java] at org.apache.poi.util.OOXMLLite.build(OOXMLLite.java:151)
[java] at org.apache.poi.util.OOXMLLite.main(OOXMLLite.java:94)
BUILD FAILED
<https://builds.apache.org/job/POI-DSL-OpenJDK/ws/build.xml>:1678: Java returned: 1
Total time: 2 minutes 43 seconds
Build step 'Invoke Ant' marked build as failure
[FINDBUGS] Skipping publisher since build result is FAILURE
Archiving artifacts
[Fast Archiver] Compressed 66.30 MB of artifacts by 65.1% relative to #249
[WARNINGS] Skipping publisher since build result is FAILURE
Recording test results
ERROR: Step ?Publish JUnit test result report? failed: No test report files were found. Configuration error?
---------------------------------------------------------------------
To unsubscribe, e-mail: dev-unsubscribe@poi.apache.org
For additional commands, e-mail: dev-help@poi.apache.org
Re: Build failed in Jenkins: POI-DSL-OpenJDK #286
Posted by Dominik Stadler <do...@gmx.at>.
Hi,
FYI, I think I finally found the issue with the OpenJDK build and I created
https://issues.apache.org/jira/browse/INFRA-15244 to get it fixed.
Thanks... Dominik.
On Sun, Oct 8, 2017 at 9:08 AM, Apache Jenkins Server <
jenkins@builds.apache.org> wrote:
> See <https://builds.apache.org/job/POI-DSL-OpenJDK/286/display/redirect>
>
> ------------------------------------------
> [...truncated 609.57 KB...]
> [java] at org.apache.poi.poifs.filesystem.NPOIFSFileSystem.<
> init>(NPOIFSFileSystem.java:310)
> [java] at org.apache.poi.hssf.usermodel.HSSFWorkbook.<init>(
> HSSFWorkbook.java:413)
> [java] at org.apache.poi.hssf.usermodel.HSSFWorkbook.<init>(
> HSSFWorkbook.java:394)
> [java] at org.apache.poi.hssf.HSSFTestDataSamples.
> writeOutAndReadBack(HSSFTestDataSamples.java:65)
> [java] at org.apache.poi.hssf.HSSFITestDataProvider.
> writeOutAndReadBack(HSSFITestDataProvider.java:55)
> [java] at org.apache.poi.xssf.usermodel.TestXSSFCell.
> testEncodingBelowAscii(TestXSSFCell.java:525)
> [java] at sun.reflect.NativeMethodAccessorImpl.invoke0(Native
> Method)
> [java] at sun.reflect.NativeMethodAccessorImpl.invoke(
> NativeMethodAccessorImpl.java:62)
> [java] at sun.reflect.DelegatingMethodAccessorImpl.invoke(
> DelegatingMethodAccessorImpl.java:43)
> [java] at java.lang.reflect.Method.invoke(Method.java:498)
> [java] at org.junit.runners.model.FrameworkMethod$1.
> runReflectiveCall(FrameworkMethod.java:50)
> [java] at org.junit.internal.runners.
> model.ReflectiveCallable.run(ReflectiveCallable.java:12)
> [java] at org.junit.runners.model.FrameworkMethod.
> invokeExplosively(FrameworkMethod.java:47)
> [java] at org.junit.internal.runners.statements.InvokeMethod.
> evaluate(InvokeMethod.java:17)
> [java] at org.junit.runners.ParentRunner.runLeaf(
> ParentRunner.java:325)
> [java] at org.junit.runners.BlockJUnit4ClassRunner.runChild(
> BlockJUnit4ClassRunner.java:78)
> [java] at org.junit.runners.BlockJUnit4ClassRunner.runChild(
> BlockJUnit4ClassRunner.java:57)
> [java] at org.junit.runners.ParentRunner$3.run(
> ParentRunner.java:290)
> [java] at org.junit.runners.ParentRunner$1.schedule(
> ParentRunner.java:71)
> [java] at org.junit.runners.ParentRunner.runChildren(
> ParentRunner.java:288)
> [java] at org.junit.runners.ParentRunner.access$000(
> ParentRunner.java:58)
> [java] at org.junit.runners.ParentRunner$2.evaluate(
> ParentRunner.java:268)
> [java] at org.junit.runners.ParentRunner.run(ParentRunner.
> java:363)
> [java] at org.junit.runners.Suite.runChild(Suite.java:128)
> [java] at org.junit.runners.Suite.runChild(Suite.java:27)
> [java] at org.junit.runners.ParentRunner$3.run(
> ParentRunner.java:290)
> [java] at org.junit.runners.ParentRunner$1.schedule(
> ParentRunner.java:71)
> [java] at org.junit.runners.ParentRunner.runChildren(
> ParentRunner.java:288)
> [java] at org.junit.runners.ParentRunner.access$000(
> ParentRunner.java:58)
> [java] at org.junit.runners.ParentRunner$2.evaluate(
> ParentRunner.java:268)
> [java] at org.junit.runners.ParentRunner.run(ParentRunner.
> java:363)
> [java] at org.junit.runner.JUnitCore.run(JUnitCore.java:137)
> [java] at org.junit.runner.JUnitCore.run(JUnitCore.java:115)
> [java] at org.junit.runner.JUnitCore.run(JUnitCore.java:105)
> [java] at org.junit.runner.JUnitCore.run(JUnitCore.java:94)
> [java] at org.apache.poi.util.OOXMLLite.build(OOXMLLite.java:149)
> [java] at org.apache.poi.util.OOXMLLite.main(OOXMLLite.java:94)
> [java] 147) testMultiSheetAreasHSSFandXSSF(org.apache.poi.xssf.
> usermodel.TestXSSFFormulaEvaluation)
> [java] java.lang.NoSuchMethodError: java.nio.ByteBuffer.position(
> I)Ljava/nio/ByteBuffer;
> [java] at org.apache.poi.poifs.filesystem.NPOIFSFileSystem.<
> init>(NPOIFSFileSystem.java:310)
> [java] at org.apache.poi.hssf.usermodel.HSSFWorkbook.<init>(
> HSSFWorkbook.java:413)
> [java] at org.apache.poi.hssf.usermodel.HSSFWorkbook.<init>(
> HSSFWorkbook.java:394)
> [java] at org.apache.poi.hssf.HSSFTestDataSamples.
> openSampleWorkbook(HSSFTestDataSamples.java:50)
> [java] at org.apache.poi.xssf.usermodel.
> TestXSSFFormulaEvaluation.testMultiSheetAreasHSSFandXSSF
> (TestXSSFFormulaEvaluation.java:333)
> [java] at sun.reflect.NativeMethodAccessorImpl.invoke0(Native
> Method)
> [java] at sun.reflect.NativeMethodAccessorImpl.invoke(
> NativeMethodAccessorImpl.java:62)
> [java] at sun.reflect.DelegatingMethodAccessorImpl.invoke(
> DelegatingMethodAccessorImpl.java:43)
> [java] at java.lang.reflect.Method.invoke(Method.java:498)
> [java] at org.junit.runners.model.FrameworkMethod$1.
> runReflectiveCall(FrameworkMethod.java:50)
> [java] at org.junit.internal.runners.
> model.ReflectiveCallable.run(ReflectiveCallable.java:12)
> [java] at org.junit.runners.model.FrameworkMethod.
> invokeExplosively(FrameworkMethod.java:47)
> [java] at org.junit.internal.runners.statements.InvokeMethod.
> evaluate(InvokeMethod.java:17)
> [java] at org.junit.runners.ParentRunner.runLeaf(
> ParentRunner.java:325)
> [java] at org.junit.runners.BlockJUnit4ClassRunner.runChild(
> BlockJUnit4ClassRunner.java:78)
> [java] at org.junit.runners.BlockJUnit4ClassRunner.runChild(
> BlockJUnit4ClassRunner.java:57)
> [java] at org.junit.runners.ParentRunner$3.run(
> ParentRunner.java:290)
> [java] at org.junit.runners.ParentRunner$1.schedule(
> ParentRunner.java:71)
> [java] at org.junit.runners.ParentRunner.runChildren(
> ParentRunner.java:288)
> [java] at org.junit.runners.ParentRunner.access$000(
> ParentRunner.java:58)
> [java] at org.junit.runners.ParentRunner$2.evaluate(
> ParentRunner.java:268)
> [java] at org.junit.runners.ParentRunner.run(ParentRunner.
> java:363)
> [java] at org.junit.runners.Suite.runChild(Suite.java:128)
> [java] at org.junit.runners.Suite.runChild(Suite.java:27)
> [java] at org.junit.runners.ParentRunner$3.run(
> ParentRunner.java:290)
> [java] at org.junit.runners.ParentRunner$1.schedule(
> ParentRunner.java:71)
> [java] at org.junit.runners.ParentRunner.runChildren(
> ParentRunner.java:288)
> [java] at org.junit.runners.ParentRunner.access$000(
> ParentRunner.java:58)
> [java] at org.junit.runners.ParentRunner$2.evaluate(
> ParentRunner.java:268)
> [java] at org.junit.runners.ParentRunner.run(ParentRunner.
> java:363)
> [java] at org.junit.runner.JUnitCore.run(JUnitCore.java:137)
> [java] at org.junit.runner.JUnitCore.run(JUnitCore.java:115)
> [java] at org.junit.runner.JUnitCore.run(JUnitCore.java:105)
> [java] at org.junit.runner.JUnitCore.run(JUnitCore.java:94)
> [java] at org.apache.poi.util.OOXMLLite.build(OOXMLLite.java:149)
> [java] at org.apache.poi.util.OOXMLLite.main(OOXMLLite.java:94)
> [java] 148) testReferencesToOtherWorkbooks(org.apache.poi.xssf.
> usermodel.TestXSSFFormulaEvaluation)
> [java] java.lang.NoSuchMethodError: java.nio.ByteBuffer.position(
> I)Ljava/nio/ByteBuffer;
> [java] at org.apache.poi.poifs.filesystem.NPOIFSFileSystem.<
> init>(NPOIFSFileSystem.java:310)
> [java] at org.apache.poi.hssf.usermodel.HSSFWorkbook.<init>(
> HSSFWorkbook.java:413)
> [java] at org.apache.poi.hssf.usermodel.HSSFWorkbook.<init>(
> HSSFWorkbook.java:394)
> [java] at org.apache.poi.hssf.HSSFTestDataSamples.
> openSampleWorkbook(HSSFTestDataSamples.java:50)
> [java] at org.apache.poi.xssf.usermodel.
> TestXSSFFormulaEvaluation.testReferencesToOtherWorkbooks
> (TestXSSFFormulaEvaluation.java:165)
> [java] at sun.reflect.NativeMethodAccessorImpl.invoke0(Native
> Method)
> [java] at sun.reflect.NativeMethodAccessorImpl.invoke(
> NativeMethodAccessorImpl.java:62)
> [java] at sun.reflect.DelegatingMethodAccessorImpl.invoke(
> DelegatingMethodAccessorImpl.java:43)
> [java] at java.lang.reflect.Method.invoke(Method.java:498)
> [java] at org.junit.runners.model.FrameworkMethod$1.
> runReflectiveCall(FrameworkMethod.java:50)
> [java] at org.junit.internal.runners.
> model.ReflectiveCallable.run(ReflectiveCallable.java:12)
> [java] at org.junit.runners.model.FrameworkMethod.
> invokeExplosively(FrameworkMethod.java:47)
> [java] at org.junit.internal.runners.statements.InvokeMethod.
> evaluate(InvokeMethod.java:17)
> [java] at org.junit.runners.ParentRunner.runLeaf(
> ParentRunner.java:325)
> [java] at org.junit.runners.BlockJUnit4ClassRunner.runChild(
> BlockJUnit4ClassRunner.java:78)
> [java] at org.junit.runners.BlockJUnit4ClassRunner.runChild(
> BlockJUnit4ClassRunner.java:57)
> [java] at org.junit.runners.ParentRunner$3.run(
> ParentRunner.java:290)
> [java] at org.junit.runners.ParentRunner$1.schedule(
> ParentRunner.java:71)
> [java] at org.junit.runners.ParentRunner.runChildren(
> ParentRunner.java:288)
> [java] at org.junit.runners.ParentRunner.access$000(
> ParentRunner.java:58)
> [java] at org.junit.runners.ParentRunner$2.evaluate(
> ParentRunner.java:268)
> [java] at org.junit.runners.ParentRunner.run(ParentRunner.
> java:363)
> [java] at org.junit.runners.Suite.runChild(Suite.java:128)
> [java] at org.junit.runners.Suite.runChild(Suite.java:27)
> [java] at org.junit.runners.ParentRunner$3.run(
> ParentRunner.java:290)
> [java] at org.junit.runners.ParentRunner$1.schedule(
> ParentRunner.java:71)
> [java] at org.junit.runners.ParentRunner.runChildren(
> ParentRunner.java:288)
> [java] at org.junit.runners.ParentRunner.access$000(
> ParentRunner.java:58)
> [java] at org.junit.runners.ParentRunner$2.evaluate(
> ParentRunner.java:268)
> [java] at org.junit.runners.ParentRunner.run(ParentRunner.
> java:363)
> [java] at org.junit.runner.JUnitCore.run(JUnitCore.java:137)
> [java] at org.junit.runner.JUnitCore.run(JUnitCore.java:115)
> [java] at org.junit.runner.JUnitCore.run(JUnitCore.java:105)
> [java] at org.junit.runner.JUnitCore.run(JUnitCore.java:94)
> [java] at org.apache.poi.util.OOXMLLite.build(OOXMLLite.java:149)
> [java] at org.apache.poi.util.OOXMLLite.main(OOXMLLite.java:94)
> [java] 149) testMultiSheetReferencesHSSFandXSSF(org.apache.poi.xssf.
> usermodel.TestXSSFFormulaEvaluation)
> [java] java.lang.NoSuchMethodError: java.nio.ByteBuffer.position(
> I)Ljava/nio/ByteBuffer;
> [java] at org.apache.poi.poifs.filesystem.NPOIFSFileSystem.<
> init>(NPOIFSFileSystem.java:310)
> [java] at org.apache.poi.hssf.usermodel.HSSFWorkbook.<init>(
> HSSFWorkbook.java:413)
> [java] at org.apache.poi.hssf.usermodel.HSSFWorkbook.<init>(
> HSSFWorkbook.java:394)
> [java] at org.apache.poi.hssf.HSSFTestDataSamples.
> openSampleWorkbook(HSSFTestDataSamples.java:50)
> [java] at org.apache.poi.xssf.usermodel.
> TestXSSFFormulaEvaluation.testMultiSheetReferencesHSSFandXSSF(
> TestXSSFFormulaEvaluation.java:266)
> [java] at sun.reflect.NativeMethodAccessorImpl.invoke0(Native
> Method)
> [java] at sun.reflect.NativeMethodAccessorImpl.invoke(
> NativeMethodAccessorImpl.java:62)
> [java] at sun.reflect.DelegatingMethodAccessorImpl.invoke(
> DelegatingMethodAccessorImpl.java:43)
> [java] at java.lang.reflect.Method.invoke(Method.java:498)
> [java] at org.junit.runners.model.FrameworkMethod$1.
> runReflectiveCall(FrameworkMethod.java:50)
> [java] at org.junit.internal.runners.
> model.ReflectiveCallable.run(ReflectiveCallable.java:12)
> [java] at org.junit.runners.model.FrameworkMethod.
> invokeExplosively(FrameworkMethod.java:47)
> [java] at org.junit.internal.runners.statements.InvokeMethod.
> evaluate(InvokeMethod.java:17)
> [java] at org.junit.runners.ParentRunner.runLeaf(
> ParentRunner.java:325)
> [java] at org.junit.runners.BlockJUnit4ClassRunner.runChild(
> BlockJUnit4ClassRunner.java:78)
> [java] at org.junit.runners.BlockJUnit4ClassRunner.runChild(
> BlockJUnit4ClassRunner.java:57)
> [java] at org.junit.runners.ParentRunner$3.run(
> ParentRunner.java:290)
> [java] at org.junit.runners.ParentRunner$1.schedule(
> ParentRunner.java:71)
> [java] at org.junit.runners.ParentRunner.runChildren(
> ParentRunner.java:288)
> [java] at org.junit.runners.ParentRunner.access$000(
> ParentRunner.java:58)
> [java] at org.junit.runners.ParentRunner$2.evaluate(
> ParentRunner.java:268)
> [java] at org.junit.runners.ParentRunner.run(ParentRunner.
> java:363)
> [java] at org.junit.runners.Suite.runChild(Suite.java:128)
> [java] at org.junit.runners.Suite.runChild(Suite.java:27)
> [java] at org.junit.runners.ParentRunner$3.run(
> ParentRunner.java:290)
> [java] at org.junit.runners.ParentRunner$1.schedule(
> ParentRunner.java:71)
> [java] at org.junit.runners.ParentRunner.runChildren(
> ParentRunner.java:288)
> [java] at org.junit.runners.ParentRunner.access$000(
> ParentRunner.java:58)
> [java] at org.junit.runners.ParentRunner$2.evaluate(
> ParentRunner.java:268)
> [java] at org.junit.runners.ParentRunner.run(ParentRunner.
> java:363)
> [java] at org.junit.runner.JUnitCore.run(JUnitCore.java:137)
> [java] at org.junit.runner.JUnitCore.run(JUnitCore.java:115)
> [java] at org.junit.runner.JUnitCore.run(JUnitCore.java:105)
> [java] at org.junit.runner.JUnitCore.run(JUnitCore.java:94)
> [java] at org.apache.poi.util.OOXMLLite.build(OOXMLLite.java:149)
> [java] at org.apache.poi.util.OOXMLLite.main(OOXMLLite.java:94)
> [java] 150) bug54607(org.apache.poi.xssf.usermodel.TestXSSFSheet)
> [java] java.lang.NoSuchMethodError: java.nio.ByteBuffer.position(
> I)Ljava/nio/ByteBuffer;
> [java] at org.apache.poi.poifs.filesystem.NPOIFSFileSystem.<
> init>(NPOIFSFileSystem.java:310)
> [java] at org.apache.poi.hssf.usermodel.HSSFWorkbook.<init>(
> HSSFWorkbook.java:413)
> [java] at org.apache.poi.hssf.usermodel.HSSFWorkbook.<init>(
> HSSFWorkbook.java:394)
> [java] at org.apache.poi.hssf.HSSFTestDataSamples.
> openSampleWorkbook(HSSFTestDataSamples.java:50)
> [java] at org.apache.poi.xssf.usermodel.
> TestXSSFSheet.runGetTopRow(TestXSSFSheet.java:1203)
> [java] at org.apache.poi.xssf.usermodel.TestXSSFSheet.bug54607(
> TestXSSFSheet.java:1196)
> [java] at sun.reflect.NativeMethodAccessorImpl.invoke0(Native
> Method)
> [java] at sun.reflect.NativeMethodAccessorImpl.invoke(
> NativeMethodAccessorImpl.java:62)
> [java] at sun.reflect.DelegatingMethodAccessorImpl.invoke(
> DelegatingMethodAccessorImpl.java:43)
> [java] at java.lang.reflect.Method.invoke(Method.java:498)
> [java] at org.junit.runners.model.FrameworkMethod$1.
> runReflectiveCall(FrameworkMethod.java:50)
> [java] at org.junit.internal.runners.
> model.ReflectiveCallable.run(ReflectiveCallable.java:12)
> [java] at org.junit.runners.model.FrameworkMethod.
> invokeExplosively(FrameworkMethod.java:47)
> [java] at org.junit.internal.runners.statements.InvokeMethod.
> evaluate(InvokeMethod.java:17)
> [java] at org.junit.rules.ExpectedException$
> ExpectedExceptionStatement.evaluate(ExpectedException.java:239)
> [java] at org.junit.rules.RunRules.evaluate(RunRules.java:20)
> [java] at org.junit.runners.ParentRunner.runLeaf(
> ParentRunner.java:325)
> [java] at org.junit.runners.BlockJUnit4ClassRunner.runChild(
> BlockJUnit4ClassRunner.java:78)
> [java] at org.junit.runners.BlockJUnit4ClassRunner.runChild(
> BlockJUnit4ClassRunner.java:57)
> [java] at org.junit.runners.ParentRunner$3.run(
> ParentRunner.java:290)
> [java] at org.junit.runners.ParentRunner$1.schedule(
> ParentRunner.java:71)
> [java] at org.junit.runners.ParentRunner.runChildren(
> ParentRunner.java:288)
> [java] at org.junit.runners.ParentRunner.access$000(
> ParentRunner.java:58)
> [java] at org.junit.runners.ParentRunner$2.evaluate(
> ParentRunner.java:268)
> [java] at org.junit.runners.ParentRunner.run(ParentRunner.
> java:363)
> [java] at org.junit.runners.Suite.runChild(Suite.java:128)
> [java] at org.junit.runners.Suite.runChild(Suite.java:27)
> [java] at org.junit.runners.ParentRunner$3.run(
> ParentRunner.java:290)
> [java] at org.junit.runners.ParentRunner$1.schedule(
> ParentRunner.java:71)
> [java] at org.junit.runners.ParentRunner.runChildren(
> ParentRunner.java:288)
> [java] at org.junit.runners.ParentRunner.access$000(
> ParentRunner.java:58)
> [java] at org.junit.runners.ParentRunner$2.evaluate(
> ParentRunner.java:268)
> [java] at org.junit.runners.ParentRunner.run(ParentRunner.
> java:363)
> [java] at org.junit.runner.JUnitCore.run(JUnitCore.java:137)
> [java] at org.junit.runner.JUnitCore.run(JUnitCore.java:115)
> [java] at org.junit.runner.JUnitCore.run(JUnitCore.java:105)
> [java] at org.junit.runner.JUnitCore.run(JUnitCore.java:94)
> [java] at org.apache.poi.util.OOXMLLite.build(OOXMLLite.java:149)
> [java] at org.apache.poi.util.OOXMLLite.main(OOXMLLite.java:94)
> [java] 151) testTooShortFilterStreams(org.apache.poi.openxml4j.opc.
> TestPackage)
> [java] java.lang.NoSuchMethodError: java.nio.ByteBuffer.position(
> I)Ljava/nio/ByteBuffer;
> [java] at org.apache.poi.poifs.filesystem.NPOIFSFileSystem.<
> init>(NPOIFSFileSystem.java:310)
> [java] at org.apache.poi.ss.usermodel.WorkbookFactory.create(
> WorkbookFactory.java:181)
> [java] at org.apache.poi.ss.usermodel.WorkbookFactory.create(
> WorkbookFactory.java:149)
> [java] at org.apache.poi.openxml4j.opc.TestPackage.
> testTooShortFilterStreams(TestPackage.java:971)
> [java] at sun.reflect.NativeMethodAccessorImpl.invoke0(Native
> Method)
> [java] at sun.reflect.NativeMethodAccessorImpl.invoke(
> NativeMethodAccessorImpl.java:62)
> [java] at sun.reflect.DelegatingMethodAccessorImpl.invoke(
> DelegatingMethodAccessorImpl.java:43)
> [java] at java.lang.reflect.Method.invoke(Method.java:498)
> [java] at org.junit.runners.model.FrameworkMethod$1.
> runReflectiveCall(FrameworkMethod.java:50)
> [java] at org.junit.internal.runners.
> model.ReflectiveCallable.run(ReflectiveCallable.java:12)
> [java] at org.junit.runners.model.FrameworkMethod.
> invokeExplosively(FrameworkMethod.java:47)
> [java] at org.junit.internal.runners.statements.InvokeMethod.
> evaluate(InvokeMethod.java:17)
> [java] at org.junit.runners.ParentRunner.runLeaf(
> ParentRunner.java:325)
> [java] at org.junit.runners.BlockJUnit4ClassRunner.runChild(
> BlockJUnit4ClassRunner.java:78)
> [java] at org.junit.runners.BlockJUnit4ClassRunner.runChild(
> BlockJUnit4ClassRunner.java:57)
> [java] at org.junit.runners.ParentRunner$3.run(
> ParentRunner.java:290)
> [java] at org.junit.runners.ParentRunner$1.schedule(
> ParentRunner.java:71)
> [java] at org.junit.runners.ParentRunner.runChildren(
> ParentRunner.java:288)
> [java] at org.junit.runners.ParentRunner.access$000(
> ParentRunner.java:58)
> [java] at org.junit.runners.ParentRunner$2.evaluate(
> ParentRunner.java:268)
> [java] at org.junit.runners.ParentRunner.run(ParentRunner.
> java:363)
> [java] at org.junit.runners.Suite.runChild(Suite.java:128)
> [java] at org.junit.runners.Suite.runChild(Suite.java:27)
> [java] at org.junit.runners.ParentRunner$3.run(
> ParentRunner.java:290)
> [java] at org.junit.runners.ParentRunner$1.schedule(
> ParentRunner.java:71)
> [java] at org.junit.runners.ParentRunner.runChildren(
> ParentRunner.java:288)
> [java] at org.junit.runners.ParentRunner.access$000(
> ParentRunner.java:58)
> [java] at org.junit.runners.ParentRunner$2.evaluate(
> ParentRunner.java:268)
> [java] at org.junit.runners.ParentRunner.run(ParentRunner.
> java:363)
> [java] at org.junit.runner.JUnitCore.run(JUnitCore.java:137)
> [java] at org.junit.runner.JUnitCore.run(JUnitCore.java:115)
> [java] at org.junit.runner.JUnitCore.run(JUnitCore.java:105)
> [java] at org.junit.runner.JUnitCore.run(JUnitCore.java:94)
> [java] at org.apache.poi.util.OOXMLLite.build(OOXMLLite.java:149)
> [java] at org.apache.poi.util.OOXMLLite.main(OOXMLLite.java:94)
> [java]
> [java] FAILURES!!!
> [java] Tests run: 2285, Failures: 151
> [java]
> [java] Exception in thread "main" java.lang.RuntimeException: Tests
> did not succeed, cannot build ooxml-lite jar
> [java] at org.apache.poi.util.OOXMLLite.build(OOXMLLite.java:151)
> [java] at org.apache.poi.util.OOXMLLite.main(OOXMLLite.java:94)
>
> BUILD FAILED
> <https://builds.apache.org/job/POI-DSL-OpenJDK/ws/build.xml>:1678: Java
> returned: 1
>
> Total time: 2 minutes 43 seconds
> Build step 'Invoke Ant' marked build as failure
> [FINDBUGS] Skipping publisher since build result is FAILURE
> Archiving artifacts
> [Fast Archiver] Compressed 66.30 MB of artifacts by 65.1% relative to #249
> [WARNINGS] Skipping publisher since build result is FAILURE
> Recording test results
> ERROR: Step ?Publish JUnit test result report? failed: No test report
> files were found. Configuration error?
>
>
> ---------------------------------------------------------------------
> To unsubscribe, e-mail: dev-unsubscribe@poi.apache.org
> For additional commands, e-mail: dev-help@poi.apache.org
>
>
Jenkins build is back to normal : POI-DSL-OpenJDK #287
Posted by Apache Jenkins Server <je...@builds.apache.org>.
See <https://builds.apache.org/job/POI-DSL-OpenJDK/287/display/redirect>
---------------------------------------------------------------------
To unsubscribe, e-mail: dev-unsubscribe@poi.apache.org
For additional commands, e-mail: dev-help@poi.apache.org