You are viewing a plain text version of this content. The canonical link for it is here.
Posted to builds@beam.apache.org by Apache Jenkins Server <je...@builds.apache.org> on 2021/03/21 14:26:51 UTC
Build failed in Jenkins:
beam_PostCommit_Java_Examples_Dataflow_V2_java11 #470
See <https://ci-beam.apache.org/job/beam_PostCommit_Java_Examples_Dataflow_V2_java11/470/display/redirect>
Changes:
------------------------------------------
[...truncated 40.92 KB...]
Resolving github.com/spf13/viper: commit='aafc9e6bc7b7bb53ddaa75a5ef49a17d6e654be5', urls=[https://github.com/spf13/viper.git, git@github.com:spf13/viper.git]
Resolving github.com/stathat/go: commit='74669b9f388d9d788c97399a0824adbfee78400e', urls=[https://github.com/stathat/go.git, git@github.com:stathat/go.git]
Resolving cached github.com/etcd-io/etcd: commit='11214aa33bf5a47d3d9d8dafe0f6b97237dfe921', urls=[https://github.com/etcd-io/etcd.git, git@github.com:etcd-io/etcd.git]
Resolving cached github.com/etcd-io/etcd: commit='11214aa33bf5a47d3d9d8dafe0f6b97237dfe921', urls=[https://github.com/etcd-io/etcd.git, git@github.com:etcd-io/etcd.git]
Resolving cached github.com/etcd-io/etcd: commit='11214aa33bf5a47d3d9d8dafe0f6b97237dfe921', urls=[https://github.com/etcd-io/etcd.git, git@github.com:etcd-io/etcd.git]
Resolving cached github.com/etcd-io/etcd: commit='11214aa33bf5a47d3d9d8dafe0f6b97237dfe921', urls=[https://github.com/etcd-io/etcd.git, git@github.com:etcd-io/etcd.git]
Resolving github.com/xordataexchange/crypt: commit='b2862e3d0a775f18c7cfe02273500ae307b61218', urls=[https://github.com/xordataexchange/crypt.git, git@github.com:xordataexchange/crypt.git]
Resolving go.opencensus.io: commit='3fb168f674736c026e623310bfccb0691e6dec8a', urls=[https://github.com/census-instrumentation/opencensus-go]
> Task :sdks:java:harness:compileJava FROM-CACHE
> Task :sdks:java:harness:classes UP-TO-DATE
> Task :sdks:java:harness:jar
> Task :sdks:go:resolveBuildDependencies
Resolving golang.org/x/crypto: commit='d9133f5469342136e669e85192a26056b587f503', urls=[https://go.googlesource.com/crypto]
Resolving golang.org/x/debug: commit='95515998a8a4bd7448134b2cb5971dbeb12e0b77', urls=[https://go.googlesource.com/debug]
> Task :sdks:java:harness:shadowJar FROM-CACHE
> Task :sdks:java:container:pullLicenses
INFO:root:pull_licenses_java.py succeed. It took 6.08685 seconds with 16 threads.
Copying licenses from <https://ci-beam.apache.org/job/beam_PostCommit_Java_Examples_Dataflow_V2_java11/ws/src/sdks/java/container/build/target/java_third_party_licenses> to <https://ci-beam.apache.org/job/beam_PostCommit_Java_Examples_Dataflow_V2_java11/ws/src/sdks/java/container/build/target/third_party_licenses.>
Finished license_scripts.sh
> Task :sdks:java:container:java11:copyJavaThirdPartyLicenses NO-SOURCE
> Task :sdks:go:resolveBuildDependencies
Resolving golang.org/x/net: commit='2fb46b16b8dda405028c50f7c7f0f9dd1fa6bfb1', urls=[https://go.googlesource.com/net]
Resolving golang.org/x/oauth2: commit='5d25da1a8d43b66f2898c444f899c7bcfd6a407e', urls=[https://go.googlesource.com/oauth2]
Resolving golang.org/x/sync: commit='fd80eb99c8f653c847d294a001bdf2a3a6f768f5', urls=[https://go.googlesource.com/sync]
> Task :runners:java-fn-execution:compileJava FROM-CACHE
> Task :runners:java-fn-execution:classes UP-TO-DATE
> Task :runners:java-fn-execution:jar
> Task :sdks:java:expansion-service:compileJava FROM-CACHE
> Task :sdks:java:expansion-service:classes UP-TO-DATE
> Task :sdks:java:expansion-service:jar
> Task :runners:direct-java:compileJava FROM-CACHE
> Task :runners:direct-java:classes UP-TO-DATE
> Task :sdks:java:io:kafka:compileJava FROM-CACHE
> Task :sdks:java:io:kafka:classes UP-TO-DATE
> Task :sdks:java:extensions:ml:compileJava FROM-CACHE
> Task :sdks:java:extensions:ml:classes UP-TO-DATE
> Task :runners:direct-java:shadowJar FROM-CACHE
> Task :sdks:java:io:kafka:jar
> Task :sdks:java:extensions:ml:jar
> Task :sdks:java:io:google-cloud-platform:compileJava FROM-CACHE
> Task :sdks:java:io:google-cloud-platform:classes UP-TO-DATE
> Task :sdks:java:io:google-cloud-platform:jar
> Task :runners:google-cloud-dataflow-java:compileJava FROM-CACHE
> Task :runners:google-cloud-dataflow-java:classes
> Task :runners:google-cloud-dataflow-java:jar
> Task :sdks:java:container:java11:copyDockerfileDependencies
> Task :examples:java:compileJava FROM-CACHE
> Task :examples:java:classes UP-TO-DATE
> Task :examples:java:jar
> Task :examples:java:compileTestJava FROM-CACHE
> Task :examples:java:testClasses
> Task :examples:java:testJar
> Task :sdks:go:resolveBuildDependencies
Resolving golang.org/x/sys: commit='fde4db37ae7ad8191b03d30d27f258b5291ae4e3', urls=[https://go.googlesource.com/sys]
Resolving golang.org/x/text: commit='23ae387dee1f90d29a23c0e87ee0b46038fbed0e', urls=[https://go.googlesource.com/text]
Resolving cached github.com/etcd-io/etcd: commit='11214aa33bf5a47d3d9d8dafe0f6b97237dfe921', urls=[https://github.com/etcd-io/etcd.git, git@github.com:etcd-io/etcd.git]
> Task :release:go-licenses:java:dockerRun
+ go-licenses save github.com/apache/beam/sdks/java/container --save_path=/output/licenses
+ go-licenses csv github.com/apache/beam/sdks/java/container
+ tee /output/licenses/list.csv
google.golang.org/protobuf,https://go.googlesource.com/protobuf/+/refs/heads/master/LICENSE,BSD-3-Clause
google.golang.org/grpc,https://github.com/grpc/grpc-go/blob/master/LICENSE,Apache-2.0
golang.org/x/net,https://go.googlesource.com/net/+/refs/heads/master/LICENSE,BSD-3-Clause
golang.org/x/sys,https://go.googlesource.com/sys/+/refs/heads/master/LICENSE,BSD-3-Clause
golang.org/x/text,https://go.googlesource.com/text/+/refs/heads/master/LICENSE,BSD-3-Clause
github.com/apache/beam/sdks/java/container,https://github.com/apache/beam/blob/master/LICENSE,Apache-2.0
github.com/apache/beam/sdks/go/pkg/beam,https://github.com/apache/beam/blob/master/sdks/go/README.md,Apache-2.0
github.com/golang/protobuf,https://github.com/golang/protobuf/blob/master/LICENSE,BSD-3-Clause
google.golang.org/genproto/googleapis/rpc/status,https://github.com/googleapis/go-genproto/blob/master/LICENSE,Apache-2.0
+ chmod -R a+w /output/licenses
> Task :release:go-licenses:java:createLicenses
> Task :sdks:java:container:java11:copyGolangLicenses
> Task :sdks:go:resolveBuildDependencies
Resolving google.golang.org/api: commit='0324d5e90dc7753607860272666845fad9ceb97e', urls=[https://code.googlesource.com/google-api-go-client]
Resolving google.golang.org/genproto: commit='4d944d34d83c502a5f761500a14d8842648415c3', urls=[https://github.com/google/go-genproto]
Resolving google.golang.org/grpc: commit='5e8f83304c0563d1ba74db05fee83d9c18ab9a58', urls=[https://github.com/grpc/grpc-go]
Resolving google.golang.org/protobuf: commit='d165be301fb1e13390ad453281ded24385fd8ebc', urls=[https://go.googlesource.com/protobuf]
Resolving cached github.com/etcd-io/etcd: commit='11214aa33bf5a47d3d9d8dafe0f6b97237dfe921', urls=[https://github.com/etcd-io/etcd.git, git@github.com:etcd-io/etcd.git]
Resolving cached github.com/etcd-io/etcd: commit='11214aa33bf5a47d3d9d8dafe0f6b97237dfe921', urls=[https://github.com/etcd-io/etcd.git, git@github.com:etcd-io/etcd.git]
> Task :sdks:go:installDependencies
> Task :sdks:go:buildLinuxAmd64
> Task :sdks:go:goBuild
> Task :sdks:java:container:resolveBuildDependencies
Resolving ./github.com/apache/beam/sdks/go@<https://ci-beam.apache.org/job/beam_PostCommit_Java_Examples_Dataflow_V2_java11/ws/src/sdks/go>
> Task :sdks:java:container:installDependencies
> Task :sdks:java:container:buildLinuxAmd64
Unable to watch the file system for changes. The inotify watches limit is too low.
> Task :sdks:java:container:goBuild
> Task :sdks:java:container:java11:copySdkHarnessLauncher
> Task :sdks:java:container:java11:dockerPrepare
> Task :sdks:java:container:java11:docker
> Task :runners:google-cloud-dataflow-java:buildAndPushDockerContainer
WARNING: `gcloud docker` will not be supported for Docker client versions above 18.03.
As an alternative, use `gcloud auth configure-docker` to configure `docker` to
use `gcloud` as a credential helper, then use `docker` as you would for non-GCR
registries, e.g. `docker pull gcr.io/project-id/my-image`. Add
`--verbosity=error` to silence this warning: `gcloud docker
--verbosity=error -- pull gcr.io/project-id/my-image`.
See: https://cloud.google.com/container-registry/docs/support/deprecation-notices#gcloud-docker
The push refers to repository [us.gcr.io/apache-beam-testing/java-postcommit-it/java]
0cadd9a24d2e: Preparing
99915d3face3: Preparing
6f7f4e729895: Preparing
6a3e684d54e3: Preparing
b517eed1c0be: Preparing
64740ef130f6: Preparing
286b5acf42d3: Preparing
bccd6531ed01: Preparing
8f27881b9df8: Preparing
8aa0822ef180: Preparing
a97402bda44b: Preparing
b219714e1f91: Preparing
bccd6531ed01: Waiting
a4ed737b0c8f: Preparing
59f1e8e1ce66: Preparing
8f27881b9df8: Waiting
8aa0822ef180: Waiting
bde301416dd2: Preparing
81496d8c72c2: Preparing
644448d6e877: Preparing
0e41e5bdb921: Preparing
644448d6e877: Waiting
0e41e5bdb921: Waiting
286b5acf42d3: Waiting
bde301416dd2: Waiting
a4ed737b0c8f: Waiting
59f1e8e1ce66: Waiting
b219714e1f91: Waiting
64740ef130f6: Waiting
a97402bda44b: Waiting
81496d8c72c2: Waiting
99915d3face3: Pushed
0cadd9a24d2e: Pushed
b517eed1c0be: Pushed
6a3e684d54e3: Pushed
bccd6531ed01: Pushed
6f7f4e729895: Pushed
286b5acf42d3: Pushed
b219714e1f91: Layer already exists
a4ed737b0c8f: Layer already exists
59f1e8e1ce66: Layer already exists
bde301416dd2: Layer already exists
81496d8c72c2: Layer already exists
a97402bda44b: Pushed
8aa0822ef180: Pushed
644448d6e877: Layer already exists
0e41e5bdb921: Layer already exists
64740ef130f6: Pushed
8f27881b9df8: Pushed
20210321120053: digest: sha256:fe414c6b63484cbd92d141f7a7a9126bae74ff889458af5f11983f466556ca2a size: 4099
> Task :runners:google-cloud-dataflow-java:examplesJavaRunnerV2IntegrationTest
org.apache.beam.examples.cookbook.BigQueryStorageAPIStreamingIT > testStorageAPIStreaming FAILED
java.lang.IllegalArgumentException at BigQueryStorageAPIStreamingIT.java:119
***********************************************************
***********************************************************
**********************Set Up Pubsub************************
The Pub/Sub topic has been set up for this example: projects/apache-beam-testing/topics/testpipeline-jenkins-0321120641-14a91639
The Pub/Sub subscription has been set up for this example: projects/apache-beam-testing/subscriptions/testpipeline-jenkins-0321120641-14a91639
******************Set Up Big Query Table*******************
The BigQuery table has been set up for this example: apache-beam-testing:traffic_max_lane_flow_1616328401286.traffic_max_lane_flow_table
*************************Tear Down*************************
The Pub/Sub topic has been deleted: projects/apache-beam-testing/topics/testpipeline-jenkins-0321120641-14a91639
The Pub/Sub subscription has been deleted: projects/apache-beam-testing/subscriptions/testpipeline-jenkins-0321120641-14a91639
The BigQuery table might contain the example's output, and it is not deleted automatically: apache-beam-testing:traffic_max_lane_flow_1616328401286.traffic_max_lane_flow_table
Please go to the Developers Console to delete it manually. Otherwise, you may be charged for its usage.
***********************************************************
***********************************************************
org.apache.beam.examples.snippets.transforms.io.gcp.bigquery.BigQuerySamplesIT > testTableIO FAILED
java.lang.RuntimeException at BigQuerySamplesIT.java:121
org.apache.beam.examples.cookbook.BigQueryTornadoesIT > testE2eBigQueryTornadoesWithStorageApiUsingQuery FAILED
java.lang.RuntimeException at BigQueryTornadoesIT.java:68
org.apache.beam.examples.complete.TrafficRoutesIT > testE2ETrafficRoutes FAILED
java.lang.RuntimeException at TrafficRoutesIT.java:74
9 tests completed, 4 failed
> Task :runners:google-cloud-dataflow-java:examplesJavaRunnerV2IntegrationTest FAILED
> Task :runners:google-cloud-dataflow-java:cleanUpDockerImages FAILED
Untagged: us.gcr.io/apache-beam-testing/java-postcommit-it/java:20210321120053
Untagged: us.gcr.io/apache-beam-testing/java-postcommit-it/java@sha256:fe414c6b63484cbd92d141f7a7a9126bae74ff889458af5f11983f466556ca2a
ERROR: (gcloud.container.images.delete) [us.gcr.io/apache-beam-testing/java-postcommit-it/java:20210321120053] is not a valid name. Expected tag in the form "base:tag" or "tag" or digest in the form "sha256:<digest>"
FAILURE: Build completed with 2 failures.
1: Task failed with an exception.
-----------
* What went wrong:
Execution failed for task ':runners:google-cloud-dataflow-java:examplesJavaRunnerV2IntegrationTest'.
> There were failing tests. See the report at: file://<https://ci-beam.apache.org/job/beam_PostCommit_Java_Examples_Dataflow_V2_java11/ws/src/runners/google-cloud-dataflow-java/build/reports/tests/examplesJavaRunnerV2IntegrationTest/index.html>
* Try:
Run with --stacktrace option to get the stack trace. Run with --info or --debug option to get more log output. Run with --scan to get full insights.
==============================================================================
2: Task failed with an exception.
-----------
* Where:
Build file '<https://ci-beam.apache.org/job/beam_PostCommit_Java_Examples_Dataflow_V2_java11/ws/src/runners/google-cloud-dataflow-java/build.gradle'> line: 273
* What went wrong:
Execution failed for task ':runners:google-cloud-dataflow-java:cleanUpDockerImages'.
> Process 'command 'gcloud'' finished with non-zero exit value 1
* Try:
Run with --stacktrace option to get the stack trace. Run with --info or --debug option to get more log output. Run with --scan to get full insights.
==============================================================================
* Get more help at https://help.gradle.org
Deprecated Gradle features were used in this build, making it incompatible with Gradle 7.0.
Use '--warning-mode all' to show the individual deprecation warnings.
See https://docs.gradle.org/6.8/userguide/command_line_interface.html#sec:command_line_warnings
BUILD FAILED in 2h 26m 25s
87 actionable tasks: 55 executed, 30 from cache, 2 up-to-date
Gradle was unable to watch the file system for changes. The inotify watches limit is too low.
Publishing build scan...
https://gradle.com/s/yvwznquhr6in6
Build step 'Invoke Gradle script' changed build result to FAILURE
Build step 'Invoke Gradle script' marked build as failure
---------------------------------------------------------------------
To unsubscribe, e-mail: builds-unsubscribe@beam.apache.org
For additional commands, e-mail: builds-help@beam.apache.org
Jenkins build is back to normal :
beam_PostCommit_Java_Examples_Dataflow_V2_java11 #476
Posted by Apache Jenkins Server <je...@builds.apache.org>.
See <https://ci-beam.apache.org/job/beam_PostCommit_Java_Examples_Dataflow_V2_java11/476/display/redirect?page=changes>
---------------------------------------------------------------------
To unsubscribe, e-mail: builds-unsubscribe@beam.apache.org
For additional commands, e-mail: builds-help@beam.apache.org
Build failed in Jenkins:
beam_PostCommit_Java_Examples_Dataflow_V2_java11 #475
Posted by Apache Jenkins Server <je...@builds.apache.org>.
See <https://ci-beam.apache.org/job/beam_PostCommit_Java_Examples_Dataflow_V2_java11/475/display/redirect?page=changes>
Changes:
[msbukal] Minor FhirIO Search changes
[andyxu] Remove @Hidden and @Experimental annotation of CreateFromSnapshot
------------------------------------------
[...truncated 44.81 KB...]
Already using interpreter /usr/bin/python3
Using base prefix '/usr'
New python executable in <https://ci-beam.apache.org/job/beam_PostCommit_Java_Examples_Dataflow_V2_java11/ws/src/sdks/java/container/build/virtualenv/bin/python3>
Also creating executable in <https://ci-beam.apache.org/job/beam_PostCommit_Java_Examples_Dataflow_V2_java11/ws/src/sdks/java/container/build/virtualenv/bin/python>
Installing setuptools, pip, wheel...
done.
DEPRECATION: Python 3.5 reached the end of its life on September 13th, 2020. Please upgrade your Python as Python 3.5 is no longer maintained. pip 21.0 will drop support for Python 3.5 in January 2021. pip 21.0 will remove support for this functionality.
Collecting beautifulsoup4<5.0,>=4.9.0
Using cached beautifulsoup4-4.9.3-py3-none-any.whl (115 kB)
Collecting future<1.0.0,>=0.16.0
Using cached future-0.18.2-py3-none-any.whl
Collecting pyyaml<6.0.0,>=3.12
Using cached PyYAML-5.3.1-cp35-cp35m-linux_x86_64.whl
Collecting tenacity<6.0,>=5.0.2
Using cached tenacity-5.1.5-py2.py3-none-any.whl (34 kB)
Collecting soupsieve>1.2
Using cached soupsieve-2.1-py3-none-any.whl (32 kB)
Collecting six>=1.9.0
Using cached six-1.15.0-py2.py3-none-any.whl (10 kB)
Installing collected packages: soupsieve, six, tenacity, pyyaml, future, beautifulsoup4
Successfully installed beautifulsoup4-4.9.3 future-0.18.2 pyyaml-5.3.1 six-1.15.0 soupsieve-2.1 tenacity-5.1.5
Executing <https://ci-beam.apache.org/job/beam_PostCommit_Java_Examples_Dataflow_V2_java11/ws/src/sdks/java/container/build/virtualenv/bin/python> <https://ci-beam.apache.org/job/beam_PostCommit_Java_Examples_Dataflow_V2_java11/ws/src/sdks/java/container/license_scripts/pull_licenses_java.py> --license_index=<https://ci-beam.apache.org/job/beam_PostCommit_Java_Examples_Dataflow_V2_java11/ws/src/sdks/java/container/build/reports/dependency-license/index.json> --output_dir=<https://ci-beam.apache.org/job/beam_PostCommit_Java_Examples_Dataflow_V2_java11/ws/src/sdks/java/container/build/target/java_third_party_licenses> --dep_url_yaml=<https://ci-beam.apache.org/job/beam_PostCommit_Java_Examples_Dataflow_V2_java11/ws/src/sdks/java/container/license_scripts/dep_urls_java.yaml>
INFO:root:Pulling license for 206 dependencies using 16 threads.
INFO:root:pull_licenses_java.py succeed. It took 2.575511 seconds with 16 threads.
Copying licenses from <https://ci-beam.apache.org/job/beam_PostCommit_Java_Examples_Dataflow_V2_java11/ws/src/sdks/java/container/build/target/java_third_party_licenses> to <https://ci-beam.apache.org/job/beam_PostCommit_Java_Examples_Dataflow_V2_java11/ws/src/sdks/java/container/build/target/third_party_licenses.>
Finished license_scripts.sh
> Task :sdks:go:resolveBuildDependencies
Resolving golang.org/x/net: commit='2fb46b16b8dda405028c50f7c7f0f9dd1fa6bfb1', urls=[https://go.googlesource.com/net]
Resolving golang.org/x/oauth2: commit='5d25da1a8d43b66f2898c444f899c7bcfd6a407e', urls=[https://go.googlesource.com/oauth2]
Resolving golang.org/x/sync: commit='fd80eb99c8f653c847d294a001bdf2a3a6f768f5', urls=[https://go.googlesource.com/sync]
> Task :sdks:java:container:java11:copyJavaThirdPartyLicenses NO-SOURCE
> Task :sdks:java:io:google-cloud-platform:classes
> Task :sdks:java:io:google-cloud-platform:jar
> Task :sdks:go:resolveBuildDependencies
Resolving golang.org/x/sys: commit='fde4db37ae7ad8191b03d30d27f258b5291ae4e3', urls=[https://go.googlesource.com/sys]
> Task :runners:google-cloud-dataflow-java:compileJava
Note: Some input files use or override a deprecated API.
Note: Recompile with -Xlint:deprecation for details.
Note: Some input files use unchecked or unsafe operations.
Note: Recompile with -Xlint:unchecked for details.
> Task :runners:google-cloud-dataflow-java:classes
> Task :runners:google-cloud-dataflow-java:jar
> Task :examples:java:compileJava
Note: Some input files use or override a deprecated API.
Note: Recompile with -Xlint:deprecation for details.
Note: Some input files use unchecked or unsafe operations.
Note: Recompile with -Xlint:unchecked for details.
> Task :examples:java:classes
> Task :examples:java:jar
> Task :examples:java:compileTestJava
Note: Some input files use or override a deprecated API.
Note: Recompile with -Xlint:deprecation for details.
Note: Some input files use unchecked or unsafe operations.
Note: Recompile with -Xlint:unchecked for details.
> Task :examples:java:testClasses
> Task :examples:java:testJar
> Task :release:go-licenses:java:dockerRun
+ go-licenses save github.com/apache/beam/sdks/java/container --save_path=/output/licenses
+ go-licenses csv github.com/apache/beam/sdks/java/container
+ tee /output/licenses/list.csv
google.golang.org/grpc,https://github.com/grpc/grpc-go/blob/master/LICENSE,Apache-2.0
golang.org/x/net,https://go.googlesource.com/net/+/refs/heads/master/LICENSE,BSD-3-Clause
github.com/apache/beam/sdks/go/pkg/beam,https://github.com/apache/beam/blob/master/sdks/go/README.md,Apache-2.0
google.golang.org/protobuf,https://go.googlesource.com/protobuf/+/refs/heads/master/LICENSE,BSD-3-Clause
google.golang.org/genproto/googleapis/rpc/status,https://github.com/googleapis/go-genproto/blob/master/LICENSE,Apache-2.0
golang.org/x/sys,https://go.googlesource.com/sys/+/refs/heads/master/LICENSE,BSD-3-Clause
golang.org/x/text,https://go.googlesource.com/text/+/refs/heads/master/LICENSE,BSD-3-Clause
github.com/apache/beam/sdks/java/container,https://github.com/apache/beam/blob/master/LICENSE,Apache-2.0
github.com/golang/protobuf,https://github.com/golang/protobuf/blob/master/LICENSE,BSD-3-Clause
+ chmod -R a+w /output/licenses
> Task :release:go-licenses:java:createLicenses
> Task :sdks:java:container:java11:copyGolangLicenses
> Task :sdks:go:resolveBuildDependencies
Resolving golang.org/x/text: commit='23ae387dee1f90d29a23c0e87ee0b46038fbed0e', urls=[https://go.googlesource.com/text]
Resolving cached github.com/etcd-io/etcd: commit='11214aa33bf5a47d3d9d8dafe0f6b97237dfe921', urls=[https://github.com/etcd-io/etcd.git, git@github.com:etcd-io/etcd.git]
Resolving google.golang.org/api: commit='0324d5e90dc7753607860272666845fad9ceb97e', urls=[https://code.googlesource.com/google-api-go-client]
Resolving google.golang.org/genproto: commit='4d944d34d83c502a5f761500a14d8842648415c3', urls=[https://github.com/google/go-genproto]
Resolving google.golang.org/grpc: commit='5e8f83304c0563d1ba74db05fee83d9c18ab9a58', urls=[https://github.com/grpc/grpc-go]
Resolving google.golang.org/protobuf: commit='d165be301fb1e13390ad453281ded24385fd8ebc', urls=[https://go.googlesource.com/protobuf]
Resolving cached github.com/etcd-io/etcd: commit='11214aa33bf5a47d3d9d8dafe0f6b97237dfe921', urls=[https://github.com/etcd-io/etcd.git, git@github.com:etcd-io/etcd.git]
Resolving cached github.com/etcd-io/etcd: commit='11214aa33bf5a47d3d9d8dafe0f6b97237dfe921', urls=[https://github.com/etcd-io/etcd.git, git@github.com:etcd-io/etcd.git]
> Task :sdks:go:installDependencies
> Task :sdks:go:buildLinuxAmd64
> Task :sdks:go:goBuild
> Task :sdks:java:container:resolveBuildDependencies
Resolving ./github.com/apache/beam/sdks/go@<https://ci-beam.apache.org/job/beam_PostCommit_Java_Examples_Dataflow_V2_java11/ws/src/sdks/go>
> Task :sdks:java:container:installDependencies
> Task :sdks:java:container:buildLinuxAmd64
Unable to watch the file system for changes. The inotify watches limit is too low.
> Task :sdks:java:container:goBuild
> Task :sdks:java:container:java11:copySdkHarnessLauncher
> Task :sdks:java:container:java11:dockerPrepare
> Task :sdks:java:container:java11:docker
> Task :runners:google-cloud-dataflow-java:buildAndPushDockerContainer
WARNING: `gcloud docker` will not be supported for Docker client versions above 18.03.
As an alternative, use `gcloud auth configure-docker` to configure `docker` to
use `gcloud` as a credential helper, then use `docker` as you would for non-GCR
registries, e.g. `docker pull gcr.io/project-id/my-image`. Add
`--verbosity=error` to silence this warning: `gcloud docker
--verbosity=error -- pull gcr.io/project-id/my-image`.
See: https://cloud.google.com/container-registry/docs/support/deprecation-notices#gcloud-docker
The push refers to repository [us.gcr.io/apache-beam-testing/java-postcommit-it/java]
ff282b20cf0f: Preparing
6cbab463faeb: Preparing
c6732e3becb1: Preparing
0b2a37111832: Preparing
84d15e264d33: Preparing
fd4a42913586: Preparing
efc598975e52: Preparing
622ad8949d0d: Preparing
49a24e6e796f: Preparing
291e4dcd950f: Preparing
6aa5e6257270: Preparing
b219714e1f91: Preparing
a4ed737b0c8f: Preparing
59f1e8e1ce66: Preparing
bde301416dd2: Preparing
81496d8c72c2: Preparing
644448d6e877: Preparing
0e41e5bdb921: Preparing
fd4a42913586: Waiting
efc598975e52: Waiting
622ad8949d0d: Waiting
49a24e6e796f: Waiting
291e4dcd950f: Waiting
6aa5e6257270: Waiting
b219714e1f91: Waiting
a4ed737b0c8f: Waiting
59f1e8e1ce66: Waiting
bde301416dd2: Waiting
81496d8c72c2: Waiting
644448d6e877: Waiting
0e41e5bdb921: Waiting
6cbab463faeb: Pushed
0b2a37111832: Pushed
ff282b20cf0f: Pushed
84d15e264d33: Pushed
622ad8949d0d: Pushed
efc598975e52: Pushed
291e4dcd950f: Pushed
b219714e1f91: Layer already exists
c6732e3becb1: Pushed
a4ed737b0c8f: Layer already exists
59f1e8e1ce66: Layer already exists
bde301416dd2: Layer already exists
81496d8c72c2: Layer already exists
644448d6e877: Layer already exists
0e41e5bdb921: Layer already exists
6aa5e6257270: Pushed
fd4a42913586: Pushed
49a24e6e796f: Pushed
20210322180059: digest: sha256:ffe435c30f5592fecbabb3d2ba1e5ddc37db8d78248110cf27cdb16ec4736189 size: 4099
> Task :runners:google-cloud-dataflow-java:examplesJavaRunnerV2IntegrationTest
org.apache.beam.examples.cookbook.BigQueryStorageAPIStreamingIT > testStorageAPIStreaming FAILED
java.lang.IllegalArgumentException at BigQueryStorageAPIStreamingIT.java:119
***********************************************************
***********************************************************
**********************Set Up Pubsub************************
The Pub/Sub topic has been set up for this example: projects/apache-beam-testing/topics/testpipeline-jenkins-0322181401-2fbdc2dd
The Pub/Sub subscription has been set up for this example: projects/apache-beam-testing/subscriptions/testpipeline-jenkins-0322181401-2fbdc2dd
******************Set Up Big Query Table*******************
The BigQuery table has been set up for this example: apache-beam-testing:traffic_max_lane_flow_1616436839764.traffic_max_lane_flow_table
*************************Tear Down*************************
The Pub/Sub topic has been deleted: projects/apache-beam-testing/topics/testpipeline-jenkins-0322181401-2fbdc2dd
The Pub/Sub subscription has been deleted: projects/apache-beam-testing/subscriptions/testpipeline-jenkins-0322181401-2fbdc2dd
The BigQuery table might contain the example's output, and it is not deleted automatically: apache-beam-testing:traffic_max_lane_flow_1616436839764.traffic_max_lane_flow_table
Please go to the Developers Console to delete it manually. Otherwise, you may be charged for its usage.
***********************************************************
***********************************************************
***********************************************************
***********************************************************
**********************Set Up Pubsub************************
The Pub/Sub topic has been set up for this example: projects/apache-beam-testing/topics/testpipeline-jenkins-0322183750-3a4c8b5a
The Pub/Sub subscription has been set up for this example: projects/apache-beam-testing/subscriptions/testpipeline-jenkins-0322183750-3a4c8b5a
******************Set Up Big Query Table*******************
The BigQuery table has been set up for this example: apache-beam-testing:traffic_routes_1616438270176.traffic_routes_table
*************************Tear Down*************************
The Pub/Sub topic has been deleted: projects/apache-beam-testing/topics/testpipeline-jenkins-0322183750-3a4c8b5a
The Pub/Sub subscription has been deleted: projects/apache-beam-testing/subscriptions/testpipeline-jenkins-0322183750-3a4c8b5a
The BigQuery table might contain the example's output, and it is not deleted automatically: apache-beam-testing:traffic_routes_1616438270176.traffic_routes_table
Please go to the Developers Console to delete it manually. Otherwise, you may be charged for its usage.
***********************************************************
***********************************************************
9 tests completed, 1 failed
> Task :runners:google-cloud-dataflow-java:examplesJavaRunnerV2IntegrationTest FAILED
> Task :runners:google-cloud-dataflow-java:cleanUpDockerImages
Untagged: us.gcr.io/apache-beam-testing/java-postcommit-it/java:20210322180059
Untagged: us.gcr.io/apache-beam-testing/java-postcommit-it/java@sha256:ffe435c30f5592fecbabb3d2ba1e5ddc37db8d78248110cf27cdb16ec4736189
Digests:
- us.gcr.io/apache-beam-testing/java-postcommit-it/java@sha256:ffe435c30f5592fecbabb3d2ba1e5ddc37db8d78248110cf27cdb16ec4736189
Associated tags:
- 20210322180059
Tags:
- us.gcr.io/apache-beam-testing/java-postcommit-it/java:20210322180059
Deleted [us.gcr.io/apache-beam-testing/java-postcommit-it/java:20210322180059].
Deleted [us.gcr.io/apache-beam-testing/java-postcommit-it/java@sha256:ffe435c30f5592fecbabb3d2ba1e5ddc37db8d78248110cf27cdb16ec4736189].
FAILURE: Build failed with an exception.
* What went wrong:
Execution failed for task ':runners:google-cloud-dataflow-java:examplesJavaRunnerV2IntegrationTest'.
> There were failing tests. See the report at: file://<https://ci-beam.apache.org/job/beam_PostCommit_Java_Examples_Dataflow_V2_java11/ws/src/runners/google-cloud-dataflow-java/build/reports/tests/examplesJavaRunnerV2IntegrationTest/index.html>
* Try:
Run with --stacktrace option to get the stack trace. Run with --info or --debug option to get more log output. Run with --scan to get full insights.
* Get more help at https://help.gradle.org
Deprecated Gradle features were used in this build, making it incompatible with Gradle 7.0.
Use '--warning-mode all' to show the individual deprecation warnings.
See https://docs.gradle.org/6.8/userguide/command_line_interface.html#sec:command_line_warnings
BUILD FAILED in 42m 46s
87 actionable tasks: 59 executed, 26 from cache, 2 up-to-date
Gradle was unable to watch the file system for changes. The inotify watches limit is too low.
Publishing build scan...
https://gradle.com/s/2rvthfsajwuwe
Build step 'Invoke Gradle script' changed build result to FAILURE
Build step 'Invoke Gradle script' marked build as failure
---------------------------------------------------------------------
To unsubscribe, e-mail: builds-unsubscribe@beam.apache.org
For additional commands, e-mail: builds-help@beam.apache.org
Build failed in Jenkins:
beam_PostCommit_Java_Examples_Dataflow_V2_java11 #474
Posted by Apache Jenkins Server <je...@builds.apache.org>.
See <https://ci-beam.apache.org/job/beam_PostCommit_Java_Examples_Dataflow_V2_java11/474/display/redirect>
Changes:
------------------------------------------
[...truncated 46.02 KB...]
Digest: sha256:eb93d11dc4e39359ecf290c1bfdf18eea125d93f56c889a669706e3ffc33093e
Status: Downloaded newer image for golang:1.15.0-buster
---> 166f2b5fae2d
Step 2/6 : RUN go get github.com/google/go-licenses
> Task :runners:java-fn-execution:compileJava FROM-CACHE
> Task :runners:java-fn-execution:classes UP-TO-DATE
> Task :sdks:go:resolveBuildDependencies
Resolving golang.org/x/sync: commit='fd80eb99c8f653c847d294a001bdf2a3a6f768f5', urls=[https://go.googlesource.com/sync]
> Task :runners:java-fn-execution:jar
> Task :sdks:java:expansion-service:compileJava FROM-CACHE
> Task :sdks:java:expansion-service:classes UP-TO-DATE
> Task :runners:direct-java:compileJava FROM-CACHE
> Task :runners:direct-java:classes UP-TO-DATE
> Task :sdks:java:expansion-service:jar
> Task :sdks:java:extensions:ml:compileJava FROM-CACHE
> Task :sdks:java:extensions:ml:classes UP-TO-DATE
> Task :sdks:java:io:kafka:compileJava FROM-CACHE
> Task :sdks:java:io:kafka:classes UP-TO-DATE
> Task :runners:direct-java:shadowJar FROM-CACHE
> Task :sdks:java:extensions:ml:jar
> Task :sdks:java:io:kafka:jar
> Task :sdks:java:io:google-cloud-platform:compileJava FROM-CACHE
> Task :sdks:java:io:google-cloud-platform:classes UP-TO-DATE
> Task :sdks:java:io:google-cloud-platform:jar
> Task :runners:google-cloud-dataflow-java:compileJava FROM-CACHE
> Task :runners:google-cloud-dataflow-java:classes
> Task :examples:java:compileJava FROM-CACHE
> Task :examples:java:classes UP-TO-DATE
> Task :runners:google-cloud-dataflow-java:jar
> Task :examples:java:jar
> Task :sdks:go:resolveBuildDependencies
Resolving golang.org/x/sys: commit='fde4db37ae7ad8191b03d30d27f258b5291ae4e3', urls=[https://go.googlesource.com/sys]
> Task :sdks:java:container:java11:copyDockerfileDependencies
> Task :examples:java:compileTestJava FROM-CACHE
> Task :examples:java:testClasses
> Task :examples:java:testJar
> Task :release:go-licenses:java:docker
---> Running in f919bf863bc5
> Task :sdks:go:resolveBuildDependencies
Resolving golang.org/x/text: commit='23ae387dee1f90d29a23c0e87ee0b46038fbed0e', urls=[https://go.googlesource.com/text]
Resolving cached github.com/etcd-io/etcd: commit='11214aa33bf5a47d3d9d8dafe0f6b97237dfe921', urls=[https://github.com/etcd-io/etcd.git, git@github.com:etcd-io/etcd.git]
> Task :release:go-licenses:java:docker
Removing intermediate container f919bf863bc5
---> cd26a2227b5d
Step 3/6 : COPY get-licenses.sh /opt/apache/beam/
---> afe55bce6df8
Step 4/6 : ARG sdk_location
---> Running in 0f8b85632778
Removing intermediate container 0f8b85632778
---> e35597dd0a3b
Step 5/6 : ENV sdk_location=$sdk_location
---> Running in 14a985677b18
Removing intermediate container 14a985677b18
---> c0c8cdf3e011
Step 6/6 : ENTRYPOINT /opt/apache/beam/get-licenses.sh
---> Running in c3c5846bad3c
Removing intermediate container c3c5846bad3c
---> d2091a03ea6d
Successfully built d2091a03ea6d
Successfully tagged golicenses-java:latest
> Task :release:go-licenses:java:dockerRun
+ rm -rf '/output/*'
+ go get github.com/apache/beam/sdks/java/container
+ go-licenses save github.com/apache/beam/sdks/java/container --save_path=/output/licenses
+ go-licenses csv github.com/apache/beam/sdks/java/container
+ tee /output/licenses/list.csv
google.golang.org/genproto/googleapis/rpc/status,https://github.com/googleapis/go-genproto/blob/master/LICENSE,Apache-2.0
google.golang.org/grpc,https://github.com/grpc/grpc-go/blob/master/LICENSE,Apache-2.0
github.com/apache/beam/sdks/go/pkg/beam,https://github.com/apache/beam/blob/master/sdks/go/README.md,Apache-2.0
github.com/golang/protobuf,https://github.com/golang/protobuf/blob/master/LICENSE,BSD-3-Clause
google.golang.org/protobuf,https://go.googlesource.com/protobuf/+/refs/heads/master/LICENSE,BSD-3-Clause
golang.org/x/net,https://go.googlesource.com/net/+/refs/heads/master/LICENSE,BSD-3-Clause
golang.org/x/sys,https://go.googlesource.com/sys/+/refs/heads/master/LICENSE,BSD-3-Clause
golang.org/x/text,https://go.googlesource.com/text/+/refs/heads/master/LICENSE,BSD-3-Clause
github.com/apache/beam/sdks/java/container,https://github.com/apache/beam/blob/master/LICENSE,Apache-2.0
+ chmod -R a+w /output/licenses
> Task :release:go-licenses:java:createLicenses
> Task :sdks:java:container:java11:copyGolangLicenses
> Task :sdks:go:resolveBuildDependencies
Resolving google.golang.org/api: commit='0324d5e90dc7753607860272666845fad9ceb97e', urls=[https://code.googlesource.com/google-api-go-client]
Resolving google.golang.org/genproto: commit='4d944d34d83c502a5f761500a14d8842648415c3', urls=[https://github.com/google/go-genproto]
Resolving google.golang.org/grpc: commit='5e8f83304c0563d1ba74db05fee83d9c18ab9a58', urls=[https://github.com/grpc/grpc-go]
Resolving google.golang.org/protobuf: commit='d165be301fb1e13390ad453281ded24385fd8ebc', urls=[https://go.googlesource.com/protobuf]
Resolving cached github.com/etcd-io/etcd: commit='11214aa33bf5a47d3d9d8dafe0f6b97237dfe921', urls=[https://github.com/etcd-io/etcd.git, git@github.com:etcd-io/etcd.git]
Resolving cached github.com/etcd-io/etcd: commit='11214aa33bf5a47d3d9d8dafe0f6b97237dfe921', urls=[https://github.com/etcd-io/etcd.git, git@github.com:etcd-io/etcd.git]
> Task :sdks:go:installDependencies
> Task :sdks:go:buildLinuxAmd64
> Task :sdks:go:goBuild
> Task :sdks:java:container:resolveBuildDependencies
Unable to watch the file system for changes. The inotify watches limit is too low.
Resolving ./github.com/apache/beam/sdks/go@<https://ci-beam.apache.org/job/beam_PostCommit_Java_Examples_Dataflow_V2_java11/ws/src/sdks/go>
> Task :sdks:java:container:installDependencies
> Task :sdks:java:container:buildLinuxAmd64
> Task :sdks:java:container:goBuild
> Task :sdks:java:container:java11:copySdkHarnessLauncher
> Task :sdks:java:container:java11:dockerPrepare
> Task :sdks:java:container:java11:docker
> Task :runners:google-cloud-dataflow-java:buildAndPushDockerContainer
WARNING: `gcloud docker` will not be supported for Docker client versions above 18.03.
As an alternative, use `gcloud auth configure-docker` to configure `docker` to
use `gcloud` as a credential helper, then use `docker` as you would for non-GCR
registries, e.g. `docker pull gcr.io/project-id/my-image`. Add
`--verbosity=error` to silence this warning: `gcloud docker
--verbosity=error -- pull gcr.io/project-id/my-image`.
See: https://cloud.google.com/container-registry/docs/support/deprecation-notices#gcloud-docker
The push refers to repository [us.gcr.io/apache-beam-testing/java-postcommit-it/java]
0a37aba33adc: Preparing
096f0ce63c11: Preparing
7fe7d3b7d046: Preparing
53dcd7a32668: Preparing
270214b83f46: Preparing
6a430f0b8734: Preparing
ad132800ae3f: Preparing
26f67c588500: Preparing
bc55bde08679: Preparing
e99437d429fb: Preparing
d105c70ba73c: Preparing
b219714e1f91: Preparing
a4ed737b0c8f: Preparing
59f1e8e1ce66: Preparing
bde301416dd2: Preparing
81496d8c72c2: Preparing
644448d6e877: Preparing
0e41e5bdb921: Preparing
b219714e1f91: Waiting
d105c70ba73c: Waiting
59f1e8e1ce66: Waiting
6a430f0b8734: Waiting
bde301416dd2: Waiting
ad132800ae3f: Waiting
0e41e5bdb921: Waiting
81496d8c72c2: Waiting
644448d6e877: Waiting
bc55bde08679: Waiting
a4ed737b0c8f: Waiting
e99437d429fb: Waiting
53dcd7a32668: Pushed
096f0ce63c11: Pushed
270214b83f46: Pushed
0a37aba33adc: Pushed
26f67c588500: Pushed
ad132800ae3f: Pushed
e99437d429fb: Pushed
b219714e1f91: Layer already exists
a4ed737b0c8f: Layer already exists
59f1e8e1ce66: Layer already exists
bde301416dd2: Layer already exists
81496d8c72c2: Layer already exists
d105c70ba73c: Pushed
7fe7d3b7d046: Pushed
644448d6e877: Layer already exists
0e41e5bdb921: Layer already exists
6a430f0b8734: Pushed
bc55bde08679: Pushed
20210322120111: digest: sha256:347b88cc05a821389466b8fe9deddf1db53acd70f643278e6954a9b89af3dddc size: 4099
> Task :runners:google-cloud-dataflow-java:examplesJavaRunnerV2IntegrationTest
org.apache.beam.examples.cookbook.BigQueryStorageAPIStreamingIT > testStorageAPIStreaming FAILED
java.lang.IllegalArgumentException at BigQueryStorageAPIStreamingIT.java:119
***********************************************************
***********************************************************
**********************Set Up Pubsub************************
The Pub/Sub topic has been set up for this example: projects/apache-beam-testing/topics/testpipeline-jenkins-0322121425-e7090e35
The Pub/Sub subscription has been set up for this example: projects/apache-beam-testing/subscriptions/testpipeline-jenkins-0322121425-e7090e35
******************Set Up Big Query Table*******************
The BigQuery table has been set up for this example: apache-beam-testing:traffic_max_lane_flow_1616415264782.traffic_max_lane_flow_table
*************************Tear Down*************************
The Pub/Sub topic has been deleted: projects/apache-beam-testing/topics/testpipeline-jenkins-0322121425-e7090e35
The Pub/Sub subscription has been deleted: projects/apache-beam-testing/subscriptions/testpipeline-jenkins-0322121425-e7090e35
The BigQuery table might contain the example's output, and it is not deleted automatically: apache-beam-testing:traffic_max_lane_flow_1616415264782.traffic_max_lane_flow_table
Please go to the Developers Console to delete it manually. Otherwise, you may be charged for its usage.
***********************************************************
***********************************************************
***********************************************************
***********************************************************
**********************Set Up Pubsub************************
The Pub/Sub topic has been set up for this example: projects/apache-beam-testing/topics/testpipeline-jenkins-0322123928-f831784a
The Pub/Sub subscription has been set up for this example: projects/apache-beam-testing/subscriptions/testpipeline-jenkins-0322123928-f831784a
******************Set Up Big Query Table*******************
The BigQuery table has been set up for this example: apache-beam-testing:traffic_routes_1616416768318.traffic_routes_table
*************************Tear Down*************************
The Pub/Sub topic has been deleted: projects/apache-beam-testing/topics/testpipeline-jenkins-0322123928-f831784a
The Pub/Sub subscription has been deleted: projects/apache-beam-testing/subscriptions/testpipeline-jenkins-0322123928-f831784a
The BigQuery table might contain the example's output, and it is not deleted automatically: apache-beam-testing:traffic_routes_1616416768318.traffic_routes_table
Please go to the Developers Console to delete it manually. Otherwise, you may be charged for its usage.
***********************************************************
***********************************************************
9 tests completed, 1 failed
> Task :runners:google-cloud-dataflow-java:examplesJavaRunnerV2IntegrationTest FAILED
> Task :runners:google-cloud-dataflow-java:cleanUpDockerImages
Untagged: us.gcr.io/apache-beam-testing/java-postcommit-it/java:20210322120111
Untagged: us.gcr.io/apache-beam-testing/java-postcommit-it/java@sha256:347b88cc05a821389466b8fe9deddf1db53acd70f643278e6954a9b89af3dddc
Digests:
- us.gcr.io/apache-beam-testing/java-postcommit-it/java@sha256:347b88cc05a821389466b8fe9deddf1db53acd70f643278e6954a9b89af3dddc
Associated tags:
- 20210322120111
Tags:
- us.gcr.io/apache-beam-testing/java-postcommit-it/java:20210322120111
Deleted [us.gcr.io/apache-beam-testing/java-postcommit-it/java:20210322120111].
Deleted [us.gcr.io/apache-beam-testing/java-postcommit-it/java@sha256:347b88cc05a821389466b8fe9deddf1db53acd70f643278e6954a9b89af3dddc].
FAILURE: Build failed with an exception.
* What went wrong:
Execution failed for task ':runners:google-cloud-dataflow-java:examplesJavaRunnerV2IntegrationTest'.
> There were failing tests. See the report at: file://<https://ci-beam.apache.org/job/beam_PostCommit_Java_Examples_Dataflow_V2_java11/ws/src/runners/google-cloud-dataflow-java/build/reports/tests/examplesJavaRunnerV2IntegrationTest/index.html>
* Try:
Run with --stacktrace option to get the stack trace. Run with --info or --debug option to get more log output. Run with --scan to get full insights.
* Get more help at https://help.gradle.org
Deprecated Gradle features were used in this build, making it incompatible with Gradle 7.0.
Use '--warning-mode all' to show the individual deprecation warnings.
See https://docs.gradle.org/6.8/userguide/command_line_interface.html#sec:command_line_warnings
BUILD FAILED in 44m 36s
87 actionable tasks: 55 executed, 30 from cache, 2 up-to-date
Gradle was unable to watch the file system for changes. The inotify watches limit is too low.
Publishing build scan...
https://gradle.com/s/vmb625cgazsri
Build step 'Invoke Gradle script' changed build result to FAILURE
Build step 'Invoke Gradle script' marked build as failure
---------------------------------------------------------------------
To unsubscribe, e-mail: builds-unsubscribe@beam.apache.org
For additional commands, e-mail: builds-help@beam.apache.org
Build failed in Jenkins:
beam_PostCommit_Java_Examples_Dataflow_V2_java11 #473
Posted by Apache Jenkins Server <je...@builds.apache.org>.
See <https://ci-beam.apache.org/job/beam_PostCommit_Java_Examples_Dataflow_V2_java11/473/display/redirect>
Changes:
------------------------------------------
[...truncated 40.67 KB...]
Resolving github.com/pelletier/go-toml: commit='acdc4509485b587f5e675510c4f2c63e90ff68a8', urls=[https://github.com/pelletier/go-toml.git, git@github.com:pelletier/go-toml.git]
Resolving cached github.com/etcd-io/etcd: commit='11214aa33bf5a47d3d9d8dafe0f6b97237dfe921', urls=[https://github.com/etcd-io/etcd.git, git@github.com:etcd-io/etcd.git]
Resolving github.com/pierrec/lz4: commit='ed8d4cc3b461464e69798080a0092bd028910298', urls=[https://github.com/pierrec/lz4.git, git@github.com:pierrec/lz4.git]
Resolving github.com/pierrec/xxHash: commit='a0006b13c722f7f12368c00a3d3c2ae8a999a0c6', urls=[https://github.com/pierrec/xxHash.git, git@github.com:pierrec/xxHash.git]
Resolving github.com/pkg/errors: commit='30136e27e2ac8d167177e8a583aa4c3fea5be833', urls=[https://github.com/pkg/errors.git, git@github.com:pkg/errors.git]
Resolving github.com/pkg/sftp: commit='22e9c1ccc02fc1b9fa3264572e49109b68a86947', urls=[https://github.com/pkg/sftp.git, git@github.com:pkg/sftp.git]
Resolving github.com/prometheus/client_golang: commit='9bb6ab929dcbe1c8393cd9ef70387cb69811bd1c', urls=[https://github.com/prometheus/client_golang.git, git@github.com:prometheus/client_golang.git]
Resolving cached github.com/etcd-io/etcd: commit='11214aa33bf5a47d3d9d8dafe0f6b97237dfe921', urls=[https://github.com/etcd-io/etcd.git, git@github.com:etcd-io/etcd.git]
Resolving cached github.com/etcd-io/etcd: commit='11214aa33bf5a47d3d9d8dafe0f6b97237dfe921', urls=[https://github.com/etcd-io/etcd.git, git@github.com:etcd-io/etcd.git]
Resolving github.com/prometheus/procfs: commit='cb4147076ac75738c9a7d279075a253c0cc5acbd', urls=[https://github.com/prometheus/procfs.git, git@github.com:prometheus/procfs.git]
Resolving github.com/rcrowley/go-metrics: commit='8732c616f52954686704c8645fe1a9d59e9df7c1', urls=[https://github.com/rcrowley/go-metrics.git, git@github.com:rcrowley/go-metrics.git]
Resolving github.com/cpuguy83/go-md2man: commit='dc9f53734905c233adfc09fd4f063dce63ce3daf', urls=[https://github.com/cpuguy83/go-md2man.git, git@github.com:cpuguy83/go-md2man.git]
Resolving cached github.com/cpuguy83/go-md2man: commit='dc9f53734905c233adfc09fd4f063dce63ce3daf', urls=[https://github.com/cpuguy83/go-md2man.git, git@github.com:cpuguy83/go-md2man.git]
Resolving cached github.com/etcd-io/etcd: commit='11214aa33bf5a47d3d9d8dafe0f6b97237dfe921', urls=[https://github.com/etcd-io/etcd.git, git@github.com:etcd-io/etcd.git]
Resolving cached github.com/etcd-io/etcd: commit='11214aa33bf5a47d3d9d8dafe0f6b97237dfe921', urls=[https://github.com/etcd-io/etcd.git, git@github.com:etcd-io/etcd.git]
Resolving github.com/spf13/afero: commit='bb8f1927f2a9d3ab41c9340aa034f6b803f4359c', urls=[https://github.com/spf13/afero.git, git@github.com:spf13/afero.git]
Resolving github.com/spf13/cast: commit='acbeb36b902d72a7a4c18e8f3241075e7ab763e4', urls=[https://github.com/spf13/cast.git, git@github.com:spf13/cast.git]
Resolving github.com/spf13/cobra: commit='93959269ad99e80983c9ba742a7e01203a4c0e4f', urls=[https://github.com/spf13/cobra.git, git@github.com:spf13/cobra.git]
Resolving github.com/spf13/jwalterweatherman: commit='7c0cea34c8ece3fbeb2b27ab9b59511d360fb394', urls=[https://github.com/spf13/jwalterweatherman.git, git@github.com:spf13/jwalterweatherman.git]
Resolving cached github.com/etcd-io/etcd: commit='11214aa33bf5a47d3d9d8dafe0f6b97237dfe921', urls=[https://github.com/etcd-io/etcd.git, git@github.com:etcd-io/etcd.git]
Resolving github.com/spf13/viper: commit='aafc9e6bc7b7bb53ddaa75a5ef49a17d6e654be5', urls=[https://github.com/spf13/viper.git, git@github.com:spf13/viper.git]
Resolving github.com/stathat/go: commit='74669b9f388d9d788c97399a0824adbfee78400e', urls=[https://github.com/stathat/go.git, git@github.com:stathat/go.git]
Resolving cached github.com/etcd-io/etcd: commit='11214aa33bf5a47d3d9d8dafe0f6b97237dfe921', urls=[https://github.com/etcd-io/etcd.git, git@github.com:etcd-io/etcd.git]
Resolving cached github.com/etcd-io/etcd: commit='11214aa33bf5a47d3d9d8dafe0f6b97237dfe921', urls=[https://github.com/etcd-io/etcd.git, git@github.com:etcd-io/etcd.git]
Resolving cached github.com/etcd-io/etcd: commit='11214aa33bf5a47d3d9d8dafe0f6b97237dfe921', urls=[https://github.com/etcd-io/etcd.git, git@github.com:etcd-io/etcd.git]
Resolving cached github.com/etcd-io/etcd: commit='11214aa33bf5a47d3d9d8dafe0f6b97237dfe921', urls=[https://github.com/etcd-io/etcd.git, git@github.com:etcd-io/etcd.git]
Resolving github.com/xordataexchange/crypt: commit='b2862e3d0a775f18c7cfe02273500ae307b61218', urls=[https://github.com/xordataexchange/crypt.git, git@github.com:xordataexchange/crypt.git]
> Task :runners:direct-java:shadowJar FROM-CACHE
> Task :sdks:java:io:google-cloud-platform:jar
> Task :sdks:java:container:pullLicenses
Successfully installed beautifulsoup4-4.9.3 future-0.18.2 pyyaml-5.3.1 six-1.15.0 soupsieve-2.1 tenacity-5.1.5
Executing <https://ci-beam.apache.org/job/beam_PostCommit_Java_Examples_Dataflow_V2_java11/ws/src/sdks/java/container/build/virtualenv/bin/python> <https://ci-beam.apache.org/job/beam_PostCommit_Java_Examples_Dataflow_V2_java11/ws/src/sdks/java/container/license_scripts/pull_licenses_java.py> --license_index=<https://ci-beam.apache.org/job/beam_PostCommit_Java_Examples_Dataflow_V2_java11/ws/src/sdks/java/container/build/reports/dependency-license/index.json> --output_dir=<https://ci-beam.apache.org/job/beam_PostCommit_Java_Examples_Dataflow_V2_java11/ws/src/sdks/java/container/build/target/java_third_party_licenses> --dep_url_yaml=<https://ci-beam.apache.org/job/beam_PostCommit_Java_Examples_Dataflow_V2_java11/ws/src/sdks/java/container/license_scripts/dep_urls_java.yaml>
INFO:root:Pulling license for 206 dependencies using 16 threads.
> Task :sdks:java:container:java11:copyDockerfileDependencies
> Task :runners:google-cloud-dataflow-java:compileJava FROM-CACHE
> Task :runners:google-cloud-dataflow-java:classes
> Task :examples:java:compileJava FROM-CACHE
> Task :examples:java:classes UP-TO-DATE
> Task :runners:google-cloud-dataflow-java:jar
> Task :examples:java:jar
> Task :sdks:go:resolveBuildDependencies
Resolving go.opencensus.io: commit='3fb168f674736c026e623310bfccb0691e6dec8a', urls=[https://github.com/census-instrumentation/opencensus-go]
Resolving golang.org/x/crypto: commit='d9133f5469342136e669e85192a26056b587f503', urls=[https://go.googlesource.com/crypto]
> Task :examples:java:compileTestJava FROM-CACHE
> Task :examples:java:testClasses
> Task :sdks:java:container:pullLicenses
INFO:root:pull_licenses_java.py succeed. It took 2.418427 seconds with 16 threads.
Copying licenses from <https://ci-beam.apache.org/job/beam_PostCommit_Java_Examples_Dataflow_V2_java11/ws/src/sdks/java/container/build/target/java_third_party_licenses> to <https://ci-beam.apache.org/job/beam_PostCommit_Java_Examples_Dataflow_V2_java11/ws/src/sdks/java/container/build/target/third_party_licenses.>
> Task :examples:java:testJar
> Task :sdks:java:container:pullLicenses
Finished license_scripts.sh
> Task :sdks:java:container:java11:copyJavaThirdPartyLicenses NO-SOURCE
> Task :sdks:go:resolveBuildDependencies
Resolving golang.org/x/debug: commit='95515998a8a4bd7448134b2cb5971dbeb12e0b77', urls=[https://go.googlesource.com/debug]
Resolving golang.org/x/net: commit='2fb46b16b8dda405028c50f7c7f0f9dd1fa6bfb1', urls=[https://go.googlesource.com/net]
Resolving golang.org/x/oauth2: commit='5d25da1a8d43b66f2898c444f899c7bcfd6a407e', urls=[https://go.googlesource.com/oauth2]
Resolving golang.org/x/sync: commit='fd80eb99c8f653c847d294a001bdf2a3a6f768f5', urls=[https://go.googlesource.com/sync]
Resolving golang.org/x/sys: commit='fde4db37ae7ad8191b03d30d27f258b5291ae4e3', urls=[https://go.googlesource.com/sys]
> Task :release:go-licenses:java:dockerRun
+ go-licenses save github.com/apache/beam/sdks/java/container --save_path=/output/licenses
+ tee /output/licenses/list.csv
+ go-licenses csv github.com/apache/beam/sdks/java/container
github.com/apache/beam/sdks/go/pkg/beam,https://github.com/apache/beam/blob/master/sdks/go/README.md,Apache-2.0
google.golang.org/protobuf,https://go.googlesource.com/protobuf/+/refs/heads/master/LICENSE,BSD-3-Clause
google.golang.org/genproto/googleapis/rpc/status,https://github.com/googleapis/go-genproto/blob/master/LICENSE,Apache-2.0
golang.org/x/sys,https://go.googlesource.com/sys/+/refs/heads/master/LICENSE,BSD-3-Clause
golang.org/x/text,https://go.googlesource.com/text/+/refs/heads/master/LICENSE,BSD-3-Clause
github.com/apache/beam/sdks/java/container,https://github.com/apache/beam/blob/master/LICENSE,Apache-2.0
github.com/golang/protobuf,https://github.com/golang/protobuf/blob/master/LICENSE,BSD-3-Clause
google.golang.org/grpc,https://github.com/grpc/grpc-go/blob/master/LICENSE,Apache-2.0
golang.org/x/net,https://go.googlesource.com/net/+/refs/heads/master/LICENSE,BSD-3-Clause
+ chmod -R a+w /output/licenses
> Task :release:go-licenses:java:createLicenses
> Task :sdks:java:container:java11:copyGolangLicenses
> Task :sdks:go:resolveBuildDependencies
Resolving golang.org/x/text: commit='23ae387dee1f90d29a23c0e87ee0b46038fbed0e', urls=[https://go.googlesource.com/text]
Resolving cached github.com/etcd-io/etcd: commit='11214aa33bf5a47d3d9d8dafe0f6b97237dfe921', urls=[https://github.com/etcd-io/etcd.git, git@github.com:etcd-io/etcd.git]
Resolving google.golang.org/api: commit='0324d5e90dc7753607860272666845fad9ceb97e', urls=[https://code.googlesource.com/google-api-go-client]
Resolving google.golang.org/genproto: commit='4d944d34d83c502a5f761500a14d8842648415c3', urls=[https://github.com/google/go-genproto]
Resolving google.golang.org/grpc: commit='5e8f83304c0563d1ba74db05fee83d9c18ab9a58', urls=[https://github.com/grpc/grpc-go]
Resolving google.golang.org/protobuf: commit='d165be301fb1e13390ad453281ded24385fd8ebc', urls=[https://go.googlesource.com/protobuf]
Resolving cached github.com/etcd-io/etcd: commit='11214aa33bf5a47d3d9d8dafe0f6b97237dfe921', urls=[https://github.com/etcd-io/etcd.git, git@github.com:etcd-io/etcd.git]
Resolving cached github.com/etcd-io/etcd: commit='11214aa33bf5a47d3d9d8dafe0f6b97237dfe921', urls=[https://github.com/etcd-io/etcd.git, git@github.com:etcd-io/etcd.git]
> Task :sdks:go:installDependencies
> Task :sdks:go:buildLinuxAmd64
> Task :sdks:go:goBuild
> Task :sdks:java:container:resolveBuildDependencies
Unable to watch the file system for changes. The inotify watches limit is too low.
Resolving ./github.com/apache/beam/sdks/go@<https://ci-beam.apache.org/job/beam_PostCommit_Java_Examples_Dataflow_V2_java11/ws/src/sdks/go>
> Task :sdks:java:container:installDependencies
> Task :sdks:java:container:buildLinuxAmd64
> Task :sdks:java:container:goBuild
> Task :sdks:java:container:java11:copySdkHarnessLauncher
> Task :sdks:java:container:java11:dockerPrepare
> Task :sdks:java:container:java11:docker
> Task :runners:google-cloud-dataflow-java:buildAndPushDockerContainer
WARNING: `gcloud docker` will not be supported for Docker client versions above 18.03.
As an alternative, use `gcloud auth configure-docker` to configure `docker` to
use `gcloud` as a credential helper, then use `docker` as you would for non-GCR
registries, e.g. `docker pull gcr.io/project-id/my-image`. Add
`--verbosity=error` to silence this warning: `gcloud docker
--verbosity=error -- pull gcr.io/project-id/my-image`.
See: https://cloud.google.com/container-registry/docs/support/deprecation-notices#gcloud-docker
The push refers to repository [us.gcr.io/apache-beam-testing/java-postcommit-it/java]
f9d445c23edc: Preparing
a8a9b796c9ec: Preparing
9b53163114e9: Preparing
6fde2d76922b: Preparing
791253d5bdc9: Preparing
fe3aec7ce3e1: Preparing
75f997396e91: Preparing
ed792f72fbbc: Preparing
3c1c055090ad: Preparing
0d277d255e16: Preparing
e03624fb3887: Preparing
75f997396e91: Waiting
b219714e1f91: Preparing
a4ed737b0c8f: Preparing
e03624fb3887: Waiting
fe3aec7ce3e1: Waiting
ed792f72fbbc: Waiting
a4ed737b0c8f: Waiting
0d277d255e16: Waiting
59f1e8e1ce66: Preparing
59f1e8e1ce66: Waiting
bde301416dd2: Preparing
b219714e1f91: Waiting
3c1c055090ad: Waiting
81496d8c72c2: Preparing
644448d6e877: Preparing
81496d8c72c2: Waiting
644448d6e877: Waiting
0e41e5bdb921: Preparing
0e41e5bdb921: Waiting
791253d5bdc9: Pushed
f9d445c23edc: Pushed
a8a9b796c9ec: Pushed
6fde2d76922b: Pushed
ed792f72fbbc: Pushed
9b53163114e9: Pushed
75f997396e91: Pushed
b219714e1f91: Layer already exists
a4ed737b0c8f: Layer already exists
59f1e8e1ce66: Layer already exists
bde301416dd2: Layer already exists
81496d8c72c2: Layer already exists
644448d6e877: Layer already exists
0e41e5bdb921: Layer already exists
e03624fb3887: Pushed
0d277d255e16: Pushed
fe3aec7ce3e1: Pushed
3c1c055090ad: Pushed
20210322060107: digest: sha256:e827cc88a4d22f9a9fdcdfcd6566b06826b3ffc38c652131b3f59c510b009257 size: 4099
> Task :runners:google-cloud-dataflow-java:examplesJavaRunnerV2IntegrationTest
org.apache.beam.examples.cookbook.BigQueryStorageAPIStreamingIT > testStorageAPIStreaming FAILED
java.lang.IllegalArgumentException at BigQueryStorageAPIStreamingIT.java:119
***********************************************************
***********************************************************
**********************Set Up Pubsub************************
The Pub/Sub topic has been set up for this example: projects/apache-beam-testing/topics/testpipeline-jenkins-0322060834-5f16edf0
The Pub/Sub subscription has been set up for this example: projects/apache-beam-testing/subscriptions/testpipeline-jenkins-0322060834-5f16edf0
******************Set Up Big Query Table*******************
The BigQuery table has been set up for this example: apache-beam-testing:traffic_max_lane_flow_1616393314091.traffic_max_lane_flow_table
*************************Tear Down*************************
The Pub/Sub topic has been deleted: projects/apache-beam-testing/topics/testpipeline-jenkins-0322060834-5f16edf0
The Pub/Sub subscription has been deleted: projects/apache-beam-testing/subscriptions/testpipeline-jenkins-0322060834-5f16edf0
The BigQuery table might contain the example's output, and it is not deleted automatically: apache-beam-testing:traffic_max_lane_flow_1616393314091.traffic_max_lane_flow_table
Please go to the Developers Console to delete it manually. Otherwise, you may be charged for its usage.
***********************************************************
***********************************************************
***********************************************************
***********************************************************
**********************Set Up Pubsub************************
The Pub/Sub topic has been set up for this example: projects/apache-beam-testing/topics/testpipeline-jenkins-0322063246-71252e65
The Pub/Sub subscription has been set up for this example: projects/apache-beam-testing/subscriptions/testpipeline-jenkins-0322063246-71252e65
******************Set Up Big Query Table*******************
The BigQuery table has been set up for this example: apache-beam-testing:traffic_routes_1616394766237.traffic_routes_table
*************************Tear Down*************************
The Pub/Sub topic has been deleted: projects/apache-beam-testing/topics/testpipeline-jenkins-0322063246-71252e65
The Pub/Sub subscription has been deleted: projects/apache-beam-testing/subscriptions/testpipeline-jenkins-0322063246-71252e65
The BigQuery table might contain the example's output, and it is not deleted automatically: apache-beam-testing:traffic_routes_1616394766237.traffic_routes_table
Please go to the Developers Console to delete it manually. Otherwise, you may be charged for its usage.
***********************************************************
***********************************************************
9 tests completed, 1 failed
> Task :runners:google-cloud-dataflow-java:examplesJavaRunnerV2IntegrationTest FAILED
> Task :runners:google-cloud-dataflow-java:cleanUpDockerImages
Untagged: us.gcr.io/apache-beam-testing/java-postcommit-it/java:20210322060107
Untagged: us.gcr.io/apache-beam-testing/java-postcommit-it/java@sha256:e827cc88a4d22f9a9fdcdfcd6566b06826b3ffc38c652131b3f59c510b009257
Digests:
- us.gcr.io/apache-beam-testing/java-postcommit-it/java@sha256:e827cc88a4d22f9a9fdcdfcd6566b06826b3ffc38c652131b3f59c510b009257
Associated tags:
- 20210322060107
Tags:
- us.gcr.io/apache-beam-testing/java-postcommit-it/java:20210322060107
Deleted [us.gcr.io/apache-beam-testing/java-postcommit-it/java:20210322060107].
Deleted [us.gcr.io/apache-beam-testing/java-postcommit-it/java@sha256:e827cc88a4d22f9a9fdcdfcd6566b06826b3ffc38c652131b3f59c510b009257].
FAILURE: Build failed with an exception.
* What went wrong:
Execution failed for task ':runners:google-cloud-dataflow-java:examplesJavaRunnerV2IntegrationTest'.
> There were failing tests. See the report at: file://<https://ci-beam.apache.org/job/beam_PostCommit_Java_Examples_Dataflow_V2_java11/ws/src/runners/google-cloud-dataflow-java/build/reports/tests/examplesJavaRunnerV2IntegrationTest/index.html>
* Try:
Run with --stacktrace option to get the stack trace. Run with --info or --debug option to get more log output. Run with --scan to get full insights.
* Get more help at https://help.gradle.org
Deprecated Gradle features were used in this build, making it incompatible with Gradle 7.0.
Use '--warning-mode all' to show the individual deprecation warnings.
See https://docs.gradle.org/6.8/userguide/command_line_interface.html#sec:command_line_warnings
BUILD FAILED in 37m 25s
87 actionable tasks: 55 executed, 30 from cache, 2 up-to-date
Gradle was unable to watch the file system for changes. The inotify watches limit is too low.
Publishing build scan...
https://gradle.com/s/dwjqgyfxgltny
Build step 'Invoke Gradle script' changed build result to FAILURE
Build step 'Invoke Gradle script' marked build as failure
---------------------------------------------------------------------
To unsubscribe, e-mail: builds-unsubscribe@beam.apache.org
For additional commands, e-mail: builds-help@beam.apache.org
Build failed in Jenkins:
beam_PostCommit_Java_Examples_Dataflow_V2_java11 #472
Posted by Apache Jenkins Server <je...@builds.apache.org>.
See <https://ci-beam.apache.org/job/beam_PostCommit_Java_Examples_Dataflow_V2_java11/472/display/redirect>
Changes:
------------------------------------------
[...truncated 40.64 KB...]
Resolving github.com/stathat/go: commit='74669b9f388d9d788c97399a0824adbfee78400e', urls=[https://github.com/stathat/go.git, git@github.com:stathat/go.git]
Resolving cached github.com/etcd-io/etcd: commit='11214aa33bf5a47d3d9d8dafe0f6b97237dfe921', urls=[https://github.com/etcd-io/etcd.git, git@github.com:etcd-io/etcd.git]
Resolving cached github.com/etcd-io/etcd: commit='11214aa33bf5a47d3d9d8dafe0f6b97237dfe921', urls=[https://github.com/etcd-io/etcd.git, git@github.com:etcd-io/etcd.git]
Resolving cached github.com/etcd-io/etcd: commit='11214aa33bf5a47d3d9d8dafe0f6b97237dfe921', urls=[https://github.com/etcd-io/etcd.git, git@github.com:etcd-io/etcd.git]
Resolving cached github.com/etcd-io/etcd: commit='11214aa33bf5a47d3d9d8dafe0f6b97237dfe921', urls=[https://github.com/etcd-io/etcd.git, git@github.com:etcd-io/etcd.git]
Resolving github.com/xordataexchange/crypt: commit='b2862e3d0a775f18c7cfe02273500ae307b61218', urls=[https://github.com/xordataexchange/crypt.git, git@github.com:xordataexchange/crypt.git]
Resolving go.opencensus.io: commit='3fb168f674736c026e623310bfccb0691e6dec8a', urls=[https://github.com/census-instrumentation/opencensus-go]
Resolving golang.org/x/crypto: commit='d9133f5469342136e669e85192a26056b587f503', urls=[https://go.googlesource.com/crypto]
Resolving golang.org/x/debug: commit='95515998a8a4bd7448134b2cb5971dbeb12e0b77', urls=[https://go.googlesource.com/debug]
> Task :runners:java-fn-execution:compileJava FROM-CACHE
> Task :runners:java-fn-execution:classes UP-TO-DATE
> Task :sdks:java:container:pullLicenses
Collecting pyyaml<6.0.0,>=3.12
Using cached PyYAML-5.3.1-cp35-cp35m-linux_x86_64.whl
Collecting tenacity<6.0,>=5.0.2
Using cached tenacity-5.1.5-py2.py3-none-any.whl (34 kB)
Collecting soupsieve>1.2
Using cached soupsieve-2.1-py3-none-any.whl (32 kB)
Collecting six>=1.9.0
Using cached six-1.15.0-py2.py3-none-any.whl (10 kB)
Installing collected packages: soupsieve, six, tenacity, pyyaml, future, beautifulsoup4
Successfully installed beautifulsoup4-4.9.3 future-0.18.2 pyyaml-5.3.1 six-1.15.0 soupsieve-2.1 tenacity-5.1.5
Executing <https://ci-beam.apache.org/job/beam_PostCommit_Java_Examples_Dataflow_V2_java11/ws/src/sdks/java/container/build/virtualenv/bin/python> <https://ci-beam.apache.org/job/beam_PostCommit_Java_Examples_Dataflow_V2_java11/ws/src/sdks/java/container/license_scripts/pull_licenses_java.py> --license_index=<https://ci-beam.apache.org/job/beam_PostCommit_Java_Examples_Dataflow_V2_java11/ws/src/sdks/java/container/build/reports/dependency-license/index.json> --output_dir=<https://ci-beam.apache.org/job/beam_PostCommit_Java_Examples_Dataflow_V2_java11/ws/src/sdks/java/container/build/target/java_third_party_licenses> --dep_url_yaml=<https://ci-beam.apache.org/job/beam_PostCommit_Java_Examples_Dataflow_V2_java11/ws/src/sdks/java/container/license_scripts/dep_urls_java.yaml>
INFO:root:Pulling license for 206 dependencies using 16 threads.
> Task :runners:java-fn-execution:jar
> Task :sdks:java:expansion-service:compileJava FROM-CACHE
> Task :sdks:java:expansion-service:classes UP-TO-DATE
> Task :sdks:java:expansion-service:jar
> Task :runners:direct-java:compileJava FROM-CACHE
> Task :sdks:java:extensions:ml:compileJava FROM-CACHE
> Task :sdks:java:extensions:ml:classes UP-TO-DATE
> Task :sdks:java:io:kafka:compileJava FROM-CACHE
> Task :sdks:java:io:kafka:classes UP-TO-DATE
> Task :sdks:java:extensions:ml:jar
> Task :runners:direct-java:classes UP-TO-DATE
> Task :sdks:java:io:kafka:jar
> Task :runners:direct-java:shadowJar FROM-CACHE
> Task :sdks:java:io:google-cloud-platform:compileJava FROM-CACHE
> Task :sdks:java:io:google-cloud-platform:classes UP-TO-DATE
> Task :sdks:java:io:google-cloud-platform:jar
> Task :runners:google-cloud-dataflow-java:compileJava FROM-CACHE
> Task :runners:google-cloud-dataflow-java:classes
> Task :examples:java:compileJava FROM-CACHE
> Task :examples:java:classes UP-TO-DATE
> Task :runners:google-cloud-dataflow-java:jar
> Task :examples:java:jar
> Task :sdks:java:container:java11:copyDockerfileDependencies
> Task :examples:java:compileTestJava FROM-CACHE
> Task :examples:java:testClasses
> Task :examples:java:testJar
> Task :sdks:go:resolveBuildDependencies
Resolving golang.org/x/net: commit='2fb46b16b8dda405028c50f7c7f0f9dd1fa6bfb1', urls=[https://go.googlesource.com/net]
Resolving golang.org/x/oauth2: commit='5d25da1a8d43b66f2898c444f899c7bcfd6a407e', urls=[https://go.googlesource.com/oauth2]
Resolving golang.org/x/sync: commit='fd80eb99c8f653c847d294a001bdf2a3a6f768f5', urls=[https://go.googlesource.com/sync]
> Task :sdks:java:container:pullLicenses
INFO:root:pull_licenses_java.py succeed. It took 3.03958 seconds with 16 threads.
Copying licenses from <https://ci-beam.apache.org/job/beam_PostCommit_Java_Examples_Dataflow_V2_java11/ws/src/sdks/java/container/build/target/java_third_party_licenses> to <https://ci-beam.apache.org/job/beam_PostCommit_Java_Examples_Dataflow_V2_java11/ws/src/sdks/java/container/build/target/third_party_licenses.>
Finished license_scripts.sh
> Task :sdks:java:container:java11:copyJavaThirdPartyLicenses NO-SOURCE
> Task :sdks:go:resolveBuildDependencies
Resolving golang.org/x/sys: commit='fde4db37ae7ad8191b03d30d27f258b5291ae4e3', urls=[https://go.googlesource.com/sys]
Resolving golang.org/x/text: commit='23ae387dee1f90d29a23c0e87ee0b46038fbed0e', urls=[https://go.googlesource.com/text]
Resolving cached github.com/etcd-io/etcd: commit='11214aa33bf5a47d3d9d8dafe0f6b97237dfe921', urls=[https://github.com/etcd-io/etcd.git, git@github.com:etcd-io/etcd.git]
> Task :release:go-licenses:java:dockerRun
+ go-licenses save github.com/apache/beam/sdks/java/container --save_path=/output/licenses
+ go-licenses csv github.com/apache/beam/sdks/java/container
+ tee /output/licenses/list.csv
golang.org/x/sys,https://go.googlesource.com/sys/+/refs/heads/master/LICENSE,BSD-3-Clause
golang.org/x/text,https://go.googlesource.com/text/+/refs/heads/master/LICENSE,BSD-3-Clause
github.com/apache/beam/sdks/go/pkg/beam,https://github.com/apache/beam/blob/master/sdks/go/README.md,Apache-2.0
google.golang.org/grpc,https://github.com/grpc/grpc-go/blob/master/LICENSE,Apache-2.0
google.golang.org/protobuf,https://go.googlesource.com/protobuf/+/refs/heads/master/LICENSE,BSD-3-Clause
golang.org/x/net,https://go.googlesource.com/net/+/refs/heads/master/LICENSE,BSD-3-Clause
google.golang.org/genproto/googleapis/rpc/status,https://github.com/googleapis/go-genproto/blob/master/LICENSE,Apache-2.0
github.com/apache/beam/sdks/java/container,https://github.com/apache/beam/blob/master/LICENSE,Apache-2.0
github.com/golang/protobuf,https://github.com/golang/protobuf/blob/master/LICENSE,BSD-3-Clause
+ chmod -R a+w /output/licenses
> Task :release:go-licenses:java:createLicenses
> Task :sdks:java:container:java11:copyGolangLicenses
> Task :sdks:go:resolveBuildDependencies
Resolving google.golang.org/api: commit='0324d5e90dc7753607860272666845fad9ceb97e', urls=[https://code.googlesource.com/google-api-go-client]
Resolving google.golang.org/genproto: commit='4d944d34d83c502a5f761500a14d8842648415c3', urls=[https://github.com/google/go-genproto]
Resolving google.golang.org/grpc: commit='5e8f83304c0563d1ba74db05fee83d9c18ab9a58', urls=[https://github.com/grpc/grpc-go]
Resolving google.golang.org/protobuf: commit='d165be301fb1e13390ad453281ded24385fd8ebc', urls=[https://go.googlesource.com/protobuf]
Resolving cached github.com/etcd-io/etcd: commit='11214aa33bf5a47d3d9d8dafe0f6b97237dfe921', urls=[https://github.com/etcd-io/etcd.git, git@github.com:etcd-io/etcd.git]
Resolving cached github.com/etcd-io/etcd: commit='11214aa33bf5a47d3d9d8dafe0f6b97237dfe921', urls=[https://github.com/etcd-io/etcd.git, git@github.com:etcd-io/etcd.git]
> Task :sdks:go:installDependencies
> Task :sdks:go:buildLinuxAmd64
> Task :sdks:go:goBuild
> Task :sdks:java:container:resolveBuildDependencies
Unable to watch the file system for changes. The inotify watches limit is too low.
Resolving ./github.com/apache/beam/sdks/go@<https://ci-beam.apache.org/job/beam_PostCommit_Java_Examples_Dataflow_V2_java11/ws/src/sdks/go>
> Task :sdks:java:container:installDependencies
> Task :sdks:java:container:buildLinuxAmd64
> Task :sdks:java:container:goBuild
> Task :sdks:java:container:java11:copySdkHarnessLauncher
> Task :sdks:java:container:java11:dockerPrepare
> Task :sdks:java:container:java11:docker
> Task :runners:google-cloud-dataflow-java:buildAndPushDockerContainer
WARNING: `gcloud docker` will not be supported for Docker client versions above 18.03.
As an alternative, use `gcloud auth configure-docker` to configure `docker` to
use `gcloud` as a credential helper, then use `docker` as you would for non-GCR
registries, e.g. `docker pull gcr.io/project-id/my-image`. Add
`--verbosity=error` to silence this warning: `gcloud docker
--verbosity=error -- pull gcr.io/project-id/my-image`.
See: https://cloud.google.com/container-registry/docs/support/deprecation-notices#gcloud-docker
The push refers to repository [us.gcr.io/apache-beam-testing/java-postcommit-it/java]
174e9d604d55: Preparing
dad423c44577: Preparing
89a2b2ef1d2e: Preparing
786a963c36b7: Preparing
ca475a6c719b: Preparing
e3aee040e51f: Preparing
1fafae1d1e91: Preparing
104c5df10945: Preparing
aa461edf1961: Preparing
f4230ba4c37b: Preparing
21dacb87b505: Preparing
b219714e1f91: Preparing
a4ed737b0c8f: Preparing
59f1e8e1ce66: Preparing
bde301416dd2: Preparing
81496d8c72c2: Preparing
644448d6e877: Preparing
104c5df10945: Waiting
0e41e5bdb921: Preparing
21dacb87b505: Waiting
aa461edf1961: Waiting
bde301416dd2: Waiting
644448d6e877: Waiting
f4230ba4c37b: Waiting
e3aee040e51f: Waiting
81496d8c72c2: Waiting
a4ed737b0c8f: Waiting
59f1e8e1ce66: Waiting
b219714e1f91: Waiting
1fafae1d1e91: Waiting
dad423c44577: Pushed
174e9d604d55: Pushed
ca475a6c719b: Pushed
786a963c36b7: Pushed
89a2b2ef1d2e: Pushed
104c5df10945: Pushed
1fafae1d1e91: Pushed
b219714e1f91: Layer already exists
a4ed737b0c8f: Layer already exists
59f1e8e1ce66: Layer already exists
bde301416dd2: Layer already exists
81496d8c72c2: Layer already exists
644448d6e877: Layer already exists
0e41e5bdb921: Layer already exists
f4230ba4c37b: Pushed
21dacb87b505: Pushed
e3aee040e51f: Pushed
aa461edf1961: Pushed
20210322000122: digest: sha256:dd5417b95a1e2f54f835f16413e5baf38299e7f956a0e5577db9d7c1499fce8a size: 4099
> Task :runners:google-cloud-dataflow-java:examplesJavaRunnerV2IntegrationTest
org.apache.beam.examples.cookbook.BigQueryStorageAPIStreamingIT > testStorageAPIStreaming FAILED
java.lang.IllegalArgumentException at BigQueryStorageAPIStreamingIT.java:119
***********************************************************
***********************************************************
**********************Set Up Pubsub************************
The Pub/Sub topic has been set up for this example: projects/apache-beam-testing/topics/testpipeline-jenkins-0322000821-698acfb7
The Pub/Sub subscription has been set up for this example: projects/apache-beam-testing/subscriptions/testpipeline-jenkins-0322000821-698acfb7
******************Set Up Big Query Table*******************
The BigQuery table has been set up for this example: apache-beam-testing:traffic_max_lane_flow_1616371699891.traffic_max_lane_flow_table
*************************Tear Down*************************
The Pub/Sub topic has been deleted: projects/apache-beam-testing/topics/testpipeline-jenkins-0322000821-698acfb7
The Pub/Sub subscription has been deleted: projects/apache-beam-testing/subscriptions/testpipeline-jenkins-0322000821-698acfb7
The BigQuery table might contain the example's output, and it is not deleted automatically: apache-beam-testing:traffic_max_lane_flow_1616371699891.traffic_max_lane_flow_table
Please go to the Developers Console to delete it manually. Otherwise, you may be charged for its usage.
***********************************************************
***********************************************************
***********************************************************
***********************************************************
**********************Set Up Pubsub************************
The Pub/Sub topic has been set up for this example: projects/apache-beam-testing/topics/testpipeline-jenkins-0322003058-ee2f0899
The Pub/Sub subscription has been set up for this example: projects/apache-beam-testing/subscriptions/testpipeline-jenkins-0322003058-ee2f0899
******************Set Up Big Query Table*******************
The BigQuery table has been set up for this example: apache-beam-testing:traffic_routes_1616373057686.traffic_routes_table
*************************Tear Down*************************
The Pub/Sub topic has been deleted: projects/apache-beam-testing/topics/testpipeline-jenkins-0322003058-ee2f0899
The Pub/Sub subscription has been deleted: projects/apache-beam-testing/subscriptions/testpipeline-jenkins-0322003058-ee2f0899
The BigQuery table might contain the example's output, and it is not deleted automatically: apache-beam-testing:traffic_routes_1616373057686.traffic_routes_table
Please go to the Developers Console to delete it manually. Otherwise, you may be charged for its usage.
***********************************************************
***********************************************************
9 tests completed, 1 failed
> Task :runners:google-cloud-dataflow-java:examplesJavaRunnerV2IntegrationTest FAILED
> Task :runners:google-cloud-dataflow-java:cleanUpDockerImages
Untagged: us.gcr.io/apache-beam-testing/java-postcommit-it/java:20210322000122
Untagged: us.gcr.io/apache-beam-testing/java-postcommit-it/java@sha256:dd5417b95a1e2f54f835f16413e5baf38299e7f956a0e5577db9d7c1499fce8a
Digests:
- us.gcr.io/apache-beam-testing/java-postcommit-it/java@sha256:dd5417b95a1e2f54f835f16413e5baf38299e7f956a0e5577db9d7c1499fce8a
Associated tags:
- 20210322000122
Tags:
- us.gcr.io/apache-beam-testing/java-postcommit-it/java:20210322000122
Deleted [us.gcr.io/apache-beam-testing/java-postcommit-it/java:20210322000122].
Deleted [us.gcr.io/apache-beam-testing/java-postcommit-it/java@sha256:dd5417b95a1e2f54f835f16413e5baf38299e7f956a0e5577db9d7c1499fce8a].
FAILURE: Build failed with an exception.
* What went wrong:
Execution failed for task ':runners:google-cloud-dataflow-java:examplesJavaRunnerV2IntegrationTest'.
> There were failing tests. See the report at: file://<https://ci-beam.apache.org/job/beam_PostCommit_Java_Examples_Dataflow_V2_java11/ws/src/runners/google-cloud-dataflow-java/build/reports/tests/examplesJavaRunnerV2IntegrationTest/index.html>
* Try:
Run with --stacktrace option to get the stack trace. Run with --info or --debug option to get more log output. Run with --scan to get full insights.
* Get more help at https://help.gradle.org
Deprecated Gradle features were used in this build, making it incompatible with Gradle 7.0.
Use '--warning-mode all' to show the individual deprecation warnings.
See https://docs.gradle.org/6.8/userguide/command_line_interface.html#sec:command_line_warnings
BUILD FAILED in 35m 37s
87 actionable tasks: 55 executed, 30 from cache, 2 up-to-date
Gradle was unable to watch the file system for changes. The inotify watches limit is too low.
Publishing build scan...
https://gradle.com/s/7m4kzsal5fky4
Build step 'Invoke Gradle script' changed build result to FAILURE
Build step 'Invoke Gradle script' marked build as failure
---------------------------------------------------------------------
To unsubscribe, e-mail: builds-unsubscribe@beam.apache.org
For additional commands, e-mail: builds-help@beam.apache.org
Build failed in Jenkins:
beam_PostCommit_Java_Examples_Dataflow_V2_java11 #471
Posted by Apache Jenkins Server <je...@builds.apache.org>.
See <https://ci-beam.apache.org/job/beam_PostCommit_Java_Examples_Dataflow_V2_java11/471/display/redirect>
Changes:
------------------------------------------
[...truncated 40.05 KB...]
Resolving github.com/spf13/cast: commit='acbeb36b902d72a7a4c18e8f3241075e7ab763e4', urls=[https://github.com/spf13/cast.git, git@github.com:spf13/cast.git]
Resolving github.com/spf13/cobra: commit='93959269ad99e80983c9ba742a7e01203a4c0e4f', urls=[https://github.com/spf13/cobra.git, git@github.com:spf13/cobra.git]
Resolving github.com/spf13/jwalterweatherman: commit='7c0cea34c8ece3fbeb2b27ab9b59511d360fb394', urls=[https://github.com/spf13/jwalterweatherman.git, git@github.com:spf13/jwalterweatherman.git]
Resolving cached github.com/etcd-io/etcd: commit='11214aa33bf5a47d3d9d8dafe0f6b97237dfe921', urls=[https://github.com/etcd-io/etcd.git, git@github.com:etcd-io/etcd.git]
Resolving github.com/spf13/viper: commit='aafc9e6bc7b7bb53ddaa75a5ef49a17d6e654be5', urls=[https://github.com/spf13/viper.git, git@github.com:spf13/viper.git]
Resolving github.com/stathat/go: commit='74669b9f388d9d788c97399a0824adbfee78400e', urls=[https://github.com/stathat/go.git, git@github.com:stathat/go.git]
Resolving cached github.com/etcd-io/etcd: commit='11214aa33bf5a47d3d9d8dafe0f6b97237dfe921', urls=[https://github.com/etcd-io/etcd.git, git@github.com:etcd-io/etcd.git]
Resolving cached github.com/etcd-io/etcd: commit='11214aa33bf5a47d3d9d8dafe0f6b97237dfe921', urls=[https://github.com/etcd-io/etcd.git, git@github.com:etcd-io/etcd.git]
Resolving cached github.com/etcd-io/etcd: commit='11214aa33bf5a47d3d9d8dafe0f6b97237dfe921', urls=[https://github.com/etcd-io/etcd.git, git@github.com:etcd-io/etcd.git]
Resolving cached github.com/etcd-io/etcd: commit='11214aa33bf5a47d3d9d8dafe0f6b97237dfe921', urls=[https://github.com/etcd-io/etcd.git, git@github.com:etcd-io/etcd.git]
Resolving github.com/xordataexchange/crypt: commit='b2862e3d0a775f18c7cfe02273500ae307b61218', urls=[https://github.com/xordataexchange/crypt.git, git@github.com:xordataexchange/crypt.git]
Resolving go.opencensus.io: commit='3fb168f674736c026e623310bfccb0691e6dec8a', urls=[https://github.com/census-instrumentation/opencensus-go]
Resolving golang.org/x/crypto: commit='d9133f5469342136e669e85192a26056b587f503', urls=[https://go.googlesource.com/crypto]
Resolving golang.org/x/debug: commit='95515998a8a4bd7448134b2cb5971dbeb12e0b77', urls=[https://go.googlesource.com/debug]
> Task :runners:java-fn-execution:compileJava FROM-CACHE
> Task :runners:java-fn-execution:classes UP-TO-DATE
> Task :runners:java-fn-execution:jar
> Task :sdks:java:container:pullLicenses
Collecting soupsieve>1.2
Using cached soupsieve-2.1-py3-none-any.whl (32 kB)
Collecting six>=1.9.0
Using cached six-1.15.0-py2.py3-none-any.whl (10 kB)
Installing collected packages: soupsieve, six, tenacity, pyyaml, future, beautifulsoup4
Successfully installed beautifulsoup4-4.9.3 future-0.18.2 pyyaml-5.3.1 six-1.15.0 soupsieve-2.1 tenacity-5.1.5
Executing <https://ci-beam.apache.org/job/beam_PostCommit_Java_Examples_Dataflow_V2_java11/ws/src/sdks/java/container/build/virtualenv/bin/python> <https://ci-beam.apache.org/job/beam_PostCommit_Java_Examples_Dataflow_V2_java11/ws/src/sdks/java/container/license_scripts/pull_licenses_java.py> --license_index=<https://ci-beam.apache.org/job/beam_PostCommit_Java_Examples_Dataflow_V2_java11/ws/src/sdks/java/container/build/reports/dependency-license/index.json> --output_dir=<https://ci-beam.apache.org/job/beam_PostCommit_Java_Examples_Dataflow_V2_java11/ws/src/sdks/java/container/build/target/java_third_party_licenses> --dep_url_yaml=<https://ci-beam.apache.org/job/beam_PostCommit_Java_Examples_Dataflow_V2_java11/ws/src/sdks/java/container/license_scripts/dep_urls_java.yaml>
INFO:root:Pulling license for 206 dependencies using 16 threads.
INFO:root:pull_licenses_java.py succeed. It took 2.225734 seconds with 16 threads.
Copying licenses from <https://ci-beam.apache.org/job/beam_PostCommit_Java_Examples_Dataflow_V2_java11/ws/src/sdks/java/container/build/target/java_third_party_licenses> to <https://ci-beam.apache.org/job/beam_PostCommit_Java_Examples_Dataflow_V2_java11/ws/src/sdks/java/container/build/target/third_party_licenses.>
> Task :sdks:java:expansion-service:compileJava FROM-CACHE
> Task :sdks:java:expansion-service:classes UP-TO-DATE
> Task :sdks:java:expansion-service:jar
> Task :runners:direct-java:compileJava FROM-CACHE
> Task :sdks:java:extensions:ml:compileJava FROM-CACHE
> Task :sdks:java:extensions:ml:classes UP-TO-DATE
> Task :sdks:java:io:kafka:compileJava FROM-CACHE
> Task :sdks:java:io:kafka:classes UP-TO-DATE
> Task :sdks:java:extensions:ml:jar
> Task :runners:direct-java:classes UP-TO-DATE
> Task :sdks:java:io:kafka:jar
> Task :runners:direct-java:shadowJar FROM-CACHE
> Task :sdks:java:io:google-cloud-platform:compileJava FROM-CACHE
> Task :sdks:java:io:google-cloud-platform:classes UP-TO-DATE
> Task :sdks:java:io:google-cloud-platform:jar
> Task :sdks:java:container:pullLicenses
Finished license_scripts.sh
> Task :runners:google-cloud-dataflow-java:compileJava FROM-CACHE
> Task :runners:google-cloud-dataflow-java:classes
> Task :runners:google-cloud-dataflow-java:jar
> Task :sdks:java:container:java11:copyDockerfileDependencies
> Task :sdks:java:container:java11:copyJavaThirdPartyLicenses NO-SOURCE
> Task :examples:java:compileJava FROM-CACHE
> Task :examples:java:classes UP-TO-DATE
> Task :sdks:go:resolveBuildDependencies
Resolving golang.org/x/net: commit='2fb46b16b8dda405028c50f7c7f0f9dd1fa6bfb1', urls=[https://go.googlesource.com/net]
> Task :examples:java:jar
> Task :examples:java:compileTestJava FROM-CACHE
> Task :examples:java:testClasses
> Task :examples:java:testJar
> Task :sdks:go:resolveBuildDependencies
Resolving golang.org/x/oauth2: commit='5d25da1a8d43b66f2898c444f899c7bcfd6a407e', urls=[https://go.googlesource.com/oauth2]
Resolving golang.org/x/sync: commit='fd80eb99c8f653c847d294a001bdf2a3a6f768f5', urls=[https://go.googlesource.com/sync]
Resolving golang.org/x/sys: commit='fde4db37ae7ad8191b03d30d27f258b5291ae4e3', urls=[https://go.googlesource.com/sys]
Resolving golang.org/x/text: commit='23ae387dee1f90d29a23c0e87ee0b46038fbed0e', urls=[https://go.googlesource.com/text]
Resolving cached github.com/etcd-io/etcd: commit='11214aa33bf5a47d3d9d8dafe0f6b97237dfe921', urls=[https://github.com/etcd-io/etcd.git, git@github.com:etcd-io/etcd.git]
> Task :release:go-licenses:java:dockerRun
+ go-licenses save github.com/apache/beam/sdks/java/container --save_path=/output/licenses
+ go-licenses csv github.com/apache/beam/sdks/java/container
+ tee /output/licenses/list.csv
github.com/apache/beam/sdks/java/container,https://github.com/apache/beam/blob/master/LICENSE,Apache-2.0
github.com/apache/beam/sdks/go/pkg/beam,https://github.com/apache/beam/blob/master/sdks/go/README.md,Apache-2.0
github.com/golang/protobuf,https://github.com/golang/protobuf/blob/master/LICENSE,BSD-3-Clause
google.golang.org/grpc,https://github.com/grpc/grpc-go/blob/master/LICENSE,Apache-2.0
golang.org/x/net,https://go.googlesource.com/net/+/refs/heads/master/LICENSE,BSD-3-Clause
google.golang.org/genproto/googleapis/rpc/status,https://github.com/googleapis/go-genproto/blob/master/LICENSE,Apache-2.0
google.golang.org/protobuf,https://go.googlesource.com/protobuf/+/refs/heads/master/LICENSE,BSD-3-Clause
golang.org/x/sys,https://go.googlesource.com/sys/+/refs/heads/master/LICENSE,BSD-3-Clause
golang.org/x/text,https://go.googlesource.com/text/+/refs/heads/master/LICENSE,BSD-3-Clause
+ chmod -R a+w /output/licenses
> Task :release:go-licenses:java:createLicenses
> Task :sdks:java:container:java11:copyGolangLicenses
> Task :sdks:go:resolveBuildDependencies
Resolving google.golang.org/api: commit='0324d5e90dc7753607860272666845fad9ceb97e', urls=[https://code.googlesource.com/google-api-go-client]
Resolving google.golang.org/genproto: commit='4d944d34d83c502a5f761500a14d8842648415c3', urls=[https://github.com/google/go-genproto]
Resolving google.golang.org/grpc: commit='5e8f83304c0563d1ba74db05fee83d9c18ab9a58', urls=[https://github.com/grpc/grpc-go]
Resolving google.golang.org/protobuf: commit='d165be301fb1e13390ad453281ded24385fd8ebc', urls=[https://go.googlesource.com/protobuf]
Resolving cached github.com/etcd-io/etcd: commit='11214aa33bf5a47d3d9d8dafe0f6b97237dfe921', urls=[https://github.com/etcd-io/etcd.git, git@github.com:etcd-io/etcd.git]
Resolving cached github.com/etcd-io/etcd: commit='11214aa33bf5a47d3d9d8dafe0f6b97237dfe921', urls=[https://github.com/etcd-io/etcd.git, git@github.com:etcd-io/etcd.git]
> Task :sdks:go:installDependencies
> Task :sdks:go:buildLinuxAmd64
> Task :sdks:go:goBuild
> Task :sdks:java:container:resolveBuildDependencies
Resolving ./github.com/apache/beam/sdks/go@<https://ci-beam.apache.org/job/beam_PostCommit_Java_Examples_Dataflow_V2_java11/ws/src/sdks/go>
> Task :sdks:java:container:installDependencies
> Task :sdks:java:container:buildLinuxAmd64
Unable to watch the file system for changes. The inotify watches limit is too low.
> Task :sdks:java:container:goBuild
> Task :sdks:java:container:java11:copySdkHarnessLauncher
> Task :sdks:java:container:java11:dockerPrepare
> Task :sdks:java:container:java11:docker
> Task :runners:google-cloud-dataflow-java:buildAndPushDockerContainer
WARNING: `gcloud docker` will not be supported for Docker client versions above 18.03.
As an alternative, use `gcloud auth configure-docker` to configure `docker` to
use `gcloud` as a credential helper, then use `docker` as you would for non-GCR
registries, e.g. `docker pull gcr.io/project-id/my-image`. Add
`--verbosity=error` to silence this warning: `gcloud docker
--verbosity=error -- pull gcr.io/project-id/my-image`.
See: https://cloud.google.com/container-registry/docs/support/deprecation-notices#gcloud-docker
The push refers to repository [us.gcr.io/apache-beam-testing/java-postcommit-it/java]
f7e7320bfa22: Preparing
8899282cfebc: Preparing
53fde9e62ffd: Preparing
9429421a2c6a: Preparing
356882e6b054: Preparing
1ecd3d85d704: Preparing
92ed9cec2e99: Preparing
248138095b61: Preparing
5a193104c5cc: Preparing
fc42594f0b0f: Preparing
1ecd3d85d704: Waiting
db9c5a9be8cd: Preparing
248138095b61: Waiting
db9c5a9be8cd: Waiting
b219714e1f91: Preparing
a4ed737b0c8f: Preparing
59f1e8e1ce66: Preparing
bde301416dd2: Preparing
59f1e8e1ce66: Waiting
81496d8c72c2: Preparing
644448d6e877: Preparing
0e41e5bdb921: Preparing
0e41e5bdb921: Waiting
fc42594f0b0f: Waiting
a4ed737b0c8f: Waiting
81496d8c72c2: Waiting
f7e7320bfa22: Pushed
356882e6b054: Pushed
53fde9e62ffd: Pushed
9429421a2c6a: Pushed
8899282cfebc: Pushed
248138095b61: Pushed
fc42594f0b0f: Pushed
b219714e1f91: Layer already exists
92ed9cec2e99: Pushed
a4ed737b0c8f: Layer already exists
59f1e8e1ce66: Layer already exists
bde301416dd2: Layer already exists
81496d8c72c2: Layer already exists
644448d6e877: Layer already exists
0e41e5bdb921: Layer already exists
db9c5a9be8cd: Pushed
1ecd3d85d704: Pushed
5a193104c5cc: Pushed
20210321180114: digest: sha256:57a688250298d24c97ec70181ced5f50725f58f426aa892bb021a29acb460172 size: 4099
> Task :runners:google-cloud-dataflow-java:examplesJavaRunnerV2IntegrationTest
org.apache.beam.examples.cookbook.BigQueryStorageAPIStreamingIT > testStorageAPIStreaming FAILED
java.lang.IllegalArgumentException at BigQueryStorageAPIStreamingIT.java:119
***********************************************************
***********************************************************
**********************Set Up Pubsub************************
The Pub/Sub topic has been set up for this example: projects/apache-beam-testing/topics/testpipeline-jenkins-0321180838-ac560d35
The Pub/Sub subscription has been set up for this example: projects/apache-beam-testing/subscriptions/testpipeline-jenkins-0321180838-ac560d35
******************Set Up Big Query Table*******************
The BigQuery table has been set up for this example: apache-beam-testing:traffic_max_lane_flow_1616350118104.traffic_max_lane_flow_table
*************************Tear Down*************************
The Pub/Sub topic has been deleted: projects/apache-beam-testing/topics/testpipeline-jenkins-0321180838-ac560d35
The Pub/Sub subscription has been deleted: projects/apache-beam-testing/subscriptions/testpipeline-jenkins-0321180838-ac560d35
The BigQuery table might contain the example's output, and it is not deleted automatically: apache-beam-testing:traffic_max_lane_flow_1616350118104.traffic_max_lane_flow_table
Please go to the Developers Console to delete it manually. Otherwise, you may be charged for its usage.
***********************************************************
***********************************************************
***********************************************************
***********************************************************
**********************Set Up Pubsub************************
The Pub/Sub topic has been set up for this example: projects/apache-beam-testing/topics/testpipeline-jenkins-0321183257-2be77f37
The Pub/Sub subscription has been set up for this example: projects/apache-beam-testing/subscriptions/testpipeline-jenkins-0321183257-2be77f37
******************Set Up Big Query Table*******************
The BigQuery table has been set up for this example: apache-beam-testing:traffic_routes_1616351576895.traffic_routes_table
*************************Tear Down*************************
The Pub/Sub topic has been deleted: projects/apache-beam-testing/topics/testpipeline-jenkins-0321183257-2be77f37
The Pub/Sub subscription has been deleted: projects/apache-beam-testing/subscriptions/testpipeline-jenkins-0321183257-2be77f37
The BigQuery table might contain the example's output, and it is not deleted automatically: apache-beam-testing:traffic_routes_1616351576895.traffic_routes_table
Please go to the Developers Console to delete it manually. Otherwise, you may be charged for its usage.
***********************************************************
***********************************************************
9 tests completed, 1 failed
> Task :runners:google-cloud-dataflow-java:examplesJavaRunnerV2IntegrationTest FAILED
> Task :runners:google-cloud-dataflow-java:cleanUpDockerImages
Untagged: us.gcr.io/apache-beam-testing/java-postcommit-it/java:20210321180114
Untagged: us.gcr.io/apache-beam-testing/java-postcommit-it/java@sha256:57a688250298d24c97ec70181ced5f50725f58f426aa892bb021a29acb460172
Digests:
- us.gcr.io/apache-beam-testing/java-postcommit-it/java@sha256:57a688250298d24c97ec70181ced5f50725f58f426aa892bb021a29acb460172
Associated tags:
- 20210321180114
Tags:
- us.gcr.io/apache-beam-testing/java-postcommit-it/java:20210321180114
Deleted [us.gcr.io/apache-beam-testing/java-postcommit-it/java:20210321180114].
Deleted [us.gcr.io/apache-beam-testing/java-postcommit-it/java@sha256:57a688250298d24c97ec70181ced5f50725f58f426aa892bb021a29acb460172].
FAILURE: Build failed with an exception.
* What went wrong:
Execution failed for task ':runners:google-cloud-dataflow-java:examplesJavaRunnerV2IntegrationTest'.
> There were failing tests. See the report at: file://<https://ci-beam.apache.org/job/beam_PostCommit_Java_Examples_Dataflow_V2_java11/ws/src/runners/google-cloud-dataflow-java/build/reports/tests/examplesJavaRunnerV2IntegrationTest/index.html>
* Try:
Run with --stacktrace option to get the stack trace. Run with --info or --debug option to get more log output. Run with --scan to get full insights.
* Get more help at https://help.gradle.org
Deprecated Gradle features were used in this build, making it incompatible with Gradle 7.0.
Use '--warning-mode all' to show the individual deprecation warnings.
See https://docs.gradle.org/6.8/userguide/command_line_interface.html#sec:command_line_warnings
BUILD FAILED in 37m 13s
87 actionable tasks: 55 executed, 30 from cache, 2 up-to-date
Gradle was unable to watch the file system for changes. The inotify watches limit is too low.
Publishing build scan...
https://gradle.com/s/36jtkchbn2i2s
Build step 'Invoke Gradle script' changed build result to FAILURE
Build step 'Invoke Gradle script' marked build as failure
---------------------------------------------------------------------
To unsubscribe, e-mail: builds-unsubscribe@beam.apache.org
For additional commands, e-mail: builds-help@beam.apache.org