You are viewing a plain text version of this content. The canonical link for it is here.
Posted to builds@beam.apache.org by Apache Jenkins Server <je...@builds.apache.org> on 2022/12/26 19:20:07 UTC
Build failed in Jenkins: beam_PostCommit_Java_DataflowV2 #2485
See <https://ci-beam.apache.org/job/beam_PostCommit_Java_DataflowV2/2485/display/redirect>
Changes:
------------------------------------------
[...truncated 52.24 KB...]
> Task :examples:java:testClasses
> Task :sdks:java:extensions:protobuf:testJar
> Task :examples:java:testJar
> Task :sdks:java:io:google-cloud-platform:compileTestJava FROM-CACHE
> Task :sdks:java:io:google-cloud-platform:testClasses
> Task :sdks:java:container:pullLicenses
Collecting pip
Using cached pip-22.3.1-py3-none-any.whl (2.1 MB)
> Task :sdks:java:io:google-cloud-platform:testJar
> Task :sdks:java:container:pullLicenses
Collecting setuptools
Using cached setuptools-65.6.3-py3-none-any.whl (1.2 MB)
Collecting wheel
Using cached wheel-0.38.4-py3-none-any.whl (36 kB)
Installing collected packages: pip, setuptools, wheel
Attempting uninstall: pip
Found existing installation: pip 20.0.2
Uninstalling pip-20.0.2:
Successfully uninstalled pip-20.0.2
Attempting uninstall: setuptools
Found existing installation: setuptools 44.0.0
Uninstalling setuptools-44.0.0:
Successfully uninstalled setuptools-44.0.0
Successfully installed pip-22.3.1 setuptools-65.6.3 wheel-0.38.4
Collecting beautifulsoup4<5.0,>=4.9.0
Using cached beautifulsoup4-4.11.1-py3-none-any.whl (128 kB)
Collecting pyyaml<6.0.0,>=3.12
Using cached PyYAML-5.4.1-cp38-cp38-manylinux1_x86_64.whl (662 kB)
Collecting tenacity<6.0,>=5.0.2
Using cached tenacity-5.1.5-py2.py3-none-any.whl (34 kB)
Collecting soupsieve>1.2
Using cached soupsieve-2.3.2.post1-py3-none-any.whl (37 kB)
Collecting six>=1.9.0
Using cached six-1.16.0-py2.py3-none-any.whl (11 kB)
Installing collected packages: soupsieve, six, pyyaml, tenacity, beautifulsoup4
Successfully installed beautifulsoup4-4.11.1 pyyaml-5.4.1 six-1.16.0 soupsieve-2.3.2.post1 tenacity-5.1.5
Executing python <https://ci-beam.apache.org/job/beam_PostCommit_Java_DataflowV2/ws/src/sdks/java/container/license_scripts/pull_licenses_java.py> --license_index=<https://ci-beam.apache.org/job/beam_PostCommit_Java_DataflowV2/ws/src/sdks/java/container/build/reports/dependency-license/index.json> --output_dir=<https://ci-beam.apache.org/job/beam_PostCommit_Java_DataflowV2/ws/src/sdks/java/container/build/target/java_third_party_licenses> --dep_url_yaml=<https://ci-beam.apache.org/job/beam_PostCommit_Java_DataflowV2/ws/src/sdks/java/container/license_scripts/dep_urls_java.yaml> --manual_license_path=<https://ci-beam.apache.org/job/beam_PostCommit_Java_DataflowV2/ws/src/sdks/java/container/license_scripts/manual_licenses>
INFO:root:Pulling license for 235 dependencies using 16 threads.
INFO:root:Replaced local file URL with file://<https://ci-beam.apache.org/job/beam_PostCommit_Java_DataflowV2/ws/src/sdks/java/container/license_scripts/manual_licenses/xz/COPYING> for xz-1.5
INFO:root:pull_licenses_java.py succeed. It took 5.115136 seconds with 16 threads.
Copying licenses from <https://ci-beam.apache.org/job/beam_PostCommit_Java_DataflowV2/ws/src/sdks/java/container/build/target/java_third_party_licenses> to <https://ci-beam.apache.org/job/beam_PostCommit_Java_DataflowV2/ws/src/sdks/java/container/build/target/third_party_licenses.>
Finished license_scripts.sh
> Task :sdks:java:container:goPrepare UP-TO-DATE
> Task :sdks:java:container:java8:copyJavaThirdPartyLicenses
> Task :sdks:java:container:goBuild
/home/jenkins/go/bin/go1.19.3 build -o ./build/target/linux_amd64/boot boot.go boot_test.go
> Task :sdks:java:container:java8:copySdkHarnessLauncher
Execution optimizations have been disabled for task ':sdks:java:container:java8:copySdkHarnessLauncher' to ensure correctness due to the following reasons:
- Gradle detected a problem with the following location: '<https://ci-beam.apache.org/job/beam_PostCommit_Java_DataflowV2/ws/src/sdks/java/container/build/target'.> Reason: Task ':sdks:java:container:java8:copySdkHarnessLauncher' uses this output of task ':sdks:java:container:downloadCloudProfilerAgent' without declaring an explicit or implicit dependency. This can lead to incorrect results being produced, depending on what order the tasks are executed. Please refer to https://docs.gradle.org/7.5.1/userguide/validation_problems.html#implicit_dependency for more details about this problem.
- Gradle detected a problem with the following location: '<https://ci-beam.apache.org/job/beam_PostCommit_Java_DataflowV2/ws/src/sdks/java/container/build/target'.> Reason: Task ':sdks:java:container:java8:copySdkHarnessLauncher' uses this output of task ':sdks:java:container:pullLicenses' without declaring an explicit or implicit dependency. This can lead to incorrect results being produced, depending on what order the tasks are executed. Please refer to https://docs.gradle.org/7.5.1/userguide/validation_problems.html#implicit_dependency for more details about this problem.
> Task :release:go-licenses:java:dockerRun
go: downloading google.golang.org/grpc v1.50.1
go: downloading github.com/golang/protobuf v1.5.2
go: downloading google.golang.org/protobuf v1.28.1
go: downloading golang.org/x/sys v0.0.0-20220728004956-3c1f35247d10
go: downloading golang.org/x/net v0.0.0-20221012135044-0b7e1fb9d458
go: downloading google.golang.org/genproto v0.0.0-20221010155953-15ba04fc1c0e
go: added github.com/apache/beam/sdks/v2 v2.43.0
go: added github.com/golang/protobuf v1.5.2
go: added golang.org/x/net v0.0.0-20221012135044-0b7e1fb9d458
go: added golang.org/x/sys v0.0.0-20220728004956-3c1f35247d10
go: added golang.org/x/text v0.4.0
go: added google.golang.org/genproto v0.0.0-20221010155953-15ba04fc1c0e
go: added google.golang.org/grpc v1.50.1
go: added google.golang.org/protobuf v1.28.1
+ go-licenses save github.com/apache/beam/sdks/v2/java/container --save_path=/output/licenses
W1226 15:58:55.027541 31 library.go:101] "golang.org/x/sys/unix" contains non-Go code that can't be inspected for further dependencies:
/go/pkg/mod/golang.org/x/sys@v0.0.0-20220728004956-3c1f35247d10/unix/asm_linux_amd64.s
+ go-licenses csv github.com/apache/beam/sdks/v2/java/container
+ tee /output/licenses/list.csv
W1226 15:58:59.582883 75 library.go:101] "golang.org/x/sys/unix" contains non-Go code that can't be inspected for further dependencies:
/go/pkg/mod/golang.org/x/sys@v0.0.0-20220728004956-3c1f35247d10/unix/asm_linux_amd64.s
github.com/apache/beam/sdks/v2/go/pkg/beam,https://github.com/apache/beam/blob/sdks/v2.43.0/sdks/go/README.md,Apache-2.0
github.com/apache/beam/sdks/v2/java/container,https://github.com/apache/beam/blob/sdks/v2.43.0/sdks/LICENSE,Apache-2.0
github.com/golang/protobuf,https://github.com/golang/protobuf/blob/v1.5.2/LICENSE,BSD-3-Clause
golang.org/x/net,https://cs.opensource.google/go/x/net/+/0b7e1fb9:LICENSE,BSD-3-Clause
golang.org/x/sys,https://cs.opensource.google/go/x/sys/+/3c1f3524:LICENSE,BSD-3-Clause
golang.org/x/text,https://cs.opensource.google/go/x/text/+/v0.4.0:LICENSE,BSD-3-Clause
google.golang.org/genproto/googleapis/rpc/status,https://github.com/googleapis/go-genproto/blob/15ba04fc1c0e/LICENSE,Apache-2.0
google.golang.org/grpc,https://github.com/grpc/grpc-go/blob/v1.50.1/LICENSE,Apache-2.0
google.golang.org/protobuf,https://github.com/protocolbuffers/protobuf-go/blob/v1.28.1/LICENSE,BSD-3-Clause
+ chmod -R a+w /output/licenses
> Task :release:go-licenses:java:createLicenses
> Task :sdks:java:container:java8:copyGolangLicenses
> Task :sdks:java:container:java8:dockerPrepare
> Task :sdks:java:container:java8:docker
> Task :runners:google-cloud-dataflow-java:buildAndPushDockerJavaContainer
WARNING: `gcloud docker` will not be supported for Docker client versions above 18.03.
As an alternative, use `gcloud auth configure-docker` to configure `docker` to
use `gcloud` as a credential helper, then use `docker` as you would for non-GCR
registries, e.g. `docker pull gcr.io/project-id/my-image`. Add
`--verbosity=error` to silence this warning: `gcloud docker
--verbosity=error -- pull gcr.io/project-id/my-image`.
See: https://cloud.google.com/container-registry/docs/support/deprecation-notices#gcloud-docker
The push refers to repository [us.gcr.io/apache-beam-testing/java-postcommit-it/java]
e835abe094bf: Preparing
353cf193511e: Preparing
962f2815f30c: Preparing
5928765f300e: Preparing
47468b75fea8: Preparing
8caff27d29b0: Preparing
4da92fd59b11: Preparing
b079c734cf5e: Preparing
85a7476e070e: Preparing
9e63532662dc: Preparing
ce417a203b7f: Preparing
9732c978344a: Preparing
5da7b1ec447a: Preparing
22052e33f7f0: Preparing
9610d5fd49c1: Preparing
6b5aaff44254: Preparing
53a0b163e995: Preparing
b626401ef603: Preparing
9b55156abf26: Preparing
293d5db30c9f: Preparing
03127cdb479b: Preparing
8caff27d29b0: Waiting
9c742cd6c7a5: Preparing
4da92fd59b11: Waiting
b079c734cf5e: Waiting
9e63532662dc: Waiting
85a7476e070e: Waiting
b626401ef603: Waiting
53a0b163e995: Waiting
03127cdb479b: Waiting
9b55156abf26: Waiting
22052e33f7f0: Waiting
9c742cd6c7a5: Waiting
293d5db30c9f: Waiting
ce417a203b7f: Waiting
9732c978344a: Waiting
9610d5fd49c1: Waiting
6b5aaff44254: Waiting
5da7b1ec447a: Waiting
5928765f300e: Pushed
353cf193511e: Pushed
962f2815f30c: Pushed
47468b75fea8: Pushed
4da92fd59b11: Pushed
e835abe094bf: Pushed
b079c734cf5e: Pushed
8caff27d29b0: Pushed
85a7476e070e: Pushed
9e63532662dc: Pushed
9732c978344a: Pushed
6b5aaff44254: Layer already exists
53a0b163e995: Layer already exists
b626401ef603: Layer already exists
9b55156abf26: Layer already exists
293d5db30c9f: Layer already exists
03127cdb479b: Layer already exists
ce417a203b7f: Pushed
9c742cd6c7a5: Layer already exists
5da7b1ec447a: Pushed
22052e33f7f0: Pushed
9610d5fd49c1: Pushed
20221226155742: digest: sha256:32c03e5db9caa0ed2821c64779426c5cc8fa688e2935bace6bde6b76281198c4 size: 4934
> Task :runners:google-cloud-dataflow-java:coreSDKJavaRunnerV2IntegrationTest NO-SOURCE
> Task :runners:google-cloud-dataflow-java:examplesJavaRunnerV2IntegrationTest
***********************************************************
***********************************************************
**********************Set Up Pubsub************************
The Pub/Sub topic has been set up for this example: projects/apache-beam-testing/topics/testpipeline-jenkins-1226155948-a5bf6958
The Pub/Sub subscription has been set up for this example: projects/apache-beam-testing/subscriptions/testpipeline-jenkins-1226155948-a5bf6958
*************************Tear Down*************************
The Pub/Sub topic has been deleted: projects/apache-beam-testing/topics/testpipeline-jenkins-1226155948-a5bf6958
The Pub/Sub subscription has been deleted: projects/apache-beam-testing/subscriptions/testpipeline-jenkins-1226155948-a5bf6958
***********************************************************
***********************************************************
***********************************************************
***********************************************************
**********************Set Up Pubsub************************
The Pub/Sub topic has been set up for this example: projects/apache-beam-testing/topics/testpipeline-jenkins-1226155948-52b975c6
The Pub/Sub subscription has been set up for this example: projects/apache-beam-testing/subscriptions/testpipeline-jenkins-1226155948-52b975c6
*************************Tear Down*************************
The Pub/Sub topic has been deleted: projects/apache-beam-testing/topics/testpipeline-jenkins-1226155948-52b975c6
The Pub/Sub subscription has been deleted: projects/apache-beam-testing/subscriptions/testpipeline-jenkins-1226155948-52b975c6
***********************************************************
***********************************************************
> Task :runners:google-cloud-dataflow-java:googleCloudPlatformRunnerV2IntegrationTest
org.apache.beam.sdk.io.gcp.pubsub.PubsubSchemaIT > classMethod FAILED
java.nio.file.NoSuchFileException at PubsubSchemaIT.java:85
org.apache.beam.sdk.io.gcp.pubsub.PubsubSchemaIT > classMethod FAILED
io.grpc.StatusRuntimeException at PubsubSchemaIT.java:96
81 tests completed, 2 failed, 2 skipped
> Task :runners:google-cloud-dataflow-java:googleCloudPlatformRunnerV2IntegrationTest FAILED
> Task :runners:google-cloud-dataflow-java:cleanUpDockerJavaImages
Untagged: us.gcr.io/apache-beam-testing/java-postcommit-it/java:20221226155742
Untagged: us.gcr.io/apache-beam-testing/java-postcommit-it/java@sha256:32c03e5db9caa0ed2821c64779426c5cc8fa688e2935bace6bde6b76281198c4
WARNING: Successfully resolved tag to sha256, but it is recommended to use sha256 directly.
Tag: [us.gcr.io/apache-beam-testing/java-postcommit-it/java:20221226155742]
- referencing digest: [us.gcr.io/apache-beam-testing/java-postcommit-it/java@sha256:32c03e5db9caa0ed2821c64779426c5cc8fa688e2935bace6bde6b76281198c4]
Deleted [[us.gcr.io/apache-beam-testing/java-postcommit-it/java:20221226155742] (referencing [us.gcr.io/apache-beam-testing/java-postcommit-it/java@sha256:32c03e5db9caa0ed2821c64779426c5cc8fa688e2935bace6bde6b76281198c4])].
Removing untagged image us.gcr.io/apache-beam-testing/java-postcommit-it/java@sha256:32c03e5db9caa0ed2821c64779426c5cc8fa688e2935bace6bde6b76281198c4
Digests:
- us.gcr.io/apache-beam-testing/java-postcommit-it/java@sha256:32c03e5db9caa0ed2821c64779426c5cc8fa688e2935bace6bde6b76281198c4
Deleted [us.gcr.io/apache-beam-testing/java-postcommit-it/java@sha256:32c03e5db9caa0ed2821c64779426c5cc8fa688e2935bace6bde6b76281198c4].
FAILURE: Build failed with an exception.
* What went wrong:
Execution failed for task ':runners:google-cloud-dataflow-java:googleCloudPlatformRunnerV2IntegrationTest'.
> There were failing tests. See the report at: file://<https://ci-beam.apache.org/job/beam_PostCommit_Java_DataflowV2/ws/src/runners/google-cloud-dataflow-java/build/reports/tests/googleCloudPlatformRunnerV2IntegrationTest/index.html>
* Try:
> Run with --stacktrace option to get the stack trace.
> Run with --info or --debug option to get more log output.
* Get more help at https://help.gradle.org
Deprecated Gradle features were used in this build, making it incompatible with Gradle 8.0.
You can use '--warning-mode all' to show the individual deprecation warnings and determine if they come from your own scripts or plugins.
See https://docs.gradle.org/7.5.1/userguide/command_line_interface.html#sec:command_line_warnings
Execution optimizations have been disabled for 1 invalid unit(s) of work during this build to ensure correctness.
Please consult deprecation warnings for more details.
BUILD FAILED in 3h 22m 36s
145 actionable tasks: 93 executed, 48 from cache, 4 up-to-date
Publishing build scan...
https://gradle.com/s/yomj4ye7p5qgo
Build step 'Invoke Gradle script' changed build result to FAILURE
Build step 'Invoke Gradle script' marked build as failure
---------------------------------------------------------------------
To unsubscribe, e-mail: builds-unsubscribe@beam.apache.org
For additional commands, e-mail: builds-help@beam.apache.org
Jenkins build is back to normal : beam_PostCommit_Java_DataflowV2 #2497
Posted by Apache Jenkins Server <je...@builds.apache.org>.
See <https://ci-beam.apache.org/job/beam_PostCommit_Java_DataflowV2/2497/display/redirect?page=changes>
---------------------------------------------------------------------
To unsubscribe, e-mail: builds-unsubscribe@beam.apache.org
For additional commands, e-mail: builds-help@beam.apache.org
Build failed in Jenkins: beam_PostCommit_Java_DataflowV2 #2496
Posted by Apache Jenkins Server <je...@builds.apache.org>.
See <https://ci-beam.apache.org/job/beam_PostCommit_Java_DataflowV2/2496/display/redirect>
Changes:
------------------------------------------
[...truncated 56.26 KB...]
Using cached six-1.16.0-py2.py3-none-any.whl (11 kB)
Installing collected packages: soupsieve, six, pyyaml, tenacity, beautifulsoup4
Successfully installed beautifulsoup4-4.11.1 pyyaml-5.4.1 six-1.16.0 soupsieve-2.3.2.post1 tenacity-5.1.5
Executing python <https://ci-beam.apache.org/job/beam_PostCommit_Java_DataflowV2/ws/src/sdks/java/container/license_scripts/pull_licenses_java.py> --license_index=<https://ci-beam.apache.org/job/beam_PostCommit_Java_DataflowV2/ws/src/sdks/java/container/build/reports/dependency-license/index.json> --output_dir=<https://ci-beam.apache.org/job/beam_PostCommit_Java_DataflowV2/ws/src/sdks/java/container/build/target/java_third_party_licenses> --dep_url_yaml=<https://ci-beam.apache.org/job/beam_PostCommit_Java_DataflowV2/ws/src/sdks/java/container/license_scripts/dep_urls_java.yaml> --manual_license_path=<https://ci-beam.apache.org/job/beam_PostCommit_Java_DataflowV2/ws/src/sdks/java/container/license_scripts/manual_licenses>
INFO:root:Pulling license for 235 dependencies using 16 threads.
INFO:root:Replaced local file URL with file://<https://ci-beam.apache.org/job/beam_PostCommit_Java_DataflowV2/ws/src/sdks/java/container/license_scripts/manual_licenses/xz/COPYING> for xz-1.5
INFO:root:pull_licenses_java.py succeed. It took 2.896494 seconds with 16 threads.
Copying licenses from <https://ci-beam.apache.org/job/beam_PostCommit_Java_DataflowV2/ws/src/sdks/java/container/build/target/java_third_party_licenses> to <https://ci-beam.apache.org/job/beam_PostCommit_Java_DataflowV2/ws/src/sdks/java/container/build/target/third_party_licenses.>
Finished license_scripts.sh
> Task :sdks:java:container:goPrepare UP-TO-DATE
> Task :sdks:java:container:java8:copyJavaThirdPartyLicenses
> Task :release:go-licenses:java:dockerRun
go: downloading github.com/golang/protobuf v1.5.2
go: downloading google.golang.org/grpc v1.50.1
go: downloading google.golang.org/protobuf v1.28.1
go: downloading golang.org/x/sys v0.0.0-20220728004956-3c1f35247d10
go: downloading google.golang.org/genproto v0.0.0-20221010155953-15ba04fc1c0e
go: downloading golang.org/x/net v0.0.0-20221012135044-0b7e1fb9d458
> Task :sdks:java:container:goBuild
/home/jenkins/go/bin/go1.19.3 build -o ./build/target/linux_amd64/boot boot.go boot_test.go
> Task :sdks:java:container:java8:copySdkHarnessLauncher
Execution optimizations have been disabled for task ':sdks:java:container:java8:copySdkHarnessLauncher' to ensure correctness due to the following reasons:
- Gradle detected a problem with the following location: '<https://ci-beam.apache.org/job/beam_PostCommit_Java_DataflowV2/ws/src/sdks/java/container/build/target'.> Reason: Task ':sdks:java:container:java8:copySdkHarnessLauncher' uses this output of task ':sdks:java:container:downloadCloudProfilerAgent' without declaring an explicit or implicit dependency. This can lead to incorrect results being produced, depending on what order the tasks are executed. Please refer to https://docs.gradle.org/7.5.1/userguide/validation_problems.html#implicit_dependency for more details about this problem.
- Gradle detected a problem with the following location: '<https://ci-beam.apache.org/job/beam_PostCommit_Java_DataflowV2/ws/src/sdks/java/container/build/target'.> Reason: Task ':sdks:java:container:java8:copySdkHarnessLauncher' uses this output of task ':sdks:java:container:pullLicenses' without declaring an explicit or implicit dependency. This can lead to incorrect results being produced, depending on what order the tasks are executed. Please refer to https://docs.gradle.org/7.5.1/userguide/validation_problems.html#implicit_dependency for more details about this problem.
> Task :release:go-licenses:java:dockerRun
go: added github.com/apache/beam/sdks/v2 v2.43.0
go: added github.com/golang/protobuf v1.5.2
go: added golang.org/x/net v0.0.0-20221012135044-0b7e1fb9d458
go: added golang.org/x/sys v0.0.0-20220728004956-3c1f35247d10
go: added golang.org/x/text v0.4.0
go: added google.golang.org/genproto v0.0.0-20221010155953-15ba04fc1c0e
go: added google.golang.org/grpc v1.50.1
go: added google.golang.org/protobuf v1.28.1
+ go-licenses save github.com/apache/beam/sdks/v2/java/container --save_path=/output/licenses
W1229 09:58:10.547428 35 library.go:101] "golang.org/x/sys/unix" contains non-Go code that can't be inspected for further dependencies:
/go/pkg/mod/golang.org/x/sys@v0.0.0-20220728004956-3c1f35247d10/unix/asm_linux_amd64.s
+ go-licenses csv github.com/apache/beam/sdks/v2/java/container
+ tee /output/licenses/list.csv
W1229 09:58:14.823791 80 library.go:101] "golang.org/x/sys/unix" contains non-Go code that can't be inspected for further dependencies:
/go/pkg/mod/golang.org/x/sys@v0.0.0-20220728004956-3c1f35247d10/unix/asm_linux_amd64.s
github.com/apache/beam/sdks/v2/go/pkg/beam,https://github.com/apache/beam/blob/sdks/v2.43.0/sdks/go/README.md,Apache-2.0
github.com/apache/beam/sdks/v2/java/container,https://github.com/apache/beam/blob/sdks/v2.43.0/sdks/LICENSE,Apache-2.0
github.com/golang/protobuf,https://github.com/golang/protobuf/blob/v1.5.2/LICENSE,BSD-3-Clause
golang.org/x/net,https://cs.opensource.google/go/x/net/+/0b7e1fb9:LICENSE,BSD-3-Clause
golang.org/x/sys,https://cs.opensource.google/go/x/sys/+/3c1f3524:LICENSE,BSD-3-Clause
golang.org/x/text,https://cs.opensource.google/go/x/text/+/v0.4.0:LICENSE,BSD-3-Clause
google.golang.org/genproto/googleapis/rpc/status,https://github.com/googleapis/go-genproto/blob/15ba04fc1c0e/LICENSE,Apache-2.0
google.golang.org/grpc,https://github.com/grpc/grpc-go/blob/v1.50.1/LICENSE,Apache-2.0
google.golang.org/protobuf,https://github.com/protocolbuffers/protobuf-go/blob/v1.28.1/LICENSE,BSD-3-Clause
+ chmod -R a+w /output/licenses
> Task :release:go-licenses:java:createLicenses
> Task :sdks:java:container:java8:copyGolangLicenses
> Task :sdks:java:container:java8:dockerPrepare
> Task :sdks:java:container:java8:docker
> Task :runners:google-cloud-dataflow-java:buildAndPushDockerJavaContainer
WARNING: `gcloud docker` will not be supported for Docker client versions above 18.03.
As an alternative, use `gcloud auth configure-docker` to configure `docker` to
use `gcloud` as a credential helper, then use `docker` as you would for non-GCR
registries, e.g. `docker pull gcr.io/project-id/my-image`. Add
`--verbosity=error` to silence this warning: `gcloud docker
--verbosity=error -- pull gcr.io/project-id/my-image`.
See: https://cloud.google.com/container-registry/docs/support/deprecation-notices#gcloud-docker
The push refers to repository [us.gcr.io/apache-beam-testing/java-postcommit-it/java]
f23bc674ebf2: Preparing
5b89287dda72: Preparing
28f9001577e3: Preparing
87511561fd2c: Preparing
081d00a31f25: Preparing
35a0309908c8: Preparing
032cb2e44430: Preparing
ae4930c579ad: Preparing
bd1c71590294: Preparing
813715dac67a: Preparing
e84fea4a6658: Preparing
502b215aaf57: Preparing
fdc972dbfda1: Preparing
450deffdde2f: Preparing
66cddf5cca31: Preparing
6b5aaff44254: Preparing
53a0b163e995: Preparing
b626401ef603: Preparing
9b55156abf26: Preparing
293d5db30c9f: Preparing
03127cdb479b: Preparing
35a0309908c8: Waiting
bd1c71590294: Waiting
ae4930c579ad: Waiting
9c742cd6c7a5: Preparing
032cb2e44430: Waiting
813715dac67a: Waiting
502b215aaf57: Waiting
450deffdde2f: Waiting
53a0b163e995: Waiting
e84fea4a6658: Waiting
fdc972dbfda1: Waiting
b626401ef603: Waiting
6b5aaff44254: Waiting
66cddf5cca31: Waiting
03127cdb479b: Waiting
9c742cd6c7a5: Waiting
9b55156abf26: Waiting
293d5db30c9f: Waiting
87511561fd2c: Pushed
5b89287dda72: Pushed
28f9001577e3: Pushed
081d00a31f25: Pushed
f23bc674ebf2: Pushed
ae4930c579ad: Pushed
032cb2e44430: Pushed
813715dac67a: Pushed
bd1c71590294: Pushed
502b215aaf57: Pushed
35a0309908c8: Pushed
6b5aaff44254: Layer already exists
53a0b163e995: Layer already exists
e84fea4a6658: Pushed
b626401ef603: Layer already exists
9b55156abf26: Layer already exists
293d5db30c9f: Layer already exists
03127cdb479b: Layer already exists
9c742cd6c7a5: Layer already exists
fdc972dbfda1: Pushed
450deffdde2f: Pushed
66cddf5cca31: Pushed
20221229095742: digest: sha256:ec01381ce5e90e0f78cf9cdb74fe27128f584317f07361f3fe07bbc2b13d58ab size: 4934
> Task :runners:google-cloud-dataflow-java:coreSDKJavaRunnerV2IntegrationTest NO-SOURCE
> Task :runners:google-cloud-dataflow-java:examplesJavaRunnerV2IntegrationTest
***********************************************************
***********************************************************
**********************Set Up Pubsub************************
The Pub/Sub topic has been set up for this example: projects/apache-beam-testing/topics/testpipeline-jenkins-1229095858-8b219d46
The Pub/Sub subscription has been set up for this example: projects/apache-beam-testing/subscriptions/testpipeline-jenkins-1229095858-8b219d46
*************************Tear Down*************************
The Pub/Sub topic has been deleted: projects/apache-beam-testing/topics/testpipeline-jenkins-1229095858-8b219d46
The Pub/Sub subscription has been deleted: projects/apache-beam-testing/subscriptions/testpipeline-jenkins-1229095858-8b219d46
***********************************************************
***********************************************************
***********************************************************
***********************************************************
**********************Set Up Pubsub************************
The Pub/Sub topic has been set up for this example: projects/apache-beam-testing/topics/testpipeline-jenkins-1229095857-2889df30
The Pub/Sub subscription has been set up for this example: projects/apache-beam-testing/subscriptions/testpipeline-jenkins-1229095857-2889df30
*************************Tear Down*************************
The Pub/Sub topic has been deleted: projects/apache-beam-testing/topics/testpipeline-jenkins-1229095857-2889df30
The Pub/Sub subscription has been deleted: projects/apache-beam-testing/subscriptions/testpipeline-jenkins-1229095857-2889df30
***********************************************************
***********************************************************
> Task :runners:google-cloud-dataflow-java:googleCloudPlatformRunnerV2IntegrationTest
org.apache.beam.sdk.io.gcp.pubsub.PubsubSchemaIT > classMethod FAILED
java.nio.file.NoSuchFileException at PubsubSchemaIT.java:85
org.apache.beam.sdk.io.gcp.pubsub.PubsubSchemaIT > classMethod FAILED
io.grpc.StatusRuntimeException at PubsubSchemaIT.java:96
81 tests completed, 2 failed, 2 skipped
> Task :runners:google-cloud-dataflow-java:googleCloudPlatformRunnerV2IntegrationTest FAILED
> Task :runners:google-cloud-dataflow-java:cleanUpDockerJavaImages
Untagged: us.gcr.io/apache-beam-testing/java-postcommit-it/java:20221229095742
Untagged: us.gcr.io/apache-beam-testing/java-postcommit-it/java@sha256:ec01381ce5e90e0f78cf9cdb74fe27128f584317f07361f3fe07bbc2b13d58ab
Deleted: sha256:0e0ac2158cb11f7a25fc5ee09ac1dbe9523dca685ba0fb750e8e20de7443e14e
Deleted: sha256:974630a31f66aed9f825418473db33a465ebbfd91e49aab2beaf2d86c9c13b7d
Deleted: sha256:33cfbd2e3178fe210fbb7cf53d9eb2e47372520a4cc6ce5be43bfaadc028ae91
Deleted: sha256:f5699c29e5171e211b3e81141988ebfec9a85673501d48457ed3699ef8ca7e04
Deleted: sha256:94eac31318d12d257d374c330e49ba9b386c79ddb4aa85455bf23ee2340fce95
Deleted: sha256:50bf5ac770684c34651b123d74b23d51209c9bdb900898af8bebcd4fbe1f9ed3
Deleted: sha256:e550ba5e056cb267bdeddbebcef26a765efbe85ace3ecc26ce0f8eb498c2cb82
Deleted: sha256:c5bcf91917ae4be5515f3ec94e8844620f53f4afb12a243985367bd9406f5ea9
Deleted: sha256:21c9bc4baa29d4c92ef7846501aca1f4dab0fbb64fecc81e1d4d40a97c2a47eb
Deleted: sha256:5a2166f63abcb450007df5cdee0066a15c4887a691548739bafe16050d0b9d38
Deleted: sha256:cd882278e7478c78c740fe2e9c47de3be3b4aa7964d5b0507ef4a6996d583fb0
Deleted: sha256:18ce20479903bef40b946c5116f8827555c97de698bedc29dae52eafeb524ade
Deleted: sha256:cd22189facc851a2d2511e7acd80999bc0484428fb233cbe5c8521237a86813a
Deleted: sha256:ebd8a82df19e0fa5eb106b862f8e385fcbba6d1012e4edee2cc36775df6c2911
Deleted: sha256:fd09505adb46d9c3b0a35cf9643cc781b2f53db65bbf75940c904e592f445a16
Deleted: sha256:02fc221bb963471412da90d99c96d38c2e2715e2410d48a0449ba4aba7c849ec
Deleted: sha256:8cfe45d95e4f5aaa32f136bdb491bb87a0b95726e4ebd59f63d18f916fcf3817
Deleted: sha256:eced5997dcd0f4c266640a1d376c5c18cba25c047faaf4abaaebd6ab0ea0a1f6
Deleted: sha256:20a2b6f113516240628688220427fc5dc84b151aebcc0f0d89ec07ebb15390ef
Deleted: sha256:3fc0497ad21ff25f03841dfa5626743c4adf79c886915efcc3477d79fbf92eee
Deleted: sha256:f5c2c543b845287c87f7097da1ed79b4f22e74c734a52fd586fd7a38db456087
Deleted: sha256:c49b0f3fc08cc98918011a5e7e3c316f57469256c89323fb561daca9c20a3e33
Deleted: sha256:d6c50a6b15d75321819ab03d5211a370e41114d3f180bd9828325156dda1efa9
Deleted: sha256:e5376a24fe85f20814e8faa2f2aa16ca568b51ec0b9b67cdcc53e1b4e8a1cfc0
Deleted: sha256:bd12f7a11c7fe8f0cdce14b47a4e92fde6fa83fe9b53b6066b62ee9fac56e611
Deleted: sha256:bd8ca63d030b20039c6138e9675e3a6e4aaf7bc521fa01f90266a043dcb93749
Deleted: sha256:b022717fc7ebd4500c68dd8aa5b278a36e051303f01aa6385d48bdc4040f5093
Deleted: sha256:daf16a797597152a3c99ebee611eb4497be057d171ed7e25cfdd98c91dc3ecc9
Deleted: sha256:af4b2b5e8c584f197c7dda8dd8fc99db2e407a5baeebfd16ca2b7c94927d16ef
Deleted: sha256:14d16de68c4f4dbcb09fe7cb9dcd455baee150af46e96ae3b0bd337711a2035d
Deleted: sha256:e5852c305052e8b40c10f437249fb81b55d3ea8baeac12c863ec55e93c48bcfc
Deleted: sha256:3131fb87549c72089d7bfda258dab537873e9a2f7fe3f025a9164543ee113f76
Deleted: sha256:ced8e41cb4852e1150854ed5fd3f35f2ad3ecba691eb962308196290a194f0aa
Deleted: sha256:8d893931157e91bff2e181bd92d2ed9e0c5b7fcfaeb8b73074c2281406f289eb
WARNING: Successfully resolved tag to sha256, but it is recommended to use sha256 directly.
Tag: [us.gcr.io/apache-beam-testing/java-postcommit-it/java:20221229095742]
- referencing digest: [us.gcr.io/apache-beam-testing/java-postcommit-it/java@sha256:ec01381ce5e90e0f78cf9cdb74fe27128f584317f07361f3fe07bbc2b13d58ab]
Deleted [[us.gcr.io/apache-beam-testing/java-postcommit-it/java:20221229095742] (referencing [us.gcr.io/apache-beam-testing/java-postcommit-it/java@sha256:ec01381ce5e90e0f78cf9cdb74fe27128f584317f07361f3fe07bbc2b13d58ab])].
Removing untagged image us.gcr.io/apache-beam-testing/java-postcommit-it/java@sha256:ec01381ce5e90e0f78cf9cdb74fe27128f584317f07361f3fe07bbc2b13d58ab
Digests:
- us.gcr.io/apache-beam-testing/java-postcommit-it/java@sha256:ec01381ce5e90e0f78cf9cdb74fe27128f584317f07361f3fe07bbc2b13d58ab
Deleted [us.gcr.io/apache-beam-testing/java-postcommit-it/java@sha256:ec01381ce5e90e0f78cf9cdb74fe27128f584317f07361f3fe07bbc2b13d58ab].
FAILURE: Build failed with an exception.
* What went wrong:
Execution failed for task ':runners:google-cloud-dataflow-java:googleCloudPlatformRunnerV2IntegrationTest'.
> There were failing tests. See the report at: file://<https://ci-beam.apache.org/job/beam_PostCommit_Java_DataflowV2/ws/src/runners/google-cloud-dataflow-java/build/reports/tests/googleCloudPlatformRunnerV2IntegrationTest/index.html>
* Try:
> Run with --stacktrace option to get the stack trace.
> Run with --info or --debug option to get more log output.
* Get more help at https://help.gradle.org
Deprecated Gradle features were used in this build, making it incompatible with Gradle 8.0.
You can use '--warning-mode all' to show the individual deprecation warnings and determine if they come from your own scripts or plugins.
See https://docs.gradle.org/7.5.1/userguide/command_line_interface.html#sec:command_line_warnings
Execution optimizations have been disabled for 1 invalid unit(s) of work during this build to ensure correctness.
Please consult deprecation warnings for more details.
BUILD FAILED in 3h 22m 25s
145 actionable tasks: 93 executed, 48 from cache, 4 up-to-date
Publishing build scan...
https://gradle.com/s/pkwqjldnb3uje
Build step 'Invoke Gradle script' changed build result to FAILURE
Build step 'Invoke Gradle script' marked build as failure
---------------------------------------------------------------------
To unsubscribe, e-mail: builds-unsubscribe@beam.apache.org
For additional commands, e-mail: builds-help@beam.apache.org
Build failed in Jenkins: beam_PostCommit_Java_DataflowV2 #2495
Posted by Apache Jenkins Server <je...@builds.apache.org>.
See <https://ci-beam.apache.org/job/beam_PostCommit_Java_DataflowV2/2495/display/redirect>
Changes:
------------------------------------------
[...truncated 53.18 KB...]
> Task :examples:java:compileTestJava FROM-CACHE
> Task :examples:java:testClasses
> Task :examples:java:testJar
> Task :sdks:java:container:pullLicenses
Collecting pip
> Task :sdks:java:io:google-cloud-platform:compileTestJava FROM-CACHE
> Task :sdks:java:io:google-cloud-platform:testClasses
> Task :sdks:java:io:google-cloud-platform:testJar
> Task :sdks:java:container:pullLicenses
Using cached pip-22.3.1-py3-none-any.whl (2.1 MB)
Collecting setuptools
Using cached setuptools-65.6.3-py3-none-any.whl (1.2 MB)
Collecting wheel
Using cached wheel-0.38.4-py3-none-any.whl (36 kB)
Installing collected packages: pip, setuptools, wheel
Attempting uninstall: pip
Found existing installation: pip 20.0.2
Uninstalling pip-20.0.2:
Successfully uninstalled pip-20.0.2
Attempting uninstall: setuptools
Found existing installation: setuptools 44.0.0
Uninstalling setuptools-44.0.0:
Successfully uninstalled setuptools-44.0.0
Successfully installed pip-22.3.1 setuptools-65.6.3 wheel-0.38.4
Collecting beautifulsoup4<5.0,>=4.9.0
Using cached beautifulsoup4-4.11.1-py3-none-any.whl (128 kB)
Collecting pyyaml<6.0.0,>=3.12
Using cached PyYAML-5.4.1-cp38-cp38-manylinux1_x86_64.whl (662 kB)
Collecting tenacity<6.0,>=5.0.2
Using cached tenacity-5.1.5-py2.py3-none-any.whl (34 kB)
Collecting soupsieve>1.2
Using cached soupsieve-2.3.2.post1-py3-none-any.whl (37 kB)
Collecting six>=1.9.0
Using cached six-1.16.0-py2.py3-none-any.whl (11 kB)
Installing collected packages: soupsieve, six, pyyaml, tenacity, beautifulsoup4
Successfully installed beautifulsoup4-4.11.1 pyyaml-5.4.1 six-1.16.0 soupsieve-2.3.2.post1 tenacity-5.1.5
Executing python <https://ci-beam.apache.org/job/beam_PostCommit_Java_DataflowV2/ws/src/sdks/java/container/license_scripts/pull_licenses_java.py> --license_index=<https://ci-beam.apache.org/job/beam_PostCommit_Java_DataflowV2/ws/src/sdks/java/container/build/reports/dependency-license/index.json> --output_dir=<https://ci-beam.apache.org/job/beam_PostCommit_Java_DataflowV2/ws/src/sdks/java/container/build/target/java_third_party_licenses> --dep_url_yaml=<https://ci-beam.apache.org/job/beam_PostCommit_Java_DataflowV2/ws/src/sdks/java/container/license_scripts/dep_urls_java.yaml> --manual_license_path=<https://ci-beam.apache.org/job/beam_PostCommit_Java_DataflowV2/ws/src/sdks/java/container/license_scripts/manual_licenses>
INFO:root:Pulling license for 235 dependencies using 16 threads.
INFO:root:Replaced local file URL with file://<https://ci-beam.apache.org/job/beam_PostCommit_Java_DataflowV2/ws/src/sdks/java/container/license_scripts/manual_licenses/xz/COPYING> for xz-1.5
INFO:root:pull_licenses_java.py succeed. It took 2.317828 seconds with 16 threads.
Copying licenses from <https://ci-beam.apache.org/job/beam_PostCommit_Java_DataflowV2/ws/src/sdks/java/container/build/target/java_third_party_licenses> to <https://ci-beam.apache.org/job/beam_PostCommit_Java_DataflowV2/ws/src/sdks/java/container/build/target/third_party_licenses.>
Finished license_scripts.sh
> Task :sdks:java:container:goPrepare UP-TO-DATE
> Task :sdks:java:container:java8:copyJavaThirdPartyLicenses
> Task :sdks:java:container:goBuild
/home/jenkins/go/bin/go1.19.3 build -o ./build/target/linux_amd64/boot boot.go boot_test.go
> Task :sdks:java:container:java8:copySdkHarnessLauncher
Execution optimizations have been disabled for task ':sdks:java:container:java8:copySdkHarnessLauncher' to ensure correctness due to the following reasons:
- Gradle detected a problem with the following location: '<https://ci-beam.apache.org/job/beam_PostCommit_Java_DataflowV2/ws/src/sdks/java/container/build/target'.> Reason: Task ':sdks:java:container:java8:copySdkHarnessLauncher' uses this output of task ':sdks:java:container:downloadCloudProfilerAgent' without declaring an explicit or implicit dependency. This can lead to incorrect results being produced, depending on what order the tasks are executed. Please refer to https://docs.gradle.org/7.5.1/userguide/validation_problems.html#implicit_dependency for more details about this problem.
- Gradle detected a problem with the following location: '<https://ci-beam.apache.org/job/beam_PostCommit_Java_DataflowV2/ws/src/sdks/java/container/build/target'.> Reason: Task ':sdks:java:container:java8:copySdkHarnessLauncher' uses this output of task ':sdks:java:container:pullLicenses' without declaring an explicit or implicit dependency. This can lead to incorrect results being produced, depending on what order the tasks are executed. Please refer to https://docs.gradle.org/7.5.1/userguide/validation_problems.html#implicit_dependency for more details about this problem.
> Task :release:go-licenses:java:dockerRun
go: downloading github.com/golang/protobuf v1.5.2
go: downloading google.golang.org/grpc v1.50.1
go: downloading google.golang.org/protobuf v1.28.1
go: downloading golang.org/x/sys v0.0.0-20220728004956-3c1f35247d10
go: downloading google.golang.org/genproto v0.0.0-20221010155953-15ba04fc1c0e
go: downloading golang.org/x/net v0.0.0-20221012135044-0b7e1fb9d458
go: added github.com/apache/beam/sdks/v2 v2.43.0
go: added github.com/golang/protobuf v1.5.2
go: added golang.org/x/net v0.0.0-20221012135044-0b7e1fb9d458
go: added golang.org/x/sys v0.0.0-20220728004956-3c1f35247d10
go: added golang.org/x/text v0.4.0
go: added google.golang.org/genproto v0.0.0-20221010155953-15ba04fc1c0e
go: added google.golang.org/grpc v1.50.1
go: added google.golang.org/protobuf v1.28.1
+ go-licenses save github.com/apache/beam/sdks/v2/java/container --save_path=/output/licenses
W1229 03:58:49.877597 36 library.go:101] "golang.org/x/sys/unix" contains non-Go code that can't be inspected for further dependencies:
/go/pkg/mod/golang.org/x/sys@v0.0.0-20220728004956-3c1f35247d10/unix/asm_linux_amd64.s
+ go-licenses csv github.com/apache/beam/sdks/v2/java/container
+ tee /output/licenses/list.csv
W1229 03:58:53.834221 81 library.go:101] "golang.org/x/sys/unix" contains non-Go code that can't be inspected for further dependencies:
/go/pkg/mod/golang.org/x/sys@v0.0.0-20220728004956-3c1f35247d10/unix/asm_linux_amd64.s
github.com/apache/beam/sdks/v2/go/pkg/beam,https://github.com/apache/beam/blob/sdks/v2.43.0/sdks/go/README.md,Apache-2.0
github.com/apache/beam/sdks/v2/java/container,https://github.com/apache/beam/blob/sdks/v2.43.0/sdks/LICENSE,Apache-2.0
github.com/golang/protobuf,https://github.com/golang/protobuf/blob/v1.5.2/LICENSE,BSD-3-Clause
golang.org/x/net,https://cs.opensource.google/go/x/net/+/0b7e1fb9:LICENSE,BSD-3-Clause
golang.org/x/sys,https://cs.opensource.google/go/x/sys/+/3c1f3524:LICENSE,BSD-3-Clause
golang.org/x/text,https://cs.opensource.google/go/x/text/+/v0.4.0:LICENSE,BSD-3-Clause
google.golang.org/genproto/googleapis/rpc/status,https://github.com/googleapis/go-genproto/blob/15ba04fc1c0e/LICENSE,Apache-2.0
google.golang.org/grpc,https://github.com/grpc/grpc-go/blob/v1.50.1/LICENSE,Apache-2.0
google.golang.org/protobuf,https://github.com/protocolbuffers/protobuf-go/blob/v1.28.1/LICENSE,BSD-3-Clause
+ chmod -R a+w /output/licenses
> Task :release:go-licenses:java:createLicenses
> Task :sdks:java:container:java8:copyGolangLicenses
> Task :sdks:java:container:java8:dockerPrepare
> Task :sdks:java:container:java8:docker
> Task :runners:google-cloud-dataflow-java:buildAndPushDockerJavaContainer
WARNING: `gcloud docker` will not be supported for Docker client versions above 18.03.
As an alternative, use `gcloud auth configure-docker` to configure `docker` to
use `gcloud` as a credential helper, then use `docker` as you would for non-GCR
registries, e.g. `docker pull gcr.io/project-id/my-image`. Add
`--verbosity=error` to silence this warning: `gcloud docker
--verbosity=error -- pull gcr.io/project-id/my-image`.
See: https://cloud.google.com/container-registry/docs/support/deprecation-notices#gcloud-docker
The push refers to repository [us.gcr.io/apache-beam-testing/java-postcommit-it/java]
0818e5261dd4: Preparing
8d279311f3a2: Preparing
1a0beae16e11: Preparing
178dc7de2e31: Preparing
29fe497422e3: Preparing
308d177eaeb9: Preparing
891b2f1646fd: Preparing
9c7fc63f8449: Preparing
3981f7ef086f: Preparing
70d5c03a6fb8: Preparing
af481622d40b: Preparing
99754cd53f75: Preparing
17fb79f71c3d: Preparing
e4277dc53ef0: Preparing
666a80ee173d: Preparing
6b5aaff44254: Preparing
53a0b163e995: Preparing
b626401ef603: Preparing
9b55156abf26: Preparing
293d5db30c9f: Preparing
03127cdb479b: Preparing
9c742cd6c7a5: Preparing
e4277dc53ef0: Waiting
308d177eaeb9: Waiting
03127cdb479b: Waiting
891b2f1646fd: Waiting
9b55156abf26: Waiting
666a80ee173d: Waiting
293d5db30c9f: Waiting
af481622d40b: Waiting
6b5aaff44254: Waiting
9c7fc63f8449: Waiting
9c742cd6c7a5: Waiting
99754cd53f75: Waiting
53a0b163e995: Waiting
3981f7ef086f: Waiting
17fb79f71c3d: Waiting
b626401ef603: Waiting
70d5c03a6fb8: Waiting
1a0beae16e11: Pushed
178dc7de2e31: Pushed
8d279311f3a2: Pushed
29fe497422e3: Pushed
0818e5261dd4: Pushed
891b2f1646fd: Pushed
9c7fc63f8449: Pushed
3981f7ef086f: Pushed
70d5c03a6fb8: Pushed
99754cd53f75: Pushed
308d177eaeb9: Pushed
6b5aaff44254: Layer already exists
53a0b163e995: Layer already exists
b626401ef603: Layer already exists
af481622d40b: Pushed
9b55156abf26: Layer already exists
293d5db30c9f: Layer already exists
03127cdb479b: Layer already exists
9c742cd6c7a5: Layer already exists
666a80ee173d: Pushed
e4277dc53ef0: Pushed
17fb79f71c3d: Pushed
20221229035740: digest: sha256:a5f3007718cc4a4805e4590cf0e64a639bde807fbc9c7ff050c85fc186b38df4 size: 4934
> Task :runners:google-cloud-dataflow-java:coreSDKJavaRunnerV2IntegrationTest NO-SOURCE
> Task :runners:google-cloud-dataflow-java:examplesJavaRunnerV2IntegrationTest
***********************************************************
***********************************************************
**********************Set Up Pubsub************************
The Pub/Sub topic has been set up for this example: projects/apache-beam-testing/topics/testpipeline-jenkins-1229035922-5d7d2fcb
The Pub/Sub subscription has been set up for this example: projects/apache-beam-testing/subscriptions/testpipeline-jenkins-1229035922-5d7d2fcb
*************************Tear Down*************************
The Pub/Sub topic has been deleted: projects/apache-beam-testing/topics/testpipeline-jenkins-1229035922-5d7d2fcb
The Pub/Sub subscription has been deleted: projects/apache-beam-testing/subscriptions/testpipeline-jenkins-1229035922-5d7d2fcb
***********************************************************
***********************************************************
***********************************************************
***********************************************************
**********************Set Up Pubsub************************
The Pub/Sub topic has been set up for this example: projects/apache-beam-testing/topics/testpipeline-jenkins-1229035922-dbab5e3a
The Pub/Sub subscription has been set up for this example: projects/apache-beam-testing/subscriptions/testpipeline-jenkins-1229035922-dbab5e3a
*************************Tear Down*************************
The Pub/Sub topic has been deleted: projects/apache-beam-testing/topics/testpipeline-jenkins-1229035922-dbab5e3a
The Pub/Sub subscription has been deleted: projects/apache-beam-testing/subscriptions/testpipeline-jenkins-1229035922-dbab5e3a
***********************************************************
***********************************************************
> Task :runners:google-cloud-dataflow-java:googleCloudPlatformRunnerV2IntegrationTest
org.apache.beam.sdk.io.gcp.pubsub.PubsubSchemaIT > classMethod FAILED
java.nio.file.NoSuchFileException at PubsubSchemaIT.java:85
org.apache.beam.sdk.io.gcp.pubsub.PubsubSchemaIT > classMethod FAILED
io.grpc.StatusRuntimeException at PubsubSchemaIT.java:96
81 tests completed, 2 failed, 2 skipped
> Task :runners:google-cloud-dataflow-java:googleCloudPlatformRunnerV2IntegrationTest FAILED
> Task :runners:google-cloud-dataflow-java:cleanUpDockerJavaImages
Untagged: us.gcr.io/apache-beam-testing/java-postcommit-it/java:20221229035740
Untagged: us.gcr.io/apache-beam-testing/java-postcommit-it/java@sha256:a5f3007718cc4a4805e4590cf0e64a639bde807fbc9c7ff050c85fc186b38df4
WARNING: Successfully resolved tag to sha256, but it is recommended to use sha256 directly.
Tag: [us.gcr.io/apache-beam-testing/java-postcommit-it/java:20221229035740]
- referencing digest: [us.gcr.io/apache-beam-testing/java-postcommit-it/java@sha256:a5f3007718cc4a4805e4590cf0e64a639bde807fbc9c7ff050c85fc186b38df4]
Deleted [[us.gcr.io/apache-beam-testing/java-postcommit-it/java:20221229035740] (referencing [us.gcr.io/apache-beam-testing/java-postcommit-it/java@sha256:a5f3007718cc4a4805e4590cf0e64a639bde807fbc9c7ff050c85fc186b38df4])].
Removing untagged image us.gcr.io/apache-beam-testing/java-postcommit-it/java@sha256:a5f3007718cc4a4805e4590cf0e64a639bde807fbc9c7ff050c85fc186b38df4
Digests:
- us.gcr.io/apache-beam-testing/java-postcommit-it/java@sha256:a5f3007718cc4a4805e4590cf0e64a639bde807fbc9c7ff050c85fc186b38df4
Deleted [us.gcr.io/apache-beam-testing/java-postcommit-it/java@sha256:a5f3007718cc4a4805e4590cf0e64a639bde807fbc9c7ff050c85fc186b38df4].
FAILURE: Build failed with an exception.
* What went wrong:
Execution failed for task ':runners:google-cloud-dataflow-java:googleCloudPlatformRunnerV2IntegrationTest'.
> There were failing tests. See the report at: file://<https://ci-beam.apache.org/job/beam_PostCommit_Java_DataflowV2/ws/src/runners/google-cloud-dataflow-java/build/reports/tests/googleCloudPlatformRunnerV2IntegrationTest/index.html>
* Try:
> Run with --stacktrace option to get the stack trace.
> Run with --info or --debug option to get more log output.
* Get more help at https://help.gradle.org
Deprecated Gradle features were used in this build, making it incompatible with Gradle 8.0.
You can use '--warning-mode all' to show the individual deprecation warnings and determine if they come from your own scripts or plugins.
See https://docs.gradle.org/7.5.1/userguide/command_line_interface.html#sec:command_line_warnings
Execution optimizations have been disabled for 1 invalid unit(s) of work during this build to ensure correctness.
Please consult deprecation warnings for more details.
BUILD FAILED in 3h 23m 14s
145 actionable tasks: 93 executed, 48 from cache, 4 up-to-date
Publishing build scan...
https://gradle.com/s/5xasodjkhzvjc
Build step 'Invoke Gradle script' changed build result to FAILURE
Build step 'Invoke Gradle script' marked build as failure
---------------------------------------------------------------------
To unsubscribe, e-mail: builds-unsubscribe@beam.apache.org
For additional commands, e-mail: builds-help@beam.apache.org
Build failed in Jenkins: beam_PostCommit_Java_DataflowV2 #2494
Posted by Apache Jenkins Server <je...@builds.apache.org>.
See <https://ci-beam.apache.org/job/beam_PostCommit_Java_DataflowV2/2494/display/redirect?page=changes>
Changes:
[noreply] Install sklearn < 1.20.0 for sklearn postcommit tests (#24788)
[noreply] [Spark Dataset runner] Skip unconsumed additional outputs of
[noreply] [Go SDK]: MongoDB IO connector (#24663)
[noreply] Better naming and inference for PythonCallable. (#24735)
------------------------------------------
[...truncated 55.46 KB...]
Installing collected packages: pip, setuptools, wheel
Attempting uninstall: pip
Found existing installation: pip 20.0.2
Uninstalling pip-20.0.2:
Successfully uninstalled pip-20.0.2
Attempting uninstall: setuptools
Found existing installation: setuptools 44.0.0
Uninstalling setuptools-44.0.0:
Successfully uninstalled setuptools-44.0.0
Successfully installed pip-22.3.1 setuptools-65.6.3 wheel-0.38.4
Collecting beautifulsoup4<5.0,>=4.9.0
Using cached beautifulsoup4-4.11.1-py3-none-any.whl (128 kB)
Collecting pyyaml<6.0.0,>=3.12
Using cached PyYAML-5.4.1-cp38-cp38-manylinux1_x86_64.whl (662 kB)
Collecting tenacity<6.0,>=5.0.2
Using cached tenacity-5.1.5-py2.py3-none-any.whl (34 kB)
Collecting soupsieve>1.2
Using cached soupsieve-2.3.2.post1-py3-none-any.whl (37 kB)
Collecting six>=1.9.0
Using cached six-1.16.0-py2.py3-none-any.whl (11 kB)
Installing collected packages: soupsieve, six, pyyaml, tenacity, beautifulsoup4
Successfully installed beautifulsoup4-4.11.1 pyyaml-5.4.1 six-1.16.0 soupsieve-2.3.2.post1 tenacity-5.1.5
Executing python <https://ci-beam.apache.org/job/beam_PostCommit_Java_DataflowV2/ws/src/sdks/java/container/license_scripts/pull_licenses_java.py> --license_index=<https://ci-beam.apache.org/job/beam_PostCommit_Java_DataflowV2/ws/src/sdks/java/container/build/reports/dependency-license/index.json> --output_dir=<https://ci-beam.apache.org/job/beam_PostCommit_Java_DataflowV2/ws/src/sdks/java/container/build/target/java_third_party_licenses> --dep_url_yaml=<https://ci-beam.apache.org/job/beam_PostCommit_Java_DataflowV2/ws/src/sdks/java/container/license_scripts/dep_urls_java.yaml> --manual_license_path=<https://ci-beam.apache.org/job/beam_PostCommit_Java_DataflowV2/ws/src/sdks/java/container/license_scripts/manual_licenses>
INFO:root:Pulling license for 235 dependencies using 16 threads.
INFO:root:Replaced local file URL with file://<https://ci-beam.apache.org/job/beam_PostCommit_Java_DataflowV2/ws/src/sdks/java/container/license_scripts/manual_licenses/xz/COPYING> for xz-1.5
INFO:root:pull_licenses_java.py succeed. It took 2.373743 seconds with 16 threads.
Copying licenses from <https://ci-beam.apache.org/job/beam_PostCommit_Java_DataflowV2/ws/src/sdks/java/container/build/target/java_third_party_licenses> to <https://ci-beam.apache.org/job/beam_PostCommit_Java_DataflowV2/ws/src/sdks/java/container/build/target/third_party_licenses.>
Finished license_scripts.sh
> Task :sdks:java:container:goPrepare UP-TO-DATE
> Task :sdks:java:container:java8:copyJavaThirdPartyLicenses
> Task :sdks:java:container:goBuild
/home/jenkins/go/bin/go1.19.3 build -o ./build/target/linux_amd64/boot boot.go boot_test.go
> Task :sdks:java:container:java8:copySdkHarnessLauncher
Execution optimizations have been disabled for task ':sdks:java:container:java8:copySdkHarnessLauncher' to ensure correctness due to the following reasons:
- Gradle detected a problem with the following location: '<https://ci-beam.apache.org/job/beam_PostCommit_Java_DataflowV2/ws/src/sdks/java/container/build/target'.> Reason: Task ':sdks:java:container:java8:copySdkHarnessLauncher' uses this output of task ':sdks:java:container:downloadCloudProfilerAgent' without declaring an explicit or implicit dependency. This can lead to incorrect results being produced, depending on what order the tasks are executed. Please refer to https://docs.gradle.org/7.5.1/userguide/validation_problems.html#implicit_dependency for more details about this problem.
- Gradle detected a problem with the following location: '<https://ci-beam.apache.org/job/beam_PostCommit_Java_DataflowV2/ws/src/sdks/java/container/build/target'.> Reason: Task ':sdks:java:container:java8:copySdkHarnessLauncher' uses this output of task ':sdks:java:container:pullLicenses' without declaring an explicit or implicit dependency. This can lead to incorrect results being produced, depending on what order the tasks are executed. Please refer to https://docs.gradle.org/7.5.1/userguide/validation_problems.html#implicit_dependency for more details about this problem.
> Task :release:go-licenses:java:dockerRun
go: downloading github.com/golang/protobuf v1.5.2
go: downloading golang.org/x/sys v0.0.0-20220728004956-3c1f35247d10
go: downloading google.golang.org/grpc v1.50.1
go: downloading google.golang.org/protobuf v1.28.1
go: downloading golang.org/x/net v0.0.0-20221012135044-0b7e1fb9d458
go: downloading google.golang.org/genproto v0.0.0-20221010155953-15ba04fc1c0e
go: added github.com/apache/beam/sdks/v2 v2.43.0
go: added github.com/golang/protobuf v1.5.2
go: added golang.org/x/net v0.0.0-20221012135044-0b7e1fb9d458
go: added golang.org/x/sys v0.0.0-20220728004956-3c1f35247d10
go: added golang.org/x/text v0.4.0
go: added google.golang.org/genproto v0.0.0-20221010155953-15ba04fc1c0e
go: added google.golang.org/grpc v1.50.1
go: added google.golang.org/protobuf v1.28.1
+ go-licenses save github.com/apache/beam/sdks/v2/java/container --save_path=/output/licenses
W1228 21:58:54.736377 37 library.go:101] "golang.org/x/sys/unix" contains non-Go code that can't be inspected for further dependencies:
/go/pkg/mod/golang.org/x/sys@v0.0.0-20220728004956-3c1f35247d10/unix/asm_linux_amd64.s
+ go-licenses csv github.com/apache/beam/sdks/v2/java/container
+ tee /output/licenses/list.csv
W1228 21:59:00.372571 81 library.go:101] "golang.org/x/sys/unix" contains non-Go code that can't be inspected for further dependencies:
/go/pkg/mod/golang.org/x/sys@v0.0.0-20220728004956-3c1f35247d10/unix/asm_linux_amd64.s
github.com/apache/beam/sdks/v2/go/pkg/beam,https://github.com/apache/beam/blob/sdks/v2.43.0/sdks/go/README.md,Apache-2.0
github.com/apache/beam/sdks/v2/java/container,https://github.com/apache/beam/blob/sdks/v2.43.0/sdks/LICENSE,Apache-2.0
github.com/golang/protobuf,https://github.com/golang/protobuf/blob/v1.5.2/LICENSE,BSD-3-Clause
golang.org/x/net,https://cs.opensource.google/go/x/net/+/0b7e1fb9:LICENSE,BSD-3-Clause
golang.org/x/sys,https://cs.opensource.google/go/x/sys/+/3c1f3524:LICENSE,BSD-3-Clause
golang.org/x/text,https://cs.opensource.google/go/x/text/+/v0.4.0:LICENSE,BSD-3-Clause
google.golang.org/genproto/googleapis/rpc/status,https://github.com/googleapis/go-genproto/blob/15ba04fc1c0e/LICENSE,Apache-2.0
google.golang.org/grpc,https://github.com/grpc/grpc-go/blob/v1.50.1/LICENSE,Apache-2.0
google.golang.org/protobuf,https://github.com/protocolbuffers/protobuf-go/blob/v1.28.1/LICENSE,BSD-3-Clause
+ chmod -R a+w /output/licenses
> Task :release:go-licenses:java:createLicenses
> Task :sdks:java:container:java8:copyGolangLicenses
> Task :sdks:java:container:java8:dockerPrepare
> Task :sdks:java:container:java8:docker
> Task :runners:google-cloud-dataflow-java:buildAndPushDockerJavaContainer
WARNING: `gcloud docker` will not be supported for Docker client versions above 18.03.
As an alternative, use `gcloud auth configure-docker` to configure `docker` to
use `gcloud` as a credential helper, then use `docker` as you would for non-GCR
registries, e.g. `docker pull gcr.io/project-id/my-image`. Add
`--verbosity=error` to silence this warning: `gcloud docker
--verbosity=error -- pull gcr.io/project-id/my-image`.
See: https://cloud.google.com/container-registry/docs/support/deprecation-notices#gcloud-docker
The push refers to repository [us.gcr.io/apache-beam-testing/java-postcommit-it/java]
8db42d1c89b4: Preparing
08e91cbdbd20: Preparing
33d4828491fd: Preparing
9bf6856bf6f6: Preparing
dd948a95aa42: Preparing
4f9faf9e2adc: Preparing
9916955b83c2: Preparing
4c6f64e05e3a: Preparing
caad24ce187c: Preparing
86f86e24f04d: Preparing
e42d8cdf33a9: Preparing
e7c045ee6c6d: Preparing
188f048e849f: Preparing
9916955b83c2: Waiting
4c6f64e05e3a: Waiting
86f86e24f04d: Waiting
caad24ce187c: Waiting
e42d8cdf33a9: Waiting
e7c045ee6c6d: Waiting
903a6c9f5a1f: Preparing
da48f70a7877: Preparing
6b5aaff44254: Preparing
53a0b163e995: Preparing
b626401ef603: Preparing
9b55156abf26: Preparing
293d5db30c9f: Preparing
03127cdb479b: Preparing
188f048e849f: Waiting
9c742cd6c7a5: Preparing
903a6c9f5a1f: Waiting
da48f70a7877: Waiting
6b5aaff44254: Waiting
293d5db30c9f: Waiting
9c742cd6c7a5: Waiting
53a0b163e995: Waiting
9b55156abf26: Waiting
b626401ef603: Waiting
dd948a95aa42: Pushed
9bf6856bf6f6: Pushed
08e91cbdbd20: Pushed
33d4828491fd: Pushed
8db42d1c89b4: Pushed
86f86e24f04d: Pushed
9916955b83c2: Pushed
4f9faf9e2adc: Pushed
4c6f64e05e3a: Pushed
caad24ce187c: Pushed
e7c045ee6c6d: Pushed
903a6c9f5a1f: Pushed
6b5aaff44254: Layer already exists
53a0b163e995: Layer already exists
b626401ef603: Layer already exists
9b55156abf26: Layer already exists
293d5db30c9f: Layer already exists
03127cdb479b: Layer already exists
e42d8cdf33a9: Pushed
9c742cd6c7a5: Layer already exists
188f048e849f: Pushed
da48f70a7877: Pushed
20221228215742: digest: sha256:983e7ba3b4cf8d55f1e6e21f2b0e7e2cc2b64936d0df3fd214cd365cdb45f4b8 size: 4934
> Task :runners:google-cloud-dataflow-java:coreSDKJavaRunnerV2IntegrationTest NO-SOURCE
> Task :runners:google-cloud-dataflow-java:examplesJavaRunnerV2IntegrationTest
***********************************************************
***********************************************************
**********************Set Up Pubsub************************
The Pub/Sub topic has been set up for this example: projects/apache-beam-testing/topics/testpipeline-jenkins-1228215946-7447118
The Pub/Sub subscription has been set up for this example: projects/apache-beam-testing/subscriptions/testpipeline-jenkins-1228215946-7447118
*************************Tear Down*************************
The Pub/Sub topic has been deleted: projects/apache-beam-testing/topics/testpipeline-jenkins-1228215946-7447118
The Pub/Sub subscription has been deleted: projects/apache-beam-testing/subscriptions/testpipeline-jenkins-1228215946-7447118
***********************************************************
***********************************************************
***********************************************************
***********************************************************
**********************Set Up Pubsub************************
The Pub/Sub topic has been set up for this example: projects/apache-beam-testing/topics/testpipeline-jenkins-1228215946-b49a3856
The Pub/Sub subscription has been set up for this example: projects/apache-beam-testing/subscriptions/testpipeline-jenkins-1228215946-b49a3856
*************************Tear Down*************************
The Pub/Sub topic has been deleted: projects/apache-beam-testing/topics/testpipeline-jenkins-1228215946-b49a3856
The Pub/Sub subscription has been deleted: projects/apache-beam-testing/subscriptions/testpipeline-jenkins-1228215946-b49a3856
***********************************************************
***********************************************************
> Task :runners:google-cloud-dataflow-java:googleCloudPlatformRunnerV2IntegrationTest
org.apache.beam.sdk.io.gcp.pubsub.PubsubSchemaIT > classMethod FAILED
java.nio.file.NoSuchFileException at PubsubSchemaIT.java:85
org.apache.beam.sdk.io.gcp.pubsub.PubsubSchemaIT > classMethod FAILED
io.grpc.StatusRuntimeException at PubsubSchemaIT.java:96
81 tests completed, 2 failed, 2 skipped
> Task :runners:google-cloud-dataflow-java:googleCloudPlatformRunnerV2IntegrationTest FAILED
> Task :runners:google-cloud-dataflow-java:cleanUpDockerJavaImages
Untagged: us.gcr.io/apache-beam-testing/java-postcommit-it/java:20221228215742
Untagged: us.gcr.io/apache-beam-testing/java-postcommit-it/java@sha256:983e7ba3b4cf8d55f1e6e21f2b0e7e2cc2b64936d0df3fd214cd365cdb45f4b8
Deleted: sha256:5e8e5c5a057756b5620899438220986ba5aae096f6e4752dd3788c191d4673c2
Deleted: sha256:37c0641bb6708acc21d7b8eccd79673312abb2eb268fd0dadc34501a9a176236
Deleted: sha256:d0b0d7cb6d4c64587c5a0cfc8ab030c02a8bdc8c7f98d2bcb64067858ac86640
Deleted: sha256:24c50ac04a86ac9190a922ef9bab52278bd81d3d3fdd541f76e9c123d7196ef5
Deleted: sha256:14296e01c63449f079989e5e74df4f2227be4694b87663e4b1174feb72681cc9
Deleted: sha256:c01861d420c11895d7f61d6a6a79683de0c37b1eed1d3607e1e1d5d38e30a99b
Deleted: sha256:e486f53983e3babba605763ff213ba3a3175de8b1d310c5a889deeab7d3e8eaa
Deleted: sha256:047f73e20fa081043ad0a3d72e2c50dca41b2aa31ffa58ad8c32449004ccb7df
Deleted: sha256:ddf98178572d7cd5205590a36d1f2fcfb017a81c4066baa28208f27a42d813ea
Deleted: sha256:7e880fa5dc0278b11a12f28dc46cbe6a7b613ff74fb86b14f8fe72da4f9902ef
Deleted: sha256:6628b87b42bde3e18320afe70ae713d70ac2abcc177d396c301e35a29728c88f
Deleted: sha256:18af3d4019db8d0df0e013adb40c08bb3c362aa0ac773191dedd6254fc06dc07
Deleted: sha256:7642859f462fad289d2f95f817676788f031724c22b290455695cedec8d24438
Deleted: sha256:3fb3e462935db6c9caf1b63ea94d38b2bd88e893acb7f705ae2b691a3493150b
Deleted: sha256:591a93c840d3f7d40194db133733e3161c955552ba49f829691513b91018ffde
Deleted: sha256:7f7f483b4aa45d9b44e6207d5b4414fbca304952f46f1b32ea139a924abe498f
Deleted: sha256:c6287ce78c0bd3307b97b5e0b68428c212d77dcbbf03305ceffbf4ae985f443a
Deleted: sha256:bf29fb6c95498bf550dd9536630ac1a2a448940f0fd405697cd07781eac57109
Deleted: sha256:f60d5f448b02f47d235931caeda2102c0ae40bc072b627d71a5f35ab9aa3cc9a
WARNING: Successfully resolved tag to sha256, but it is recommended to use sha256 directly.
Tag: [us.gcr.io/apache-beam-testing/java-postcommit-it/java:20221228215742]
- referencing digest: [us.gcr.io/apache-beam-testing/java-postcommit-it/java@sha256:983e7ba3b4cf8d55f1e6e21f2b0e7e2cc2b64936d0df3fd214cd365cdb45f4b8]
Deleted [[us.gcr.io/apache-beam-testing/java-postcommit-it/java:20221228215742] (referencing [us.gcr.io/apache-beam-testing/java-postcommit-it/java@sha256:983e7ba3b4cf8d55f1e6e21f2b0e7e2cc2b64936d0df3fd214cd365cdb45f4b8])].
Removing untagged image us.gcr.io/apache-beam-testing/java-postcommit-it/java@sha256:983e7ba3b4cf8d55f1e6e21f2b0e7e2cc2b64936d0df3fd214cd365cdb45f4b8
Digests:
- us.gcr.io/apache-beam-testing/java-postcommit-it/java@sha256:983e7ba3b4cf8d55f1e6e21f2b0e7e2cc2b64936d0df3fd214cd365cdb45f4b8
Deleted [us.gcr.io/apache-beam-testing/java-postcommit-it/java@sha256:983e7ba3b4cf8d55f1e6e21f2b0e7e2cc2b64936d0df3fd214cd365cdb45f4b8].
FAILURE: Build failed with an exception.
* What went wrong:
Execution failed for task ':runners:google-cloud-dataflow-java:googleCloudPlatformRunnerV2IntegrationTest'.
> There were failing tests. See the report at: file://<https://ci-beam.apache.org/job/beam_PostCommit_Java_DataflowV2/ws/src/runners/google-cloud-dataflow-java/build/reports/tests/googleCloudPlatformRunnerV2IntegrationTest/index.html>
* Try:
> Run with --stacktrace option to get the stack trace.
> Run with --info or --debug option to get more log output.
* Get more help at https://help.gradle.org
Deprecated Gradle features were used in this build, making it incompatible with Gradle 8.0.
You can use '--warning-mode all' to show the individual deprecation warnings and determine if they come from your own scripts or plugins.
See https://docs.gradle.org/7.5.1/userguide/command_line_interface.html#sec:command_line_warnings
Execution optimizations have been disabled for 1 invalid unit(s) of work during this build to ensure correctness.
Please consult deprecation warnings for more details.
BUILD FAILED in 3h 22m 25s
145 actionable tasks: 93 executed, 48 from cache, 4 up-to-date
Publishing build scan...
https://gradle.com/s/bnzr22yicojha
Build step 'Invoke Gradle script' changed build result to FAILURE
Build step 'Invoke Gradle script' marked build as failure
---------------------------------------------------------------------
To unsubscribe, e-mail: builds-unsubscribe@beam.apache.org
For additional commands, e-mail: builds-help@beam.apache.org
Build failed in Jenkins: beam_PostCommit_Java_DataflowV2 #2493
Posted by Apache Jenkins Server <je...@builds.apache.org>.
See <https://ci-beam.apache.org/job/beam_PostCommit_Java_DataflowV2/2493/display/redirect?page=changes>
Changes:
[Alexey Romanenko] [#24292] Create Avro extension for Java SDK
[Alexey Romanenko] Address the review comments
[Alexey Romanenko] Apply #24454 changes
[bulatkazan] [Website] update check links, catch prod & staging links
------------------------------------------
[...truncated 58.29 KB...]
golang.org/x/sys,https://cs.opensource.google/go/x/sys/+/3c1f3524:LICENSE,BSD-3-Clause
golang.org/x/text,https://cs.opensource.google/go/x/text/+/v0.4.0:LICENSE,BSD-3-Clause
google.golang.org/genproto/googleapis/rpc/status,https://github.com/googleapis/go-genproto/blob/15ba04fc1c0e/LICENSE,Apache-2.0
google.golang.org/grpc,https://github.com/grpc/grpc-go/blob/v1.50.1/LICENSE,Apache-2.0
google.golang.org/protobuf,https://github.com/protocolbuffers/protobuf-go/blob/v1.28.1/LICENSE,BSD-3-Clause
+ chmod -R a+w /output/licenses
> Task :sdks:java:extensions:ml:compileJava
> Task :sdks:java:extensions:ml:classes
> Task :sdks:java:extensions:ml:jar
> Task :sdks:java:io:google-cloud-platform:compileJava
> Task :release:go-licenses:java:createLicenses
> Task :sdks:java:container:java8:copyGolangLicenses
> Task :sdks:java:container:java8:dockerPrepare
> Task :sdks:java:container:java8:docker
> Task :runners:google-cloud-dataflow-java:buildAndPushDockerJavaContainer
WARNING: `gcloud docker` will not be supported for Docker client versions above 18.03.
As an alternative, use `gcloud auth configure-docker` to configure `docker` to
use `gcloud` as a credential helper, then use `docker` as you would for non-GCR
registries, e.g. `docker pull gcr.io/project-id/my-image`. Add
`--verbosity=error` to silence this warning: `gcloud docker
--verbosity=error -- pull gcr.io/project-id/my-image`.
See: https://cloud.google.com/container-registry/docs/support/deprecation-notices#gcloud-docker
The push refers to repository [us.gcr.io/apache-beam-testing/java-postcommit-it/java]
6fcb39dc4c6f: Preparing
449caf5671d2: Preparing
59927101b7f5: Preparing
2a2dea64db62: Preparing
9037dfdf2d0a: Preparing
a656d0a4092b: Preparing
70f1edac3fdb: Preparing
db4a47cf0bd7: Preparing
ff54fc65408d: Preparing
b2daede7a68c: Preparing
a18405af06d8: Preparing
d41302c4cb7f: Preparing
aa90f6c4b830: Preparing
0961e9e422f2: Preparing
825e6366328f: Preparing
6b5aaff44254: Preparing
53a0b163e995: Preparing
b626401ef603: Preparing
9b55156abf26: Preparing
293d5db30c9f: Preparing
03127cdb479b: Preparing
9c742cd6c7a5: Preparing
b2daede7a68c: Waiting
825e6366328f: Waiting
b626401ef603: Waiting
a18405af06d8: Waiting
6b5aaff44254: Waiting
53a0b163e995: Waiting
03127cdb479b: Waiting
d41302c4cb7f: Waiting
9b55156abf26: Waiting
0961e9e422f2: Waiting
293d5db30c9f: Waiting
9c742cd6c7a5: Waiting
a656d0a4092b: Waiting
70f1edac3fdb: Waiting
db4a47cf0bd7: Waiting
ff54fc65408d: Waiting
2a2dea64db62: Pushed
9037dfdf2d0a: Pushed
59927101b7f5: Pushed
449caf5671d2: Pushed
6fcb39dc4c6f: Pushed
db4a47cf0bd7: Pushed
70f1edac3fdb: Pushed
b2daede7a68c: Pushed
d41302c4cb7f: Pushed
ff54fc65408d: Pushed
a18405af06d8: Pushed
6b5aaff44254: Layer already exists
a656d0a4092b: Pushed
53a0b163e995: Layer already exists
b626401ef603: Layer already exists
9b55156abf26: Layer already exists
293d5db30c9f: Layer already exists
03127cdb479b: Layer already exists
9c742cd6c7a5: Layer already exists
aa90f6c4b830: Pushed
0961e9e422f2: Pushed
825e6366328f: Pushed
20221228155750: digest: sha256:839f736e8104ffc1ca7aec2fdbfc0c2fe1204bb382328d803ee6c55361690ab1 size: 4934
> Task :sdks:java:io:google-cloud-platform:compileJava
Note: Some input files use or override a deprecated API.
Note: Recompile with -Xlint:deprecation for details.
Note: Some input files use unchecked or unsafe operations.
Note: Recompile with -Xlint:unchecked for details.
> Task :sdks:java:io:google-cloud-platform:classes
> Task :sdks:java:io:google-cloud-platform:jar
> Task :sdks:java:io:google-cloud-platform:compileTestJava
> Task :runners:google-cloud-dataflow-java:compileJava
> Task :examples:java:compileJava
> Task :sdks:java:io:google-cloud-platform:compileTestJava
Note: Some input files use or override a deprecated API.
Note: Recompile with -Xlint:deprecation for details.
Note: Some input files use unchecked or unsafe operations.
Note: Recompile with -Xlint:unchecked for details.
> Task :sdks:java:io:google-cloud-platform:testClasses
> Task :sdks:java:io:google-cloud-platform:testJar
> Task :examples:java:compileJava
Note: Some input files use or override a deprecated API.
Note: Recompile with -Xlint:deprecation for details.
Note: Some input files use unchecked or unsafe operations.
Note: Recompile with -Xlint:unchecked for details.
> Task :examples:java:classes
> Task :examples:java:jar
> Task :runners:google-cloud-dataflow-java:compileJava
Note: Some input files use or override a deprecated API.
Note: Recompile with -Xlint:deprecation for details.
Note: Some input files use unchecked or unsafe operations.
Note: Recompile with -Xlint:unchecked for details.
> Task :runners:google-cloud-dataflow-java:classes
> Task :examples:java:compileTestJava
Note: Some input files use or override a deprecated API.
Note: Recompile with -Xlint:deprecation for details.
Note: Some input files use unchecked or unsafe operations.
Note: Recompile with -Xlint:unchecked for details.
> Task :runners:google-cloud-dataflow-java:jar
> Task :runners:google-cloud-dataflow-java:coreSDKJavaRunnerV2IntegrationTest NO-SOURCE
> Task :examples:java:testClasses
> Task :examples:java:testJar
> Task :runners:google-cloud-dataflow-java:googleCloudPlatformRunnerV2IntegrationTest
org.apache.beam.sdk.io.gcp.pubsub.PubsubSchemaIT > classMethod FAILED
java.nio.file.NoSuchFileException at PubsubSchemaIT.java:85
org.apache.beam.sdk.io.gcp.pubsub.PubsubSchemaIT > classMethod FAILED
io.grpc.StatusRuntimeException at PubsubSchemaIT.java:96
81 tests completed, 2 failed, 2 skipped
> Task :runners:google-cloud-dataflow-java:googleCloudPlatformRunnerV2IntegrationTest FAILED
> Task :runners:google-cloud-dataflow-java:examplesJavaRunnerV2IntegrationTest
***********************************************************
***********************************************************
**********************Set Up Pubsub************************
The Pub/Sub topic has been set up for this example: projects/apache-beam-testing/topics/testpipeline-jenkins-1228184851-2d5e4a06
The Pub/Sub subscription has been set up for this example: projects/apache-beam-testing/subscriptions/testpipeline-jenkins-1228184851-2d5e4a06
*************************Tear Down*************************
The Pub/Sub topic has been deleted: projects/apache-beam-testing/topics/testpipeline-jenkins-1228184851-2d5e4a06
The Pub/Sub subscription has been deleted: projects/apache-beam-testing/subscriptions/testpipeline-jenkins-1228184851-2d5e4a06
***********************************************************
***********************************************************
***********************************************************
***********************************************************
**********************Set Up Pubsub************************
The Pub/Sub topic has been set up for this example: projects/apache-beam-testing/topics/testpipeline-jenkins-1228184851-de5bf53c
The Pub/Sub subscription has been set up for this example: projects/apache-beam-testing/subscriptions/testpipeline-jenkins-1228184851-de5bf53c
*************************Tear Down*************************
The Pub/Sub topic has been deleted: projects/apache-beam-testing/topics/testpipeline-jenkins-1228184851-de5bf53c
The Pub/Sub subscription has been deleted: projects/apache-beam-testing/subscriptions/testpipeline-jenkins-1228184851-de5bf53c
***********************************************************
***********************************************************
> Task :runners:google-cloud-dataflow-java:cleanUpDockerJavaImages
Untagged: us.gcr.io/apache-beam-testing/java-postcommit-it/java:20221228155750
Untagged: us.gcr.io/apache-beam-testing/java-postcommit-it/java@sha256:839f736e8104ffc1ca7aec2fdbfc0c2fe1204bb382328d803ee6c55361690ab1
Deleted: sha256:b8832db83ff98612e477239bbee26e27e4d9f76a82cfa25c71a2ea6398610596
Deleted: sha256:58b039a945f4f505ea536e8e4a506178b548d03a2e2c75a25e3523bd1a207e90
Deleted: sha256:03fc62fa352bae934acdbb683dce27db2c3330b3a80663355a90413a470daa62
Deleted: sha256:78c778ca58661a09b8675128507de009ef34d6875782558f3274bd8b361cf7e7
Deleted: sha256:c3f4a09e67d361cda3b0bd2de989c653a29b44905b291851e8cddd75d61c0008
Deleted: sha256:20b4085a93207c5c1664a598a3523e36175205512f4491fd3b7ddb52332b79ca
Deleted: sha256:391d9a4845645c537bbc2f06b03694d0132b6cfe91b1ed92895567ae61c70294
Deleted: sha256:2a0169d6b35e705c6749fd57d696e14d45fab52b426fb633bb3aab85b3690a21
Deleted: sha256:34915227faeb41bf39845e4310d4f438eafaf1c402efb9f56b0c5b96287c98d3
Deleted: sha256:86d835f36c02c312282b2db209055dba6dddc73fcf47550c71cc8f0643358c06
Deleted: sha256:6b94d81156d5978eadfc8d8fd0fcc5e4ca50604a70c57445c52efaf90115be3b
Deleted: sha256:985599c01b6d28dce1dab69cf3b3ab8d4e65fdf39f48d8292e0f1f1c957e8ffb
Deleted: sha256:f32ccda2bfab367d3d48d36c487707ea875023622d90f366864baf09d3ce61fe
Deleted: sha256:f7da58c449e8ecfefe1a73ea6fb1f7f65415a6c19151c219e7e60c8f3518346c
Deleted: sha256:85fbb62c2232329efbe5958bf6036a12f2bfa402d2e7a854ddba018bb1934992
Deleted: sha256:71b9303621eff4c2dad8203ed793d9e4f89b7412489d7505e30198f579dab253
Deleted: sha256:01bbeb26b9ff46857d2f407dab36d3b85119fddd6475519a0fecccb9d65346a1
Deleted: sha256:a09da0da8e75c6da42d35a6b9720f976fd51a99c9157ffe4fe2564aa0b58b420
Deleted: sha256:3f91a36b1382b74857292257c0cb35bd75c6fce23e6f6badc14ddbd1e00cdf6a
Deleted: sha256:ae56ccecb44a8de1d8f8d3ba465e0704e69f41e2d5123b0d124e8827608427f2
Deleted: sha256:6c1b0dadfc0032be1016cd3b1607681e7a2acfe08a7b409b0d595dfb1232cc7a
Deleted: sha256:52c9ce462222a5da2740ce4dcdf3aad90394ca799ea93483d268e32110a96aea
Deleted: sha256:5bc396bfcc336667bdd9fbb642da17539d1383c694dacf573b3ea2bced58f7b8
Deleted: sha256:d94909100105de558fdd4660bb02de7bca401a797fc26554da6c271fd963afb4
Deleted: sha256:0f5a13a3aa661e59e263973e9eb787098ee7d245fe1f2aef17e4e5e4554ace9c
Deleted: sha256:12af712dcabcfd6c9b041be34d43ee3aa3521bd6c53442974f4a6abe3c1a3d94
Deleted: sha256:d75407aa99c88169b9bd50c51c31e22e298d4377fdf3f4187829fb029a69fc71
Deleted: sha256:f057401b20d944da89e6abca68456519c88699ff1140d87415016a75829599da
Deleted: sha256:3aaf80e9e28c6cf7b814e171686a3497d4aedd63da4e6dc008ee74a65c1891e4
Deleted: sha256:44206de81cb8d0d53c5b5389d5a6f09bf2ad043f5336088e382e0d2dfa17cfa6
Deleted: sha256:f89ca14431be5db2fb20487ffdf2b1f9bfce3f17da1c2cf59040ded66728948e
Deleted: sha256:94bd6ee1f2536cc2c3aa3e7a9f383b8b9dfffc5f5d1e8e5dd185b247c1bbc16b
Deleted: sha256:279bd922f9fcf4db24493d39912fd10324f9cdc8d79becde50e77cb4584c811d
Deleted: sha256:cbb06f06b3112502915172a7aa5019c70413d59d610174c9c2a97d21a3cf90a1
WARNING: Successfully resolved tag to sha256, but it is recommended to use sha256 directly.
Tag: [us.gcr.io/apache-beam-testing/java-postcommit-it/java:20221228155750]
- referencing digest: [us.gcr.io/apache-beam-testing/java-postcommit-it/java@sha256:839f736e8104ffc1ca7aec2fdbfc0c2fe1204bb382328d803ee6c55361690ab1]
Deleted [[us.gcr.io/apache-beam-testing/java-postcommit-it/java:20221228155750] (referencing [us.gcr.io/apache-beam-testing/java-postcommit-it/java@sha256:839f736e8104ffc1ca7aec2fdbfc0c2fe1204bb382328d803ee6c55361690ab1])].
Removing untagged image us.gcr.io/apache-beam-testing/java-postcommit-it/java@sha256:839f736e8104ffc1ca7aec2fdbfc0c2fe1204bb382328d803ee6c55361690ab1
Digests:
- us.gcr.io/apache-beam-testing/java-postcommit-it/java@sha256:839f736e8104ffc1ca7aec2fdbfc0c2fe1204bb382328d803ee6c55361690ab1
Deleted [us.gcr.io/apache-beam-testing/java-postcommit-it/java@sha256:839f736e8104ffc1ca7aec2fdbfc0c2fe1204bb382328d803ee6c55361690ab1].
FAILURE: Build failed with an exception.
* What went wrong:
Execution failed for task ':runners:google-cloud-dataflow-java:googleCloudPlatformRunnerV2IntegrationTest'.
> There were failing tests. See the report at: file://<https://ci-beam.apache.org/job/beam_PostCommit_Java_DataflowV2/ws/src/runners/google-cloud-dataflow-java/build/reports/tests/googleCloudPlatformRunnerV2IntegrationTest/index.html>
* Try:
> Run with --stacktrace option to get the stack trace.
> Run with --info or --debug option to get more log output.
* Get more help at https://help.gradle.org
Deprecated Gradle features were used in this build, making it incompatible with Gradle 8.0.
You can use '--warning-mode all' to show the individual deprecation warnings and determine if they come from your own scripts or plugins.
See https://docs.gradle.org/7.5.1/userguide/command_line_interface.html#sec:command_line_warnings
Execution optimizations have been disabled for 1 invalid unit(s) of work during this build to ensure correctness.
Please consult deprecation warnings for more details.
BUILD FAILED in 3h 27m 39s
145 actionable tasks: 101 executed, 40 from cache, 4 up-to-date
Publishing build scan...
https://gradle.com/s/ch4itweemndm2
Build step 'Invoke Gradle script' changed build result to FAILURE
Build step 'Invoke Gradle script' marked build as failure
---------------------------------------------------------------------
To unsubscribe, e-mail: builds-unsubscribe@beam.apache.org
For additional commands, e-mail: builds-help@beam.apache.org
Build failed in Jenkins: beam_PostCommit_Java_DataflowV2 #2492
Posted by Apache Jenkins Server <je...@builds.apache.org>.
See <https://ci-beam.apache.org/job/beam_PostCommit_Java_DataflowV2/2492/display/redirect?page=changes>
Changes:
[noreply] [Spark Dataset runner] Trigger evaluation using write noop rather than
------------------------------------------
[...truncated 52.27 KB...]
> Task :sdks:java:extensions:protobuf:testJar
> Task :examples:java:compileTestJava FROM-CACHE
> Task :examples:java:testClasses
> Task :examples:java:testJar
> Task :sdks:java:io:google-cloud-platform:compileTestJava FROM-CACHE
> Task :sdks:java:io:google-cloud-platform:testClasses
> Task :sdks:java:container:pullLicenses
Collecting pip
Using cached pip-22.3.1-py3-none-any.whl (2.1 MB)
> Task :sdks:java:io:google-cloud-platform:testJar
> Task :sdks:java:container:pullLicenses
Collecting setuptools
Using cached setuptools-65.6.3-py3-none-any.whl (1.2 MB)
Collecting wheel
Using cached wheel-0.38.4-py3-none-any.whl (36 kB)
Installing collected packages: pip, setuptools, wheel
Attempting uninstall: pip
Found existing installation: pip 20.0.2
Uninstalling pip-20.0.2:
Successfully uninstalled pip-20.0.2
Attempting uninstall: setuptools
Found existing installation: setuptools 44.0.0
Uninstalling setuptools-44.0.0:
Successfully uninstalled setuptools-44.0.0
Successfully installed pip-22.3.1 setuptools-65.6.3 wheel-0.38.4
Collecting beautifulsoup4<5.0,>=4.9.0
Using cached beautifulsoup4-4.11.1-py3-none-any.whl (128 kB)
Collecting pyyaml<6.0.0,>=3.12
Using cached PyYAML-5.4.1-cp38-cp38-manylinux1_x86_64.whl (662 kB)
Collecting tenacity<6.0,>=5.0.2
Using cached tenacity-5.1.5-py2.py3-none-any.whl (34 kB)
Collecting soupsieve>1.2
Using cached soupsieve-2.3.2.post1-py3-none-any.whl (37 kB)
Collecting six>=1.9.0
Using cached six-1.16.0-py2.py3-none-any.whl (11 kB)
Installing collected packages: soupsieve, six, pyyaml, tenacity, beautifulsoup4
Successfully installed beautifulsoup4-4.11.1 pyyaml-5.4.1 six-1.16.0 soupsieve-2.3.2.post1 tenacity-5.1.5
Executing python <https://ci-beam.apache.org/job/beam_PostCommit_Java_DataflowV2/ws/src/sdks/java/container/license_scripts/pull_licenses_java.py> --license_index=<https://ci-beam.apache.org/job/beam_PostCommit_Java_DataflowV2/ws/src/sdks/java/container/build/reports/dependency-license/index.json> --output_dir=<https://ci-beam.apache.org/job/beam_PostCommit_Java_DataflowV2/ws/src/sdks/java/container/build/target/java_third_party_licenses> --dep_url_yaml=<https://ci-beam.apache.org/job/beam_PostCommit_Java_DataflowV2/ws/src/sdks/java/container/license_scripts/dep_urls_java.yaml> --manual_license_path=<https://ci-beam.apache.org/job/beam_PostCommit_Java_DataflowV2/ws/src/sdks/java/container/license_scripts/manual_licenses>
INFO:root:Pulling license for 235 dependencies using 16 threads.
INFO:root:Replaced local file URL with file://<https://ci-beam.apache.org/job/beam_PostCommit_Java_DataflowV2/ws/src/sdks/java/container/license_scripts/manual_licenses/xz/COPYING> for xz-1.5
INFO:root:pull_licenses_java.py succeed. It took 2.1824 seconds with 16 threads.
Copying licenses from <https://ci-beam.apache.org/job/beam_PostCommit_Java_DataflowV2/ws/src/sdks/java/container/build/target/java_third_party_licenses> to <https://ci-beam.apache.org/job/beam_PostCommit_Java_DataflowV2/ws/src/sdks/java/container/build/target/third_party_licenses.>
Finished license_scripts.sh
> Task :sdks:java:container:goPrepare UP-TO-DATE
> Task :sdks:java:container:java8:copyJavaThirdPartyLicenses
> Task :sdks:java:container:goBuild
/home/jenkins/go/bin/go1.19.3 build -o ./build/target/linux_amd64/boot boot.go boot_test.go
> Task :sdks:java:container:java8:copySdkHarnessLauncher
Execution optimizations have been disabled for task ':sdks:java:container:java8:copySdkHarnessLauncher' to ensure correctness due to the following reasons:
- Gradle detected a problem with the following location: '<https://ci-beam.apache.org/job/beam_PostCommit_Java_DataflowV2/ws/src/sdks/java/container/build/target'.> Reason: Task ':sdks:java:container:java8:copySdkHarnessLauncher' uses this output of task ':sdks:java:container:downloadCloudProfilerAgent' without declaring an explicit or implicit dependency. This can lead to incorrect results being produced, depending on what order the tasks are executed. Please refer to https://docs.gradle.org/7.5.1/userguide/validation_problems.html#implicit_dependency for more details about this problem.
- Gradle detected a problem with the following location: '<https://ci-beam.apache.org/job/beam_PostCommit_Java_DataflowV2/ws/src/sdks/java/container/build/target'.> Reason: Task ':sdks:java:container:java8:copySdkHarnessLauncher' uses this output of task ':sdks:java:container:pullLicenses' without declaring an explicit or implicit dependency. This can lead to incorrect results being produced, depending on what order the tasks are executed. Please refer to https://docs.gradle.org/7.5.1/userguide/validation_problems.html#implicit_dependency for more details about this problem.
> Task :release:go-licenses:java:dockerRun
go: downloading github.com/golang/protobuf v1.5.2
go: downloading google.golang.org/grpc v1.50.1
go: downloading google.golang.org/protobuf v1.28.1
go: downloading golang.org/x/sys v0.0.0-20220728004956-3c1f35247d10
go: downloading golang.org/x/net v0.0.0-20221012135044-0b7e1fb9d458
go: downloading google.golang.org/genproto v0.0.0-20221010155953-15ba04fc1c0e
go: added github.com/apache/beam/sdks/v2 v2.43.0
go: added github.com/golang/protobuf v1.5.2
go: added golang.org/x/net v0.0.0-20221012135044-0b7e1fb9d458
go: added golang.org/x/sys v0.0.0-20220728004956-3c1f35247d10
go: added golang.org/x/text v0.4.0
go: added google.golang.org/genproto v0.0.0-20221010155953-15ba04fc1c0e
go: added google.golang.org/grpc v1.50.1
go: added google.golang.org/protobuf v1.28.1
+ go-licenses save github.com/apache/beam/sdks/v2/java/container --save_path=/output/licenses
W1228 09:58:54.284070 37 library.go:101] "golang.org/x/sys/unix" contains non-Go code that can't be inspected for further dependencies:
/go/pkg/mod/golang.org/x/sys@v0.0.0-20220728004956-3c1f35247d10/unix/asm_linux_amd64.s
+ go-licenses csv github.com/apache/beam/sdks/v2/java/container
+ tee /output/licenses/list.csv
W1228 09:58:58.256415 82 library.go:101] "golang.org/x/sys/unix" contains non-Go code that can't be inspected for further dependencies:
/go/pkg/mod/golang.org/x/sys@v0.0.0-20220728004956-3c1f35247d10/unix/asm_linux_amd64.s
github.com/apache/beam/sdks/v2/go/pkg/beam,https://github.com/apache/beam/blob/sdks/v2.43.0/sdks/go/README.md,Apache-2.0
github.com/apache/beam/sdks/v2/java/container,https://github.com/apache/beam/blob/sdks/v2.43.0/sdks/LICENSE,Apache-2.0
github.com/golang/protobuf,https://github.com/golang/protobuf/blob/v1.5.2/LICENSE,BSD-3-Clause
golang.org/x/net,https://cs.opensource.google/go/x/net/+/0b7e1fb9:LICENSE,BSD-3-Clause
golang.org/x/sys,https://cs.opensource.google/go/x/sys/+/3c1f3524:LICENSE,BSD-3-Clause
golang.org/x/text,https://cs.opensource.google/go/x/text/+/v0.4.0:LICENSE,BSD-3-Clause
google.golang.org/genproto/googleapis/rpc/status,https://github.com/googleapis/go-genproto/blob/15ba04fc1c0e/LICENSE,Apache-2.0
google.golang.org/grpc,https://github.com/grpc/grpc-go/blob/v1.50.1/LICENSE,Apache-2.0
google.golang.org/protobuf,https://github.com/protocolbuffers/protobuf-go/blob/v1.28.1/LICENSE,BSD-3-Clause
+ chmod -R a+w /output/licenses
> Task :release:go-licenses:java:createLicenses
> Task :sdks:java:container:java8:copyGolangLicenses
> Task :sdks:java:container:java8:dockerPrepare
> Task :sdks:java:container:java8:docker
> Task :runners:google-cloud-dataflow-java:buildAndPushDockerJavaContainer
WARNING: `gcloud docker` will not be supported for Docker client versions above 18.03.
As an alternative, use `gcloud auth configure-docker` to configure `docker` to
use `gcloud` as a credential helper, then use `docker` as you would for non-GCR
registries, e.g. `docker pull gcr.io/project-id/my-image`. Add
`--verbosity=error` to silence this warning: `gcloud docker
--verbosity=error -- pull gcr.io/project-id/my-image`.
See: https://cloud.google.com/container-registry/docs/support/deprecation-notices#gcloud-docker
The push refers to repository [us.gcr.io/apache-beam-testing/java-postcommit-it/java]
f421d5446550: Preparing
56654a4d2676: Preparing
5676914378b6: Preparing
f9dac064db9f: Preparing
02b3762e0cf9: Preparing
f19718cdebc4: Preparing
fd51dc3141c2: Preparing
6954c891bff6: Preparing
c1f9fee7cb3a: Preparing
4f4c6e853aea: Preparing
d5136715c141: Preparing
bf6f146bbb6d: Preparing
2d315a986766: Preparing
6e6a2043c89d: Preparing
3972c546c35c: Preparing
6b5aaff44254: Preparing
53a0b163e995: Preparing
b626401ef603: Preparing
9b55156abf26: Preparing
293d5db30c9f: Preparing
03127cdb479b: Preparing
9c742cd6c7a5: Preparing
c1f9fee7cb3a: Waiting
b626401ef603: Waiting
4f4c6e853aea: Waiting
9b55156abf26: Waiting
2d315a986766: Waiting
bf6f146bbb6d: Waiting
293d5db30c9f: Waiting
d5136715c141: Waiting
6e6a2043c89d: Waiting
03127cdb479b: Waiting
6b5aaff44254: Waiting
3972c546c35c: Waiting
9c742cd6c7a5: Waiting
53a0b163e995: Waiting
f19718cdebc4: Waiting
6954c891bff6: Waiting
f9dac064db9f: Pushed
02b3762e0cf9: Pushed
56654a4d2676: Pushed
5676914378b6: Pushed
f421d5446550: Pushed
fd51dc3141c2: Pushed
6954c891bff6: Pushed
4f4c6e853aea: Pushed
c1f9fee7cb3a: Pushed
bf6f146bbb6d: Pushed
d5136715c141: Pushed
6b5aaff44254: Layer already exists
53a0b163e995: Layer already exists
f19718cdebc4: Pushed
b626401ef603: Layer already exists
9b55156abf26: Layer already exists
293d5db30c9f: Layer already exists
03127cdb479b: Layer already exists
9c742cd6c7a5: Layer already exists
2d315a986766: Pushed
6e6a2043c89d: Pushed
3972c546c35c: Pushed
20221228095743: digest: sha256:38fd19a963488a42ca0163b44b14304d6808a1b0d1384817821412ad6638cee6 size: 4934
> Task :runners:google-cloud-dataflow-java:coreSDKJavaRunnerV2IntegrationTest NO-SOURCE
> Task :runners:google-cloud-dataflow-java:examplesJavaRunnerV2IntegrationTest
***********************************************************
***********************************************************
**********************Set Up Pubsub************************
The Pub/Sub topic has been set up for this example: projects/apache-beam-testing/topics/testpipeline-jenkins-1228095926-d4bec293
The Pub/Sub subscription has been set up for this example: projects/apache-beam-testing/subscriptions/testpipeline-jenkins-1228095926-d4bec293
*************************Tear Down*************************
The Pub/Sub topic has been deleted: projects/apache-beam-testing/topics/testpipeline-jenkins-1228095926-d4bec293
The Pub/Sub subscription has been deleted: projects/apache-beam-testing/subscriptions/testpipeline-jenkins-1228095926-d4bec293
***********************************************************
***********************************************************
***********************************************************
***********************************************************
**********************Set Up Pubsub************************
The Pub/Sub topic has been set up for this example: projects/apache-beam-testing/topics/testpipeline-jenkins-1228095926-4769a4a7
The Pub/Sub subscription has been set up for this example: projects/apache-beam-testing/subscriptions/testpipeline-jenkins-1228095926-4769a4a7
*************************Tear Down*************************
The Pub/Sub topic has been deleted: projects/apache-beam-testing/topics/testpipeline-jenkins-1228095926-4769a4a7
The Pub/Sub subscription has been deleted: projects/apache-beam-testing/subscriptions/testpipeline-jenkins-1228095926-4769a4a7
***********************************************************
***********************************************************
> Task :runners:google-cloud-dataflow-java:googleCloudPlatformRunnerV2IntegrationTest
org.apache.beam.sdk.io.gcp.pubsub.PubsubSchemaIT > classMethod FAILED
java.nio.file.NoSuchFileException at PubsubSchemaIT.java:85
org.apache.beam.sdk.io.gcp.pubsub.PubsubSchemaIT > classMethod FAILED
io.grpc.StatusRuntimeException at PubsubSchemaIT.java:96
81 tests completed, 2 failed, 2 skipped
> Task :runners:google-cloud-dataflow-java:googleCloudPlatformRunnerV2IntegrationTest FAILED
> Task :runners:google-cloud-dataflow-java:cleanUpDockerJavaImages
Untagged: us.gcr.io/apache-beam-testing/java-postcommit-it/java:20221228095743
Untagged: us.gcr.io/apache-beam-testing/java-postcommit-it/java@sha256:38fd19a963488a42ca0163b44b14304d6808a1b0d1384817821412ad6638cee6
WARNING: Successfully resolved tag to sha256, but it is recommended to use sha256 directly.
Tag: [us.gcr.io/apache-beam-testing/java-postcommit-it/java:20221228095743]
- referencing digest: [us.gcr.io/apache-beam-testing/java-postcommit-it/java@sha256:38fd19a963488a42ca0163b44b14304d6808a1b0d1384817821412ad6638cee6]
Deleted [[us.gcr.io/apache-beam-testing/java-postcommit-it/java:20221228095743] (referencing [us.gcr.io/apache-beam-testing/java-postcommit-it/java@sha256:38fd19a963488a42ca0163b44b14304d6808a1b0d1384817821412ad6638cee6])].
Removing untagged image us.gcr.io/apache-beam-testing/java-postcommit-it/java@sha256:38fd19a963488a42ca0163b44b14304d6808a1b0d1384817821412ad6638cee6
Digests:
- us.gcr.io/apache-beam-testing/java-postcommit-it/java@sha256:38fd19a963488a42ca0163b44b14304d6808a1b0d1384817821412ad6638cee6
Deleted [us.gcr.io/apache-beam-testing/java-postcommit-it/java@sha256:38fd19a963488a42ca0163b44b14304d6808a1b0d1384817821412ad6638cee6].
FAILURE: Build failed with an exception.
* What went wrong:
Execution failed for task ':runners:google-cloud-dataflow-java:googleCloudPlatformRunnerV2IntegrationTest'.
> There were failing tests. See the report at: file://<https://ci-beam.apache.org/job/beam_PostCommit_Java_DataflowV2/ws/src/runners/google-cloud-dataflow-java/build/reports/tests/googleCloudPlatformRunnerV2IntegrationTest/index.html>
* Try:
> Run with --stacktrace option to get the stack trace.
> Run with --info or --debug option to get more log output.
* Get more help at https://help.gradle.org
Deprecated Gradle features were used in this build, making it incompatible with Gradle 8.0.
You can use '--warning-mode all' to show the individual deprecation warnings and determine if they come from your own scripts or plugins.
See https://docs.gradle.org/7.5.1/userguide/command_line_interface.html#sec:command_line_warnings
Execution optimizations have been disabled for 1 invalid unit(s) of work during this build to ensure correctness.
Please consult deprecation warnings for more details.
BUILD FAILED in 3h 21m 50s
145 actionable tasks: 93 executed, 48 from cache, 4 up-to-date
Publishing build scan...
https://gradle.com/s/5xmncmyuoeezy
Build step 'Invoke Gradle script' changed build result to FAILURE
Build step 'Invoke Gradle script' marked build as failure
---------------------------------------------------------------------
To unsubscribe, e-mail: builds-unsubscribe@beam.apache.org
For additional commands, e-mail: builds-help@beam.apache.org
Build failed in Jenkins: beam_PostCommit_Java_DataflowV2 #2491
Posted by Apache Jenkins Server <je...@builds.apache.org>.
See <https://ci-beam.apache.org/job/beam_PostCommit_Java_DataflowV2/2491/display/redirect?page=changes>
Changes:
[noreply] Update Java portable container for Dataflow (#24791)
[noreply] [BigQuery] Extend timestamp precision to microseconds when writing with
------------------------------------------
[...truncated 52.74 KB...]
> Task :examples:java:testJar
> Task :sdks:java:container:pullLicenses
Collecting pip
Using cached pip-22.3.1-py3-none-any.whl (2.1 MB)
Collecting setuptools
Using cached setuptools-65.6.3-py3-none-any.whl (1.2 MB)
Collecting wheel
Using cached wheel-0.38.4-py3-none-any.whl (36 kB)
Installing collected packages: pip, setuptools, wheel
Attempting uninstall: pip
Found existing installation: pip 20.0.2
Uninstalling pip-20.0.2:
Successfully uninstalled pip-20.0.2
Attempting uninstall: setuptools
Found existing installation: setuptools 44.0.0
Uninstalling setuptools-44.0.0:
Successfully uninstalled setuptools-44.0.0
Successfully installed pip-22.3.1 setuptools-65.6.3 wheel-0.38.4
Collecting beautifulsoup4<5.0,>=4.9.0
Using cached beautifulsoup4-4.11.1-py3-none-any.whl (128 kB)
Collecting pyyaml<6.0.0,>=3.12
Using cached PyYAML-5.4.1-cp38-cp38-manylinux1_x86_64.whl (662 kB)
Collecting tenacity<6.0,>=5.0.2
Using cached tenacity-5.1.5-py2.py3-none-any.whl (34 kB)
Collecting soupsieve>1.2
Using cached soupsieve-2.3.2.post1-py3-none-any.whl (37 kB)
Collecting six>=1.9.0
Using cached six-1.16.0-py2.py3-none-any.whl (11 kB)
Installing collected packages: soupsieve, six, pyyaml, tenacity, beautifulsoup4
Successfully installed beautifulsoup4-4.11.1 pyyaml-5.4.1 six-1.16.0 soupsieve-2.3.2.post1 tenacity-5.1.5
Executing python <https://ci-beam.apache.org/job/beam_PostCommit_Java_DataflowV2/ws/src/sdks/java/container/license_scripts/pull_licenses_java.py> --license_index=<https://ci-beam.apache.org/job/beam_PostCommit_Java_DataflowV2/ws/src/sdks/java/container/build/reports/dependency-license/index.json> --output_dir=<https://ci-beam.apache.org/job/beam_PostCommit_Java_DataflowV2/ws/src/sdks/java/container/build/target/java_third_party_licenses> --dep_url_yaml=<https://ci-beam.apache.org/job/beam_PostCommit_Java_DataflowV2/ws/src/sdks/java/container/license_scripts/dep_urls_java.yaml> --manual_license_path=<https://ci-beam.apache.org/job/beam_PostCommit_Java_DataflowV2/ws/src/sdks/java/container/license_scripts/manual_licenses>
INFO:root:Pulling license for 235 dependencies using 16 threads.
INFO:root:Replaced local file URL with file://<https://ci-beam.apache.org/job/beam_PostCommit_Java_DataflowV2/ws/src/sdks/java/container/license_scripts/manual_licenses/xz/COPYING> for xz-1.5
INFO:root:pull_licenses_java.py succeed. It took 2.415017 seconds with 16 threads.
Copying licenses from <https://ci-beam.apache.org/job/beam_PostCommit_Java_DataflowV2/ws/src/sdks/java/container/build/target/java_third_party_licenses> to <https://ci-beam.apache.org/job/beam_PostCommit_Java_DataflowV2/ws/src/sdks/java/container/build/target/third_party_licenses.>
Finished license_scripts.sh
> Task :sdks:java:container:goPrepare UP-TO-DATE
> Task :sdks:java:container:java8:copyJavaThirdPartyLicenses
> Task :sdks:java:container:goBuild
/home/jenkins/go/bin/go1.19.3 build -o ./build/target/linux_amd64/boot boot.go boot_test.go
> Task :sdks:java:container:java8:copySdkHarnessLauncher
Execution optimizations have been disabled for task ':sdks:java:container:java8:copySdkHarnessLauncher' to ensure correctness due to the following reasons:
- Gradle detected a problem with the following location: '<https://ci-beam.apache.org/job/beam_PostCommit_Java_DataflowV2/ws/src/sdks/java/container/build/target'.> Reason: Task ':sdks:java:container:java8:copySdkHarnessLauncher' uses this output of task ':sdks:java:container:downloadCloudProfilerAgent' without declaring an explicit or implicit dependency. This can lead to incorrect results being produced, depending on what order the tasks are executed. Please refer to https://docs.gradle.org/7.5.1/userguide/validation_problems.html#implicit_dependency for more details about this problem.
- Gradle detected a problem with the following location: '<https://ci-beam.apache.org/job/beam_PostCommit_Java_DataflowV2/ws/src/sdks/java/container/build/target'.> Reason: Task ':sdks:java:container:java8:copySdkHarnessLauncher' uses this output of task ':sdks:java:container:pullLicenses' without declaring an explicit or implicit dependency. This can lead to incorrect results being produced, depending on what order the tasks are executed. Please refer to https://docs.gradle.org/7.5.1/userguide/validation_problems.html#implicit_dependency for more details about this problem.
> Task :sdks:java:io:google-cloud-platform:compileTestJava
Note: Some input files use or override a deprecated API.
Note: Recompile with -Xlint:deprecation for details.
Note: Some input files use unchecked or unsafe operations.
Note: Recompile with -Xlint:unchecked for details.
> Task :sdks:java:io:google-cloud-platform:testClasses
> Task :sdks:java:io:google-cloud-platform:testJar
> Task :release:go-licenses:java:dockerRun
go: downloading google.golang.org/grpc v1.50.1
go: downloading google.golang.org/protobuf v1.28.1
go: downloading github.com/golang/protobuf v1.5.2
go: downloading golang.org/x/sys v0.0.0-20220728004956-3c1f35247d10
go: downloading google.golang.org/genproto v0.0.0-20221010155953-15ba04fc1c0e
go: downloading golang.org/x/net v0.0.0-20221012135044-0b7e1fb9d458
go: added github.com/apache/beam/sdks/v2 v2.43.0
go: added github.com/golang/protobuf v1.5.2
go: added golang.org/x/net v0.0.0-20221012135044-0b7e1fb9d458
go: added golang.org/x/sys v0.0.0-20220728004956-3c1f35247d10
go: added golang.org/x/text v0.4.0
go: added google.golang.org/genproto v0.0.0-20221010155953-15ba04fc1c0e
go: added google.golang.org/grpc v1.50.1
go: added google.golang.org/protobuf v1.28.1
+ go-licenses save github.com/apache/beam/sdks/v2/java/container --save_path=/output/licenses
W1228 03:58:54.083814 33 library.go:101] "golang.org/x/sys/unix" contains non-Go code that can't be inspected for further dependencies:
/go/pkg/mod/golang.org/x/sys@v0.0.0-20220728004956-3c1f35247d10/unix/asm_linux_amd64.s
+ go-licenses csv github.com/apache/beam/sdks/v2/java/container
+ tee /output/licenses/list.csv
W1228 03:58:59.593442 77 library.go:101] "golang.org/x/sys/unix" contains non-Go code that can't be inspected for further dependencies:
/go/pkg/mod/golang.org/x/sys@v0.0.0-20220728004956-3c1f35247d10/unix/asm_linux_amd64.s
github.com/apache/beam/sdks/v2/go/pkg/beam,https://github.com/apache/beam/blob/sdks/v2.43.0/sdks/go/README.md,Apache-2.0
github.com/apache/beam/sdks/v2/java/container,https://github.com/apache/beam/blob/sdks/v2.43.0/sdks/LICENSE,Apache-2.0
github.com/golang/protobuf,https://github.com/golang/protobuf/blob/v1.5.2/LICENSE,BSD-3-Clause
golang.org/x/net,https://cs.opensource.google/go/x/net/+/0b7e1fb9:LICENSE,BSD-3-Clause
golang.org/x/sys,https://cs.opensource.google/go/x/sys/+/3c1f3524:LICENSE,BSD-3-Clause
golang.org/x/text,https://cs.opensource.google/go/x/text/+/v0.4.0:LICENSE,BSD-3-Clause
google.golang.org/genproto/googleapis/rpc/status,https://github.com/googleapis/go-genproto/blob/15ba04fc1c0e/LICENSE,Apache-2.0
google.golang.org/grpc,https://github.com/grpc/grpc-go/blob/v1.50.1/LICENSE,Apache-2.0
google.golang.org/protobuf,https://github.com/protocolbuffers/protobuf-go/blob/v1.28.1/LICENSE,BSD-3-Clause
+ chmod -R a+w /output/licenses
> Task :release:go-licenses:java:createLicenses
> Task :sdks:java:container:java8:copyGolangLicenses
> Task :sdks:java:container:java8:dockerPrepare
> Task :sdks:java:container:java8:docker
> Task :runners:google-cloud-dataflow-java:buildAndPushDockerJavaContainer
WARNING: `gcloud docker` will not be supported for Docker client versions above 18.03.
As an alternative, use `gcloud auth configure-docker` to configure `docker` to
use `gcloud` as a credential helper, then use `docker` as you would for non-GCR
registries, e.g. `docker pull gcr.io/project-id/my-image`. Add
`--verbosity=error` to silence this warning: `gcloud docker
--verbosity=error -- pull gcr.io/project-id/my-image`.
See: https://cloud.google.com/container-registry/docs/support/deprecation-notices#gcloud-docker
The push refers to repository [us.gcr.io/apache-beam-testing/java-postcommit-it/java]
236bec89049a: Preparing
5cfdc69db9af: Preparing
2c4fad62b619: Preparing
29f1148b1877: Preparing
30928b72ad62: Preparing
647a16843f66: Preparing
1d9ed56828a6: Preparing
6ca8cde6a80f: Preparing
12ff6e207b4a: Preparing
1a4042090973: Preparing
4ae2c98e9fc8: Preparing
22c2fb6cbc39: Preparing
e59473230947: Preparing
212aa2e752cc: Preparing
62a6eb60e3a8: Preparing
6b5aaff44254: Preparing
53a0b163e995: Preparing
b626401ef603: Preparing
9b55156abf26: Preparing
293d5db30c9f: Preparing
03127cdb479b: Preparing
9c742cd6c7a5: Preparing
212aa2e752cc: Waiting
647a16843f66: Waiting
b626401ef603: Waiting
1a4042090973: Waiting
1d9ed56828a6: Waiting
9b55156abf26: Waiting
6ca8cde6a80f: Waiting
e59473230947: Waiting
293d5db30c9f: Waiting
4ae2c98e9fc8: Waiting
62a6eb60e3a8: Waiting
53a0b163e995: Waiting
6b5aaff44254: Waiting
22c2fb6cbc39: Waiting
9c742cd6c7a5: Waiting
03127cdb479b: Waiting
2c4fad62b619: Pushed
5cfdc69db9af: Pushed
30928b72ad62: Pushed
29f1148b1877: Pushed
647a16843f66: Pushed
236bec89049a: Pushed
1d9ed56828a6: Pushed
6ca8cde6a80f: Pushed
12ff6e207b4a: Pushed
1a4042090973: Pushed
22c2fb6cbc39: Pushed
6b5aaff44254: Layer already exists
4ae2c98e9fc8: Pushed
53a0b163e995: Layer already exists
212aa2e752cc: Pushed
b626401ef603: Layer already exists
e59473230947: Pushed
9b55156abf26: Layer already exists
03127cdb479b: Layer already exists
293d5db30c9f: Layer already exists
9c742cd6c7a5: Layer already exists
62a6eb60e3a8: Pushed
20221228035742: digest: sha256:ced94c0c4458d50d3581eadeb3cca219171e3b0007f1dfa88ceb329f5e0e4553 size: 4934
> Task :runners:google-cloud-dataflow-java:coreSDKJavaRunnerV2IntegrationTest NO-SOURCE
> Task :runners:google-cloud-dataflow-java:examplesJavaRunnerV2IntegrationTest
***********************************************************
***********************************************************
**********************Set Up Pubsub************************
The Pub/Sub topic has been set up for this example: projects/apache-beam-testing/topics/testpipeline-jenkins-1228035941-5a9b2f53
The Pub/Sub subscription has been set up for this example: projects/apache-beam-testing/subscriptions/testpipeline-jenkins-1228035941-5a9b2f53
*************************Tear Down*************************
The Pub/Sub topic has been deleted: projects/apache-beam-testing/topics/testpipeline-jenkins-1228035941-5a9b2f53
The Pub/Sub subscription has been deleted: projects/apache-beam-testing/subscriptions/testpipeline-jenkins-1228035941-5a9b2f53
***********************************************************
***********************************************************
***********************************************************
***********************************************************
**********************Set Up Pubsub************************
The Pub/Sub topic has been set up for this example: projects/apache-beam-testing/topics/testpipeline-jenkins-1228035941-4a0c2f1d
The Pub/Sub subscription has been set up for this example: projects/apache-beam-testing/subscriptions/testpipeline-jenkins-1228035941-4a0c2f1d
*************************Tear Down*************************
The Pub/Sub topic has been deleted: projects/apache-beam-testing/topics/testpipeline-jenkins-1228035941-4a0c2f1d
The Pub/Sub subscription has been deleted: projects/apache-beam-testing/subscriptions/testpipeline-jenkins-1228035941-4a0c2f1d
***********************************************************
***********************************************************
> Task :runners:google-cloud-dataflow-java:googleCloudPlatformRunnerV2IntegrationTest
org.apache.beam.sdk.io.gcp.pubsub.PubsubSchemaIT > classMethod FAILED
java.nio.file.NoSuchFileException at PubsubSchemaIT.java:85
org.apache.beam.sdk.io.gcp.pubsub.PubsubSchemaIT > classMethod FAILED
io.grpc.StatusRuntimeException at PubsubSchemaIT.java:96
81 tests completed, 2 failed, 2 skipped
> Task :runners:google-cloud-dataflow-java:googleCloudPlatformRunnerV2IntegrationTest FAILED
> Task :runners:google-cloud-dataflow-java:cleanUpDockerJavaImages
Untagged: us.gcr.io/apache-beam-testing/java-postcommit-it/java:20221228035742
Untagged: us.gcr.io/apache-beam-testing/java-postcommit-it/java@sha256:ced94c0c4458d50d3581eadeb3cca219171e3b0007f1dfa88ceb329f5e0e4553
WARNING: Successfully resolved tag to sha256, but it is recommended to use sha256 directly.
Tag: [us.gcr.io/apache-beam-testing/java-postcommit-it/java:20221228035742]
- referencing digest: [us.gcr.io/apache-beam-testing/java-postcommit-it/java@sha256:ced94c0c4458d50d3581eadeb3cca219171e3b0007f1dfa88ceb329f5e0e4553]
Deleted [[us.gcr.io/apache-beam-testing/java-postcommit-it/java:20221228035742] (referencing [us.gcr.io/apache-beam-testing/java-postcommit-it/java@sha256:ced94c0c4458d50d3581eadeb3cca219171e3b0007f1dfa88ceb329f5e0e4553])].
Removing untagged image us.gcr.io/apache-beam-testing/java-postcommit-it/java@sha256:ced94c0c4458d50d3581eadeb3cca219171e3b0007f1dfa88ceb329f5e0e4553
Digests:
- us.gcr.io/apache-beam-testing/java-postcommit-it/java@sha256:ced94c0c4458d50d3581eadeb3cca219171e3b0007f1dfa88ceb329f5e0e4553
Deleted [us.gcr.io/apache-beam-testing/java-postcommit-it/java@sha256:ced94c0c4458d50d3581eadeb3cca219171e3b0007f1dfa88ceb329f5e0e4553].
FAILURE: Build failed with an exception.
* What went wrong:
Execution failed for task ':runners:google-cloud-dataflow-java:googleCloudPlatformRunnerV2IntegrationTest'.
> There were failing tests. See the report at: file://<https://ci-beam.apache.org/job/beam_PostCommit_Java_DataflowV2/ws/src/runners/google-cloud-dataflow-java/build/reports/tests/googleCloudPlatformRunnerV2IntegrationTest/index.html>
* Try:
> Run with --stacktrace option to get the stack trace.
> Run with --info or --debug option to get more log output.
* Get more help at https://help.gradle.org
Deprecated Gradle features were used in this build, making it incompatible with Gradle 8.0.
You can use '--warning-mode all' to show the individual deprecation warnings and determine if they come from your own scripts or plugins.
See https://docs.gradle.org/7.5.1/userguide/command_line_interface.html#sec:command_line_warnings
Execution optimizations have been disabled for 1 invalid unit(s) of work during this build to ensure correctness.
Please consult deprecation warnings for more details.
BUILD FAILED in 3h 23m 28s
145 actionable tasks: 94 executed, 47 from cache, 4 up-to-date
Publishing build scan...
https://gradle.com/s/t6lachtgzxls4
Build step 'Invoke Gradle script' changed build result to FAILURE
Build step 'Invoke Gradle script' marked build as failure
---------------------------------------------------------------------
To unsubscribe, e-mail: builds-unsubscribe@beam.apache.org
For additional commands, e-mail: builds-help@beam.apache.org
Build failed in Jenkins: beam_PostCommit_Java_DataflowV2 #2490
Posted by Apache Jenkins Server <je...@builds.apache.org>.
See <https://ci-beam.apache.org/job/beam_PostCommit_Java_DataflowV2/2490/display/redirect?page=changes>
Changes:
[noreply] Make go vet and go staticcheck output visible in CI (#24786)
[noreply] [Go SDK] Fix multimap support for the direct runner (#24775)
[noreply] [#24515] Ensure that Go pipelines on Dataflow are not allowed to opt out
------------------------------------------
[...truncated 55.92 KB...]
Collecting soupsieve>1.2
Using cached soupsieve-2.3.2.post1-py3-none-any.whl (37 kB)
Collecting six>=1.9.0
Using cached six-1.16.0-py2.py3-none-any.whl (11 kB)
Installing collected packages: soupsieve, six, pyyaml, tenacity, beautifulsoup4
Successfully installed beautifulsoup4-4.11.1 pyyaml-5.4.1 six-1.16.0 soupsieve-2.3.2.post1 tenacity-5.1.5
Executing python <https://ci-beam.apache.org/job/beam_PostCommit_Java_DataflowV2/ws/src/sdks/java/container/license_scripts/pull_licenses_java.py> --license_index=<https://ci-beam.apache.org/job/beam_PostCommit_Java_DataflowV2/ws/src/sdks/java/container/build/reports/dependency-license/index.json> --output_dir=<https://ci-beam.apache.org/job/beam_PostCommit_Java_DataflowV2/ws/src/sdks/java/container/build/target/java_third_party_licenses> --dep_url_yaml=<https://ci-beam.apache.org/job/beam_PostCommit_Java_DataflowV2/ws/src/sdks/java/container/license_scripts/dep_urls_java.yaml> --manual_license_path=<https://ci-beam.apache.org/job/beam_PostCommit_Java_DataflowV2/ws/src/sdks/java/container/license_scripts/manual_licenses>
INFO:root:Pulling license for 235 dependencies using 16 threads.
INFO:root:Replaced local file URL with file://<https://ci-beam.apache.org/job/beam_PostCommit_Java_DataflowV2/ws/src/sdks/java/container/license_scripts/manual_licenses/xz/COPYING> for xz-1.5
INFO:root:pull_licenses_java.py succeed. It took 2.357841 seconds with 16 threads.
Copying licenses from <https://ci-beam.apache.org/job/beam_PostCommit_Java_DataflowV2/ws/src/sdks/java/container/build/target/java_third_party_licenses> to <https://ci-beam.apache.org/job/beam_PostCommit_Java_DataflowV2/ws/src/sdks/java/container/build/target/third_party_licenses.>
Finished license_scripts.sh
> Task :sdks:java:container:goPrepare UP-TO-DATE
> Task :sdks:java:container:java8:copyJavaThirdPartyLicenses
> Task :sdks:java:container:goBuild
/home/jenkins/go/bin/go1.19.3 build -o ./build/target/linux_amd64/boot boot.go boot_test.go
> Task :sdks:java:container:java8:copySdkHarnessLauncher
Execution optimizations have been disabled for task ':sdks:java:container:java8:copySdkHarnessLauncher' to ensure correctness due to the following reasons:
- Gradle detected a problem with the following location: '<https://ci-beam.apache.org/job/beam_PostCommit_Java_DataflowV2/ws/src/sdks/java/container/build/target'.> Reason: Task ':sdks:java:container:java8:copySdkHarnessLauncher' uses this output of task ':sdks:java:container:downloadCloudProfilerAgent' without declaring an explicit or implicit dependency. This can lead to incorrect results being produced, depending on what order the tasks are executed. Please refer to https://docs.gradle.org/7.5.1/userguide/validation_problems.html#implicit_dependency for more details about this problem.
- Gradle detected a problem with the following location: '<https://ci-beam.apache.org/job/beam_PostCommit_Java_DataflowV2/ws/src/sdks/java/container/build/target'.> Reason: Task ':sdks:java:container:java8:copySdkHarnessLauncher' uses this output of task ':sdks:java:container:pullLicenses' without declaring an explicit or implicit dependency. This can lead to incorrect results being produced, depending on what order the tasks are executed. Please refer to https://docs.gradle.org/7.5.1/userguide/validation_problems.html#implicit_dependency for more details about this problem.
> Task :release:go-licenses:java:dockerRun
go: downloading github.com/golang/protobuf v1.5.2
go: downloading google.golang.org/grpc v1.50.1
go: downloading google.golang.org/protobuf v1.28.1
go: downloading golang.org/x/sys v0.0.0-20220728004956-3c1f35247d10
go: downloading google.golang.org/genproto v0.0.0-20221010155953-15ba04fc1c0e
go: downloading golang.org/x/net v0.0.0-20221012135044-0b7e1fb9d458
go: added github.com/apache/beam/sdks/v2 v2.43.0
go: added github.com/golang/protobuf v1.5.2
go: added golang.org/x/net v0.0.0-20221012135044-0b7e1fb9d458
go: added golang.org/x/sys v0.0.0-20220728004956-3c1f35247d10
go: added golang.org/x/text v0.4.0
go: added google.golang.org/genproto v0.0.0-20221010155953-15ba04fc1c0e
go: added google.golang.org/grpc v1.50.1
go: added google.golang.org/protobuf v1.28.1
+ go-licenses save github.com/apache/beam/sdks/v2/java/container --save_path=/output/licenses
W1227 21:58:56.313253 34 library.go:101] "golang.org/x/sys/unix" contains non-Go code that can't be inspected for further dependencies:
/go/pkg/mod/golang.org/x/sys@v0.0.0-20220728004956-3c1f35247d10/unix/asm_linux_amd64.s
+ go-licenses csv github.com/apache/beam/sdks/v2/java/container
+ tee /output/licenses/list.csv
W1227 21:59:00.604261 78 library.go:101] "golang.org/x/sys/unix" contains non-Go code that can't be inspected for further dependencies:
/go/pkg/mod/golang.org/x/sys@v0.0.0-20220728004956-3c1f35247d10/unix/asm_linux_amd64.s
github.com/apache/beam/sdks/v2/go/pkg/beam,https://github.com/apache/beam/blob/sdks/v2.43.0/sdks/go/README.md,Apache-2.0
github.com/apache/beam/sdks/v2/java/container,https://github.com/apache/beam/blob/sdks/v2.43.0/sdks/LICENSE,Apache-2.0
github.com/golang/protobuf,https://github.com/golang/protobuf/blob/v1.5.2/LICENSE,BSD-3-Clause
golang.org/x/net,https://cs.opensource.google/go/x/net/+/0b7e1fb9:LICENSE,BSD-3-Clause
golang.org/x/sys,https://cs.opensource.google/go/x/sys/+/3c1f3524:LICENSE,BSD-3-Clause
golang.org/x/text,https://cs.opensource.google/go/x/text/+/v0.4.0:LICENSE,BSD-3-Clause
google.golang.org/genproto/googleapis/rpc/status,https://github.com/googleapis/go-genproto/blob/15ba04fc1c0e/LICENSE,Apache-2.0
google.golang.org/grpc,https://github.com/grpc/grpc-go/blob/v1.50.1/LICENSE,Apache-2.0
google.golang.org/protobuf,https://github.com/protocolbuffers/protobuf-go/blob/v1.28.1/LICENSE,BSD-3-Clause
+ chmod -R a+w /output/licenses
> Task :release:go-licenses:java:createLicenses
> Task :sdks:java:container:java8:copyGolangLicenses
> Task :sdks:java:container:java8:dockerPrepare
> Task :sdks:java:container:java8:docker
> Task :runners:google-cloud-dataflow-java:buildAndPushDockerJavaContainer
WARNING: `gcloud docker` will not be supported for Docker client versions above 18.03.
As an alternative, use `gcloud auth configure-docker` to configure `docker` to
use `gcloud` as a credential helper, then use `docker` as you would for non-GCR
registries, e.g. `docker pull gcr.io/project-id/my-image`. Add
`--verbosity=error` to silence this warning: `gcloud docker
--verbosity=error -- pull gcr.io/project-id/my-image`.
See: https://cloud.google.com/container-registry/docs/support/deprecation-notices#gcloud-docker
The push refers to repository [us.gcr.io/apache-beam-testing/java-postcommit-it/java]
0d9f0a06a742: Preparing
a7eaf91f4e31: Preparing
130d46475f1f: Preparing
126d7ebf00c6: Preparing
247a50606739: Preparing
d59a3da4f87c: Preparing
914a472f2b99: Preparing
596bc1786c02: Preparing
6360ce31dbab: Preparing
843f2a59f477: Preparing
0ba8ae809bcd: Preparing
437ba43ba97f: Preparing
235dbc562c94: Preparing
1931a098c079: Preparing
e47df409684a: Preparing
6b5aaff44254: Preparing
53a0b163e995: Preparing
b626401ef603: Preparing
9b55156abf26: Preparing
293d5db30c9f: Preparing
914a472f2b99: Waiting
03127cdb479b: Preparing
9c742cd6c7a5: Preparing
6b5aaff44254: Waiting
596bc1786c02: Waiting
53a0b163e995: Waiting
6360ce31dbab: Waiting
293d5db30c9f: Waiting
03127cdb479b: Waiting
9b55156abf26: Waiting
843f2a59f477: Waiting
0ba8ae809bcd: Waiting
235dbc562c94: Waiting
437ba43ba97f: Waiting
e47df409684a: Waiting
d59a3da4f87c: Waiting
1931a098c079: Waiting
9c742cd6c7a5: Waiting
a7eaf91f4e31: Pushed
126d7ebf00c6: Pushed
130d46475f1f: Pushed
247a50606739: Pushed
0d9f0a06a742: Pushed
596bc1786c02: Pushed
914a472f2b99: Pushed
d59a3da4f87c: Pushed
6360ce31dbab: Pushed
437ba43ba97f: Pushed
0ba8ae809bcd: Pushed
843f2a59f477: Pushed
6b5aaff44254: Layer already exists
53a0b163e995: Layer already exists
b626401ef603: Layer already exists
9b55156abf26: Layer already exists
293d5db30c9f: Layer already exists
03127cdb479b: Layer already exists
9c742cd6c7a5: Layer already exists
e47df409684a: Pushed
1931a098c079: Pushed
235dbc562c94: Pushed
20221227215743: digest: sha256:9a5d77a39bd42788083bd8845b76508abdbff7bee605c216e2af39e71dfa45f5 size: 4934
> Task :runners:google-cloud-dataflow-java:coreSDKJavaRunnerV2IntegrationTest NO-SOURCE
> Task :runners:google-cloud-dataflow-java:examplesJavaRunnerV2IntegrationTest
***********************************************************
***********************************************************
**********************Set Up Pubsub************************
The Pub/Sub topic has been set up for this example: projects/apache-beam-testing/topics/testpipeline-jenkins-1227215950-72865859
The Pub/Sub subscription has been set up for this example: projects/apache-beam-testing/subscriptions/testpipeline-jenkins-1227215950-72865859
*************************Tear Down*************************
The Pub/Sub topic has been deleted: projects/apache-beam-testing/topics/testpipeline-jenkins-1227215950-72865859
The Pub/Sub subscription has been deleted: projects/apache-beam-testing/subscriptions/testpipeline-jenkins-1227215950-72865859
***********************************************************
***********************************************************
***********************************************************
***********************************************************
**********************Set Up Pubsub************************
The Pub/Sub topic has been set up for this example: projects/apache-beam-testing/topics/testpipeline-jenkins-1227215950-8c3c8d99
The Pub/Sub subscription has been set up for this example: projects/apache-beam-testing/subscriptions/testpipeline-jenkins-1227215950-8c3c8d99
*************************Tear Down*************************
The Pub/Sub topic has been deleted: projects/apache-beam-testing/topics/testpipeline-jenkins-1227215950-8c3c8d99
The Pub/Sub subscription has been deleted: projects/apache-beam-testing/subscriptions/testpipeline-jenkins-1227215950-8c3c8d99
***********************************************************
***********************************************************
> Task :runners:google-cloud-dataflow-java:googleCloudPlatformRunnerV2IntegrationTest
org.apache.beam.sdk.io.gcp.pubsub.PubsubSchemaIT > classMethod FAILED
java.nio.file.NoSuchFileException at PubsubSchemaIT.java:85
org.apache.beam.sdk.io.gcp.pubsub.PubsubSchemaIT > classMethod FAILED
io.grpc.StatusRuntimeException at PubsubSchemaIT.java:96
81 tests completed, 2 failed, 2 skipped
> Task :runners:google-cloud-dataflow-java:googleCloudPlatformRunnerV2IntegrationTest FAILED
> Task :runners:google-cloud-dataflow-java:cleanUpDockerJavaImages
Untagged: us.gcr.io/apache-beam-testing/java-postcommit-it/java:20221227215743
Untagged: us.gcr.io/apache-beam-testing/java-postcommit-it/java@sha256:9a5d77a39bd42788083bd8845b76508abdbff7bee605c216e2af39e71dfa45f5
Deleted: sha256:77b7ea42ef191cad94a8de7b0a4b2db2f424ccc1c42fee3bc465ef0116dce57b
Deleted: sha256:a1df3fc6fe0f2fb9db490d9d56b3290b8eda8f9d125f683b3d779a47ef477059
Deleted: sha256:f6b27bc80b1b21752def2019667453817764f8622d9fac8c4e290bb3464d1e7e
Deleted: sha256:7fd33b6421adb92ef113091d596be4a09d271cff66c2f1fdda28297761fbf025
Deleted: sha256:e7202810a5a363601318ac00fe51f52c0e3520d05f51b29b77e45181968f17c3
Deleted: sha256:8129b546e683de54aa9dce6d1b7045803ec3473058825275f3e68b7a52904576
Deleted: sha256:6b6f37986a8967b8cb9fc96bea6a70480537417955e8fe188650a9f5a853220c
Deleted: sha256:8cebc9369e1f874eb7aa57717147334f2311f3728d8049988438a9069041925d
Deleted: sha256:f23812efa13ff65836e427759eaed95ae57a61d028f73c2d83a4da53c6ba662e
Deleted: sha256:9837630a8ebd83887db63d72dce6aa52bec1fa20daae2ff8135f0ae4039efa62
Deleted: sha256:72fe0c44e7baa80c857591b564d81c05a1e6132f7ed085cc2008ba633319b8de
Deleted: sha256:35b18c33ea2c3dc9218d64da8b3fa4b0fea25a5ea8dae8ec0d54dfc37783b4be
Deleted: sha256:abf90ac5070dfe690ab23609306b9ab63bfd00a38aadbad4415d7178dd40bce6
Deleted: sha256:dfcd88be4a69e19a5e6091fc0acebeba88279223ccfa57ff8acc2984d205f08a
Deleted: sha256:6c8c74d126817448d832e2aa7fc14c6214561098d706de3b3828df177d7518d8
Deleted: sha256:0e44848239f4fc760563bfe6ab6c900b80d036501b790731c17b14bfcba03f69
Deleted: sha256:88041916755ecb35bdb62d01679d31566908322421f6b1c207732eb1add4d7c2
Deleted: sha256:f645a1b52d98d82f65adf91f047ea37bfcc6f18a07ae6e3404da1fbd5631e133
Deleted: sha256:9625d0c832a89e49f415053ae919e9a83fcbc3402d776d6a151f5f277ed1a301
Deleted: sha256:83a149967f22272fef8db5124377d30d41e701f57e3fb5e64292b05d46a11868
Deleted: sha256:2033b6bb98b654ca1c2115bf2a1e3d2d81238a889e50f1f7a2cae098ab629417
Deleted: sha256:aac6c4c894042dc7f25bacf0d1550ad0b5e3616e8c2374aa848072d0230bf103
Deleted: sha256:92d22291b13ec8c2704e8cbe66dc0042590ffd346ec3af45e681acda5decbb53
Deleted: sha256:65e7f5c80092533a2bb350593831c8fd4da37a4fb552f08f68c35377e9913b2b
Deleted: sha256:750f2f233e292b282b6039dd0cf5b28ab4765e1f816e3b9ccdd64c93607176d3
Deleted: sha256:ea64a0f1ffd24a6dedae45c90c021683552fe30f35e4662192ae64d1f6cd09c9
Deleted: sha256:6ed6b3eacf4b1079e9d74d9c00e3edd404102c7df7b99f31e9e200a8b952a4e8
Deleted: sha256:c45239cbf0d78a0b1907b05a57c0036e374a70edb175e33bff5e2b14569eaab4
Deleted: sha256:7a2f3f240f75e71686213e03f754c3dd21a7abb3fb2051ddc038afe6e0dff1b8
Deleted: sha256:cdff34fae6a7c9fad6271c1c87f8b1efec478f028e6fdbe57966ad4bfca6d986
Deleted: sha256:1c55b6a07cb5b46ea8b5157387d9633dd80ed902a5c7cdf106147dd8762a0911
Deleted: sha256:2d4061f3818dd57bd6fbd7169ef89073d0e23def0a273969fcdbaf15b7bf3ad5
Deleted: sha256:2adcc63736bbfc65ce2c9fbc264739feec141ccc7cfcff029315be7f9d73c956
Deleted: sha256:6dd6f3f9fd0272db8dcd01b9997f883fb91250e11776771f4b7ae7215595b197
WARNING: Successfully resolved tag to sha256, but it is recommended to use sha256 directly.
Tag: [us.gcr.io/apache-beam-testing/java-postcommit-it/java:20221227215743]
- referencing digest: [us.gcr.io/apache-beam-testing/java-postcommit-it/java@sha256:9a5d77a39bd42788083bd8845b76508abdbff7bee605c216e2af39e71dfa45f5]
Deleted [[us.gcr.io/apache-beam-testing/java-postcommit-it/java:20221227215743] (referencing [us.gcr.io/apache-beam-testing/java-postcommit-it/java@sha256:9a5d77a39bd42788083bd8845b76508abdbff7bee605c216e2af39e71dfa45f5])].
Removing untagged image us.gcr.io/apache-beam-testing/java-postcommit-it/java@sha256:9a5d77a39bd42788083bd8845b76508abdbff7bee605c216e2af39e71dfa45f5
Digests:
- us.gcr.io/apache-beam-testing/java-postcommit-it/java@sha256:9a5d77a39bd42788083bd8845b76508abdbff7bee605c216e2af39e71dfa45f5
Deleted [us.gcr.io/apache-beam-testing/java-postcommit-it/java@sha256:9a5d77a39bd42788083bd8845b76508abdbff7bee605c216e2af39e71dfa45f5].
FAILURE: Build failed with an exception.
* What went wrong:
Execution failed for task ':runners:google-cloud-dataflow-java:googleCloudPlatformRunnerV2IntegrationTest'.
> There were failing tests. See the report at: file://<https://ci-beam.apache.org/job/beam_PostCommit_Java_DataflowV2/ws/src/runners/google-cloud-dataflow-java/build/reports/tests/googleCloudPlatformRunnerV2IntegrationTest/index.html>
* Try:
> Run with --stacktrace option to get the stack trace.
> Run with --info or --debug option to get more log output.
* Get more help at https://help.gradle.org
Deprecated Gradle features were used in this build, making it incompatible with Gradle 8.0.
You can use '--warning-mode all' to show the individual deprecation warnings and determine if they come from your own scripts or plugins.
See https://docs.gradle.org/7.5.1/userguide/command_line_interface.html#sec:command_line_warnings
Execution optimizations have been disabled for 1 invalid unit(s) of work during this build to ensure correctness.
Please consult deprecation warnings for more details.
BUILD FAILED in 3h 25m 35s
145 actionable tasks: 93 executed, 48 from cache, 4 up-to-date
Publishing build scan...
https://gradle.com/s/avvx63brgjcg2
Build step 'Invoke Gradle script' changed build result to FAILURE
Build step 'Invoke Gradle script' marked build as failure
---------------------------------------------------------------------
To unsubscribe, e-mail: builds-unsubscribe@beam.apache.org
For additional commands, e-mail: builds-help@beam.apache.org
Build failed in Jenkins: beam_PostCommit_Java_DataflowV2 #2489
Posted by Apache Jenkins Server <je...@builds.apache.org>.
See <https://ci-beam.apache.org/job/beam_PostCommit_Java_DataflowV2/2489/display/redirect?page=changes>
Changes:
[noreply] [Playground] Python multifile examples (#24751)
[noreply] [CdapIO] Complete examples for CDAP Salesforce plugins (#24567)
------------------------------------------
[...truncated 55.91 KB...]
Using cached tenacity-5.1.5-py2.py3-none-any.whl (34 kB)
Collecting soupsieve>1.2
Using cached soupsieve-2.3.2.post1-py3-none-any.whl (37 kB)
Collecting six>=1.9.0
Using cached six-1.16.0-py2.py3-none-any.whl (11 kB)
Installing collected packages: soupsieve, six, pyyaml, tenacity, beautifulsoup4
Successfully installed beautifulsoup4-4.11.1 pyyaml-5.4.1 six-1.16.0 soupsieve-2.3.2.post1 tenacity-5.1.5
Executing python <https://ci-beam.apache.org/job/beam_PostCommit_Java_DataflowV2/ws/src/sdks/java/container/license_scripts/pull_licenses_java.py> --license_index=<https://ci-beam.apache.org/job/beam_PostCommit_Java_DataflowV2/ws/src/sdks/java/container/build/reports/dependency-license/index.json> --output_dir=<https://ci-beam.apache.org/job/beam_PostCommit_Java_DataflowV2/ws/src/sdks/java/container/build/target/java_third_party_licenses> --dep_url_yaml=<https://ci-beam.apache.org/job/beam_PostCommit_Java_DataflowV2/ws/src/sdks/java/container/license_scripts/dep_urls_java.yaml> --manual_license_path=<https://ci-beam.apache.org/job/beam_PostCommit_Java_DataflowV2/ws/src/sdks/java/container/license_scripts/manual_licenses>
INFO:root:Pulling license for 235 dependencies using 16 threads.
INFO:root:Replaced local file URL with file://<https://ci-beam.apache.org/job/beam_PostCommit_Java_DataflowV2/ws/src/sdks/java/container/license_scripts/manual_licenses/xz/COPYING> for xz-1.5
INFO:root:pull_licenses_java.py succeed. It took 2.403656 seconds with 16 threads.
Copying licenses from <https://ci-beam.apache.org/job/beam_PostCommit_Java_DataflowV2/ws/src/sdks/java/container/build/target/java_third_party_licenses> to <https://ci-beam.apache.org/job/beam_PostCommit_Java_DataflowV2/ws/src/sdks/java/container/build/target/third_party_licenses.>
Finished license_scripts.sh
> Task :sdks:java:container:goPrepare UP-TO-DATE
> Task :sdks:java:container:java8:copyJavaThirdPartyLicenses
> Task :sdks:java:container:goBuild
/home/jenkins/go/bin/go1.19.3 build -o ./build/target/linux_amd64/boot boot.go boot_test.go
> Task :sdks:java:container:java8:copySdkHarnessLauncher
Execution optimizations have been disabled for task ':sdks:java:container:java8:copySdkHarnessLauncher' to ensure correctness due to the following reasons:
- Gradle detected a problem with the following location: '<https://ci-beam.apache.org/job/beam_PostCommit_Java_DataflowV2/ws/src/sdks/java/container/build/target'.> Reason: Task ':sdks:java:container:java8:copySdkHarnessLauncher' uses this output of task ':sdks:java:container:downloadCloudProfilerAgent' without declaring an explicit or implicit dependency. This can lead to incorrect results being produced, depending on what order the tasks are executed. Please refer to https://docs.gradle.org/7.5.1/userguide/validation_problems.html#implicit_dependency for more details about this problem.
- Gradle detected a problem with the following location: '<https://ci-beam.apache.org/job/beam_PostCommit_Java_DataflowV2/ws/src/sdks/java/container/build/target'.> Reason: Task ':sdks:java:container:java8:copySdkHarnessLauncher' uses this output of task ':sdks:java:container:pullLicenses' without declaring an explicit or implicit dependency. This can lead to incorrect results being produced, depending on what order the tasks are executed. Please refer to https://docs.gradle.org/7.5.1/userguide/validation_problems.html#implicit_dependency for more details about this problem.
> Task :release:go-licenses:java:dockerRun
go: downloading github.com/golang/protobuf v1.5.2
go: downloading google.golang.org/grpc v1.50.1
go: downloading google.golang.org/protobuf v1.28.1
go: downloading golang.org/x/sys v0.0.0-20220728004956-3c1f35247d10
go: downloading golang.org/x/net v0.0.0-20221012135044-0b7e1fb9d458
go: downloading google.golang.org/genproto v0.0.0-20221010155953-15ba04fc1c0e
go: added github.com/apache/beam/sdks/v2 v2.43.0
go: added github.com/golang/protobuf v1.5.2
go: added golang.org/x/net v0.0.0-20221012135044-0b7e1fb9d458
go: added golang.org/x/sys v0.0.0-20220728004956-3c1f35247d10
go: added golang.org/x/text v0.4.0
go: added google.golang.org/genproto v0.0.0-20221010155953-15ba04fc1c0e
go: added google.golang.org/grpc v1.50.1
go: added google.golang.org/protobuf v1.28.1
+ go-licenses save github.com/apache/beam/sdks/v2/java/container --save_path=/output/licenses
W1227 15:59:04.854053 40 library.go:101] "golang.org/x/sys/unix" contains non-Go code that can't be inspected for further dependencies:
/go/pkg/mod/golang.org/x/sys@v0.0.0-20220728004956-3c1f35247d10/unix/asm_linux_amd64.s
+ go-licenses csv github.com/apache/beam/sdks/v2/java/container
+ tee /output/licenses/list.csv
W1227 15:59:09.939549 86 library.go:101] "golang.org/x/sys/unix" contains non-Go code that can't be inspected for further dependencies:
/go/pkg/mod/golang.org/x/sys@v0.0.0-20220728004956-3c1f35247d10/unix/asm_linux_amd64.s
github.com/apache/beam/sdks/v2/go/pkg/beam,https://github.com/apache/beam/blob/sdks/v2.43.0/sdks/go/README.md,Apache-2.0
github.com/apache/beam/sdks/v2/java/container,https://github.com/apache/beam/blob/sdks/v2.43.0/sdks/LICENSE,Apache-2.0
github.com/golang/protobuf,https://github.com/golang/protobuf/blob/v1.5.2/LICENSE,BSD-3-Clause
golang.org/x/net,https://cs.opensource.google/go/x/net/+/0b7e1fb9:LICENSE,BSD-3-Clause
golang.org/x/sys,https://cs.opensource.google/go/x/sys/+/3c1f3524:LICENSE,BSD-3-Clause
golang.org/x/text,https://cs.opensource.google/go/x/text/+/v0.4.0:LICENSE,BSD-3-Clause
google.golang.org/genproto/googleapis/rpc/status,https://github.com/googleapis/go-genproto/blob/15ba04fc1c0e/LICENSE,Apache-2.0
google.golang.org/grpc,https://github.com/grpc/grpc-go/blob/v1.50.1/LICENSE,Apache-2.0
google.golang.org/protobuf,https://github.com/protocolbuffers/protobuf-go/blob/v1.28.1/LICENSE,BSD-3-Clause
+ chmod -R a+w /output/licenses
> Task :release:go-licenses:java:createLicenses
> Task :sdks:java:container:java8:copyGolangLicenses
> Task :sdks:java:container:java8:dockerPrepare
> Task :sdks:java:container:java8:docker
> Task :runners:google-cloud-dataflow-java:buildAndPushDockerJavaContainer
WARNING: `gcloud docker` will not be supported for Docker client versions above 18.03.
As an alternative, use `gcloud auth configure-docker` to configure `docker` to
use `gcloud` as a credential helper, then use `docker` as you would for non-GCR
registries, e.g. `docker pull gcr.io/project-id/my-image`. Add
`--verbosity=error` to silence this warning: `gcloud docker
--verbosity=error -- pull gcr.io/project-id/my-image`.
See: https://cloud.google.com/container-registry/docs/support/deprecation-notices#gcloud-docker
The push refers to repository [us.gcr.io/apache-beam-testing/java-postcommit-it/java]
e7ab606e0376: Preparing
f11911945d44: Preparing
cdc2036c3a93: Preparing
8edafc9af5e3: Preparing
5f5c0a7b0dd1: Preparing
f1c19dd8c5dc: Preparing
1a97612251bb: Preparing
a2a603ffc061: Preparing
15636f5192df: Preparing
d8d0620f3b87: Preparing
f29f39fb4c46: Preparing
a78eb74835a5: Preparing
160b02b999ad: Preparing
d27cba4db934: Preparing
4c8109e82679: Preparing
6b5aaff44254: Preparing
53a0b163e995: Preparing
b626401ef603: Preparing
9b55156abf26: Preparing
293d5db30c9f: Preparing
03127cdb479b: Preparing
9c742cd6c7a5: Preparing
f1c19dd8c5dc: Waiting
1a97612251bb: Waiting
a2a603ffc061: Waiting
15636f5192df: Waiting
53a0b163e995: Waiting
d8d0620f3b87: Waiting
f29f39fb4c46: Waiting
b626401ef603: Waiting
9b55156abf26: Waiting
a78eb74835a5: Waiting
9c742cd6c7a5: Waiting
293d5db30c9f: Waiting
160b02b999ad: Waiting
03127cdb479b: Waiting
d27cba4db934: Waiting
5f5c0a7b0dd1: Pushed
e7ab606e0376: Pushed
cdc2036c3a93: Pushed
f11911945d44: Pushed
8edafc9af5e3: Pushed
1a97612251bb: Pushed
a2a603ffc061: Pushed
d8d0620f3b87: Pushed
f1c19dd8c5dc: Pushed
15636f5192df: Pushed
a78eb74835a5: Pushed
6b5aaff44254: Layer already exists
f29f39fb4c46: Pushed
53a0b163e995: Layer already exists
b626401ef603: Layer already exists
9b55156abf26: Layer already exists
293d5db30c9f: Layer already exists
03127cdb479b: Layer already exists
9c742cd6c7a5: Layer already exists
4c8109e82679: Pushed
160b02b999ad: Pushed
d27cba4db934: Pushed
20221227155749: digest: sha256:6a0e2bcacbb6bfec0dc8d9e6343cda398186626a71f55aab009a60e151a877ec size: 4934
> Task :runners:google-cloud-dataflow-java:coreSDKJavaRunnerV2IntegrationTest NO-SOURCE
> Task :runners:google-cloud-dataflow-java:examplesJavaRunnerV2IntegrationTest
***********************************************************
***********************************************************
**********************Set Up Pubsub************************
The Pub/Sub topic has been set up for this example: projects/apache-beam-testing/topics/testpipeline-jenkins-1227160103-d831256b
The Pub/Sub subscription has been set up for this example: projects/apache-beam-testing/subscriptions/testpipeline-jenkins-1227160103-d831256b
*************************Tear Down*************************
The Pub/Sub topic has been deleted: projects/apache-beam-testing/topics/testpipeline-jenkins-1227160103-d831256b
The Pub/Sub subscription has been deleted: projects/apache-beam-testing/subscriptions/testpipeline-jenkins-1227160103-d831256b
***********************************************************
***********************************************************
***********************************************************
***********************************************************
**********************Set Up Pubsub************************
The Pub/Sub topic has been set up for this example: projects/apache-beam-testing/topics/testpipeline-jenkins-1227160103-728b3b11
The Pub/Sub subscription has been set up for this example: projects/apache-beam-testing/subscriptions/testpipeline-jenkins-1227160103-728b3b11
*************************Tear Down*************************
The Pub/Sub topic has been deleted: projects/apache-beam-testing/topics/testpipeline-jenkins-1227160103-728b3b11
The Pub/Sub subscription has been deleted: projects/apache-beam-testing/subscriptions/testpipeline-jenkins-1227160103-728b3b11
***********************************************************
***********************************************************
> Task :runners:google-cloud-dataflow-java:googleCloudPlatformRunnerV2IntegrationTest
org.apache.beam.sdk.io.gcp.pubsub.PubsubSchemaIT > classMethod FAILED
java.nio.file.NoSuchFileException at PubsubSchemaIT.java:85
org.apache.beam.sdk.io.gcp.pubsub.PubsubSchemaIT > classMethod FAILED
io.grpc.StatusRuntimeException at PubsubSchemaIT.java:96
81 tests completed, 2 failed, 2 skipped
> Task :runners:google-cloud-dataflow-java:googleCloudPlatformRunnerV2IntegrationTest FAILED
> Task :runners:google-cloud-dataflow-java:cleanUpDockerJavaImages
Untagged: us.gcr.io/apache-beam-testing/java-postcommit-it/java:20221227155749
Untagged: us.gcr.io/apache-beam-testing/java-postcommit-it/java@sha256:6a0e2bcacbb6bfec0dc8d9e6343cda398186626a71f55aab009a60e151a877ec
Deleted: sha256:8692c40c0c8ad29fa19cf9bcee8c9cc4d958a891a2bcb7b9d4f4d98c99875c18
Deleted: sha256:4a6ee1ef30bcd0a8b5bda11febeea91f7b6cd516ecf3d1873b273fc63b41c006
Deleted: sha256:e74ab9aab1c08826a601d88c044890b6e09b42980e994c38ad6edcab158706c2
Deleted: sha256:401d0873e6beaea4ed4cb46e8ba9086682f55d1781f220269f79a63043247b2a
Deleted: sha256:8226654e00eb101fcd622b5d65f999f9252e83bb44f2954af7a9cae728f8d550
Deleted: sha256:c45502dba88c5c183f20b8bdb70e9e2308603c01380206a311b8f7733d6abeef
Deleted: sha256:66f9448bcb8a34e430107c2baa3334b9a94a2e4ce2a68273ffa42426be6d828d
Deleted: sha256:ab3565c513e1c60dfd963367beb38a3cef91b8dff10dbbe081ba33d9f5e575d1
Deleted: sha256:a658d69461849c6a7fedf4923633e2c7d701d763c9a1c436bb4e0dba0201b8c2
Deleted: sha256:8912a586fc986084c8d818c0a1cb7e47ecdc0c0d076f4beb2d542c2b057b2649
Deleted: sha256:4c8e9bafd510d3b18799a63868096718c8d62f0c60130fb7989f2b691bec48b4
Deleted: sha256:82a8a5e4497791359d6600f7a5affd7d08fb7cd001fe47d68269b0998371d221
Deleted: sha256:9cd211a3c98ea27ecd0e7f5eea51e8f40bc0138f02c8cf53d77a8c10c8fa602e
Deleted: sha256:7d6baccb42a53a4dcc3bfe3ff69b5eedb3df2b83dc0bdfe86f0874d8647f6cc7
Deleted: sha256:5bc119fbb5260d5a7004c8d3e4fe31314f7beca7ff5a6f414d887c531d36f679
Deleted: sha256:c6f95339a40373571ebfb49a19d26a2b356e8659218722cc1b128df2152c981d
Deleted: sha256:6a97c60fead732236ae1770e0d524b38587ac07148474fe4f17845cf82853361
Deleted: sha256:3252d898aadee17a46d43130cb4ac2a2344a5f38ad5d59063ce45eabf9b10c0b
Deleted: sha256:1c01414126092767c89fd64178ebd6ba9cab59b713dd6e3d0699232198a5762e
Deleted: sha256:6c86f8809a194220085061e8d14c608470f4e6aedc37ef7b9467049bd24f9f96
Deleted: sha256:0cb9469f0236a4693b8f94ab28c46652343d1660d076ab9cc98e39efe2551436
Deleted: sha256:35a268d490e5b3d8b506da3303a957837433ca775674458a7845b4030b9238fd
Deleted: sha256:cdae58a7b7d96c2a7a41c424c8d07337130eca5a4773c329943f05c9fe1d116b
Deleted: sha256:49d69a2d6d75a4479a7849adfe4619097d31cfd865cfd44e302d13148524e176
Deleted: sha256:85a8bfe14ab80b39b11819f81f8b5e7287a9a3fbb7779aff9a3c2c6596ebfafb
Deleted: sha256:772b827d36b41bc22a0e0863c6af7ab2ae44512c7e04f8290a6312e39d305346
Deleted: sha256:1a162badd537223702872d8c1401ede273e0d4b6466f88560e89f9725fb93c30
Deleted: sha256:7e05b0f39eecf0f9626aee3c2d6bcf71ed51f3d41233e03044ab0e18e714e840
Deleted: sha256:0e1df5f705d9e7df6d4cdb3915f7d4834ad5b719ae7c09a33c7485763433c306
Deleted: sha256:654d9d7ca2f5bb84353a6ad44b666e67830f64fc85ef919aebecfe1bf289519d
Deleted: sha256:b19c2964de453b019df4ffa58117c904b611d0f2022d778640dbc3d19147f6dd
Deleted: sha256:0a568c16c51c8409e5472de6c89a7318b7ef7f332cb57b15e2fcc1f02c9acfee
Deleted: sha256:2aa9da3c51294a5ca4283b33edd09012e7320d568e4cae6c5adeea28dd839f26
Deleted: sha256:8079ca044810ace55b5ad7eb0e22a5458b23a4c52154a1b04ca1360f6010dbd2
WARNING: Successfully resolved tag to sha256, but it is recommended to use sha256 directly.
Tag: [us.gcr.io/apache-beam-testing/java-postcommit-it/java:20221227155749]
- referencing digest: [us.gcr.io/apache-beam-testing/java-postcommit-it/java@sha256:6a0e2bcacbb6bfec0dc8d9e6343cda398186626a71f55aab009a60e151a877ec]
Deleted [[us.gcr.io/apache-beam-testing/java-postcommit-it/java:20221227155749] (referencing [us.gcr.io/apache-beam-testing/java-postcommit-it/java@sha256:6a0e2bcacbb6bfec0dc8d9e6343cda398186626a71f55aab009a60e151a877ec])].
Removing untagged image us.gcr.io/apache-beam-testing/java-postcommit-it/java@sha256:6a0e2bcacbb6bfec0dc8d9e6343cda398186626a71f55aab009a60e151a877ec
Digests:
- us.gcr.io/apache-beam-testing/java-postcommit-it/java@sha256:6a0e2bcacbb6bfec0dc8d9e6343cda398186626a71f55aab009a60e151a877ec
Deleted [us.gcr.io/apache-beam-testing/java-postcommit-it/java@sha256:6a0e2bcacbb6bfec0dc8d9e6343cda398186626a71f55aab009a60e151a877ec].
FAILURE: Build failed with an exception.
* What went wrong:
Execution failed for task ':runners:google-cloud-dataflow-java:googleCloudPlatformRunnerV2IntegrationTest'.
> There were failing tests. See the report at: file://<https://ci-beam.apache.org/job/beam_PostCommit_Java_DataflowV2/ws/src/runners/google-cloud-dataflow-java/build/reports/tests/googleCloudPlatformRunnerV2IntegrationTest/index.html>
* Try:
> Run with --stacktrace option to get the stack trace.
> Run with --info or --debug option to get more log output.
* Get more help at https://help.gradle.org
Deprecated Gradle features were used in this build, making it incompatible with Gradle 8.0.
You can use '--warning-mode all' to show the individual deprecation warnings and determine if they come from your own scripts or plugins.
See https://docs.gradle.org/7.5.1/userguide/command_line_interface.html#sec:command_line_warnings
Execution optimizations have been disabled for 1 invalid unit(s) of work during this build to ensure correctness.
Please consult deprecation warnings for more details.
BUILD FAILED in 3h 25m 44s
145 actionable tasks: 93 executed, 48 from cache, 4 up-to-date
Publishing build scan...
https://gradle.com/s/cu3yucwpltt5u
Build step 'Invoke Gradle script' changed build result to FAILURE
Build step 'Invoke Gradle script' marked build as failure
---------------------------------------------------------------------
To unsubscribe, e-mail: builds-unsubscribe@beam.apache.org
For additional commands, e-mail: builds-help@beam.apache.org
Build failed in Jenkins: beam_PostCommit_Java_DataflowV2 #2488
Posted by Apache Jenkins Server <je...@builds.apache.org>.
See <https://ci-beam.apache.org/job/beam_PostCommit_Java_DataflowV2/2488/display/redirect>
Changes:
------------------------------------------
[...truncated 55.44 KB...]
Using cached tenacity-5.1.5-py2.py3-none-any.whl (34 kB)
Collecting soupsieve>1.2
Using cached soupsieve-2.3.2.post1-py3-none-any.whl (37 kB)
Collecting six>=1.9.0
Using cached six-1.16.0-py2.py3-none-any.whl (11 kB)
Installing collected packages: soupsieve, six, pyyaml, tenacity, beautifulsoup4
Successfully installed beautifulsoup4-4.11.1 pyyaml-5.4.1 six-1.16.0 soupsieve-2.3.2.post1 tenacity-5.1.5
Executing python <https://ci-beam.apache.org/job/beam_PostCommit_Java_DataflowV2/ws/src/sdks/java/container/license_scripts/pull_licenses_java.py> --license_index=<https://ci-beam.apache.org/job/beam_PostCommit_Java_DataflowV2/ws/src/sdks/java/container/build/reports/dependency-license/index.json> --output_dir=<https://ci-beam.apache.org/job/beam_PostCommit_Java_DataflowV2/ws/src/sdks/java/container/build/target/java_third_party_licenses> --dep_url_yaml=<https://ci-beam.apache.org/job/beam_PostCommit_Java_DataflowV2/ws/src/sdks/java/container/license_scripts/dep_urls_java.yaml> --manual_license_path=<https://ci-beam.apache.org/job/beam_PostCommit_Java_DataflowV2/ws/src/sdks/java/container/license_scripts/manual_licenses>
INFO:root:Pulling license for 235 dependencies using 16 threads.
INFO:root:Replaced local file URL with file://<https://ci-beam.apache.org/job/beam_PostCommit_Java_DataflowV2/ws/src/sdks/java/container/license_scripts/manual_licenses/xz/COPYING> for xz-1.5
INFO:root:pull_licenses_java.py succeed. It took 2.157507 seconds with 16 threads.
Copying licenses from <https://ci-beam.apache.org/job/beam_PostCommit_Java_DataflowV2/ws/src/sdks/java/container/build/target/java_third_party_licenses> to <https://ci-beam.apache.org/job/beam_PostCommit_Java_DataflowV2/ws/src/sdks/java/container/build/target/third_party_licenses.>
Finished license_scripts.sh
> Task :sdks:java:container:goPrepare UP-TO-DATE
> Task :sdks:java:container:java8:copyJavaThirdPartyLicenses
> Task :sdks:java:container:goBuild
/home/jenkins/go/bin/go1.19.3 build -o ./build/target/linux_amd64/boot boot.go boot_test.go
> Task :sdks:java:container:java8:copySdkHarnessLauncher
Execution optimizations have been disabled for task ':sdks:java:container:java8:copySdkHarnessLauncher' to ensure correctness due to the following reasons:
- Gradle detected a problem with the following location: '<https://ci-beam.apache.org/job/beam_PostCommit_Java_DataflowV2/ws/src/sdks/java/container/build/target'.> Reason: Task ':sdks:java:container:java8:copySdkHarnessLauncher' uses this output of task ':sdks:java:container:downloadCloudProfilerAgent' without declaring an explicit or implicit dependency. This can lead to incorrect results being produced, depending on what order the tasks are executed. Please refer to https://docs.gradle.org/7.5.1/userguide/validation_problems.html#implicit_dependency for more details about this problem.
- Gradle detected a problem with the following location: '<https://ci-beam.apache.org/job/beam_PostCommit_Java_DataflowV2/ws/src/sdks/java/container/build/target'.> Reason: Task ':sdks:java:container:java8:copySdkHarnessLauncher' uses this output of task ':sdks:java:container:pullLicenses' without declaring an explicit or implicit dependency. This can lead to incorrect results being produced, depending on what order the tasks are executed. Please refer to https://docs.gradle.org/7.5.1/userguide/validation_problems.html#implicit_dependency for more details about this problem.
> Task :release:go-licenses:java:dockerRun
go: downloading github.com/golang/protobuf v1.5.2
go: downloading golang.org/x/sys v0.0.0-20220728004956-3c1f35247d10
go: downloading google.golang.org/grpc v1.50.1
go: downloading google.golang.org/protobuf v1.28.1
go: downloading golang.org/x/net v0.0.0-20221012135044-0b7e1fb9d458
go: downloading google.golang.org/genproto v0.0.0-20221010155953-15ba04fc1c0e
go: added github.com/apache/beam/sdks/v2 v2.43.0
go: added github.com/golang/protobuf v1.5.2
go: added golang.org/x/net v0.0.0-20221012135044-0b7e1fb9d458
go: added golang.org/x/sys v0.0.0-20220728004956-3c1f35247d10
go: added golang.org/x/text v0.4.0
go: added google.golang.org/genproto v0.0.0-20221010155953-15ba04fc1c0e
go: added google.golang.org/grpc v1.50.1
go: added google.golang.org/protobuf v1.28.1
+ go-licenses save github.com/apache/beam/sdks/v2/java/container --save_path=/output/licenses
W1227 09:58:51.504588 37 library.go:101] "golang.org/x/sys/unix" contains non-Go code that can't be inspected for further dependencies:
/go/pkg/mod/golang.org/x/sys@v0.0.0-20220728004956-3c1f35247d10/unix/asm_linux_amd64.s
+ go-licenses csv github.com/apache/beam/sdks/v2/java/container
+ tee /output/licenses/list.csv
W1227 09:58:55.480018 88 library.go:101] "golang.org/x/sys/unix" contains non-Go code that can't be inspected for further dependencies:
/go/pkg/mod/golang.org/x/sys@v0.0.0-20220728004956-3c1f35247d10/unix/asm_linux_amd64.s
github.com/apache/beam/sdks/v2/go/pkg/beam,https://github.com/apache/beam/blob/sdks/v2.43.0/sdks/go/README.md,Apache-2.0
github.com/apache/beam/sdks/v2/java/container,https://github.com/apache/beam/blob/sdks/v2.43.0/sdks/LICENSE,Apache-2.0
github.com/golang/protobuf,https://github.com/golang/protobuf/blob/v1.5.2/LICENSE,BSD-3-Clause
golang.org/x/net,https://cs.opensource.google/go/x/net/+/0b7e1fb9:LICENSE,BSD-3-Clause
golang.org/x/sys,https://cs.opensource.google/go/x/sys/+/3c1f3524:LICENSE,BSD-3-Clause
golang.org/x/text,https://cs.opensource.google/go/x/text/+/v0.4.0:LICENSE,BSD-3-Clause
google.golang.org/genproto/googleapis/rpc/status,https://github.com/googleapis/go-genproto/blob/15ba04fc1c0e/LICENSE,Apache-2.0
google.golang.org/grpc,https://github.com/grpc/grpc-go/blob/v1.50.1/LICENSE,Apache-2.0
google.golang.org/protobuf,https://github.com/protocolbuffers/protobuf-go/blob/v1.28.1/LICENSE,BSD-3-Clause
+ chmod -R a+w /output/licenses
> Task :release:go-licenses:java:createLicenses
> Task :sdks:java:container:java8:copyGolangLicenses
> Task :sdks:java:container:java8:dockerPrepare
> Task :sdks:java:container:java8:docker
> Task :runners:google-cloud-dataflow-java:buildAndPushDockerJavaContainer
WARNING: `gcloud docker` will not be supported for Docker client versions above 18.03.
As an alternative, use `gcloud auth configure-docker` to configure `docker` to
use `gcloud` as a credential helper, then use `docker` as you would for non-GCR
registries, e.g. `docker pull gcr.io/project-id/my-image`. Add
`--verbosity=error` to silence this warning: `gcloud docker
--verbosity=error -- pull gcr.io/project-id/my-image`.
See: https://cloud.google.com/container-registry/docs/support/deprecation-notices#gcloud-docker
The push refers to repository [us.gcr.io/apache-beam-testing/java-postcommit-it/java]
58dccd6e7b45: Preparing
012fc0b71853: Preparing
16af17e034da: Preparing
52a30ba3cd16: Preparing
b37ae2174ecd: Preparing
eb01fdf1c248: Preparing
38fa95720855: Preparing
b9787ffd9e76: Preparing
778eac71b884: Preparing
426bcf5d786e: Preparing
c49d01ad1d86: Preparing
67187c89017f: Preparing
0e0220bceae0: Preparing
953fb2a4b32c: Preparing
bff868ceb2da: Preparing
6b5aaff44254: Preparing
53a0b163e995: Preparing
b626401ef603: Preparing
9b55156abf26: Preparing
293d5db30c9f: Preparing
03127cdb479b: Preparing
9c742cd6c7a5: Preparing
eb01fdf1c248: Waiting
9b55156abf26: Waiting
bff868ceb2da: Waiting
c49d01ad1d86: Waiting
293d5db30c9f: Waiting
38fa95720855: Waiting
6b5aaff44254: Waiting
9c742cd6c7a5: Waiting
03127cdb479b: Waiting
67187c89017f: Waiting
b9787ffd9e76: Waiting
953fb2a4b32c: Waiting
b626401ef603: Waiting
0e0220bceae0: Waiting
778eac71b884: Waiting
16af17e034da: Pushed
52a30ba3cd16: Pushed
012fc0b71853: Pushed
b37ae2174ecd: Pushed
58dccd6e7b45: Pushed
38fa95720855: Pushed
b9787ffd9e76: Pushed
426bcf5d786e: Pushed
778eac71b884: Pushed
67187c89017f: Pushed
eb01fdf1c248: Pushed
c49d01ad1d86: Pushed
6b5aaff44254: Layer already exists
53a0b163e995: Layer already exists
b626401ef603: Layer already exists
9b55156abf26: Layer already exists
293d5db30c9f: Layer already exists
03127cdb479b: Layer already exists
9c742cd6c7a5: Layer already exists
0e0220bceae0: Pushed
953fb2a4b32c: Pushed
bff868ceb2da: Pushed
20221227095742: digest: sha256:660c38a98c611dc95417497c3aa6c1b2e1519628281d360cc8c14751e2107795 size: 4934
> Task :runners:google-cloud-dataflow-java:coreSDKJavaRunnerV2IntegrationTest NO-SOURCE
> Task :runners:google-cloud-dataflow-java:examplesJavaRunnerV2IntegrationTest
***********************************************************
***********************************************************
**********************Set Up Pubsub************************
The Pub/Sub topic has been set up for this example: projects/apache-beam-testing/topics/testpipeline-jenkins-1227095924-9a9f0fc6
The Pub/Sub subscription has been set up for this example: projects/apache-beam-testing/subscriptions/testpipeline-jenkins-1227095924-9a9f0fc6
*************************Tear Down*************************
The Pub/Sub topic has been deleted: projects/apache-beam-testing/topics/testpipeline-jenkins-1227095924-9a9f0fc6
The Pub/Sub subscription has been deleted: projects/apache-beam-testing/subscriptions/testpipeline-jenkins-1227095924-9a9f0fc6
***********************************************************
***********************************************************
***********************************************************
***********************************************************
**********************Set Up Pubsub************************
The Pub/Sub topic has been set up for this example: projects/apache-beam-testing/topics/testpipeline-jenkins-1227095924-7bc8f6d
The Pub/Sub subscription has been set up for this example: projects/apache-beam-testing/subscriptions/testpipeline-jenkins-1227095924-7bc8f6d
*************************Tear Down*************************
The Pub/Sub topic has been deleted: projects/apache-beam-testing/topics/testpipeline-jenkins-1227095924-7bc8f6d
The Pub/Sub subscription has been deleted: projects/apache-beam-testing/subscriptions/testpipeline-jenkins-1227095924-7bc8f6d
***********************************************************
***********************************************************
> Task :runners:google-cloud-dataflow-java:googleCloudPlatformRunnerV2IntegrationTest
org.apache.beam.sdk.io.gcp.pubsub.PubsubSchemaIT > classMethod FAILED
java.nio.file.NoSuchFileException at PubsubSchemaIT.java:85
org.apache.beam.sdk.io.gcp.pubsub.PubsubSchemaIT > classMethod FAILED
io.grpc.StatusRuntimeException at PubsubSchemaIT.java:96
81 tests completed, 2 failed, 2 skipped
> Task :runners:google-cloud-dataflow-java:googleCloudPlatformRunnerV2IntegrationTest FAILED
> Task :runners:google-cloud-dataflow-java:cleanUpDockerJavaImages
Untagged: us.gcr.io/apache-beam-testing/java-postcommit-it/java:20221227095742
Untagged: us.gcr.io/apache-beam-testing/java-postcommit-it/java@sha256:660c38a98c611dc95417497c3aa6c1b2e1519628281d360cc8c14751e2107795
Deleted: sha256:77aac6e56c9b23dfc44437057f51e3dd45e84c197fd191f5f61672485f50f0d0
Deleted: sha256:9dc10f54bf92836a55cbcdfb0151f1fb3ee70e520600290b04659260e331ad0b
Deleted: sha256:98ec8f4422d0e9084da68bd86275277e7d38c4b7d1fdf5a296558d990f201c4d
Deleted: sha256:276c5a4a68bcd622424e41ff1c9d322b987a56a54aee47c19ccae33791dfac5e
Deleted: sha256:96459f05e027791424181a7c3867a50984f242eff2a086b97c08a13138c4f4bc
Deleted: sha256:ac21df375679bd6d207ded4a2e72779020c5391de6100f5a7e8601e8f4d21f99
Deleted: sha256:fcf8fa4cdb606612593bd3f56494e96650aa576e8f4cd1c3b0d23d24ef9a3bf1
Deleted: sha256:d0cac854c39a72c65302efee9c6ceda1f1cf6d312bf34e12bd6fa2c5980b4007
Deleted: sha256:8adf3ce2460dba1804a0bb31c0604af9978fb14084073f5cec5183e6febd5fa9
Deleted: sha256:424ba818ffcc1f5c435c7f6d26c2e155dade6a54691c3eacde28b9c600794a72
Deleted: sha256:e90b78e00207272925be7374ad274c5a91a585ead1c339b805788f940371f9f8
Deleted: sha256:fc153f879110f8ba16fe2158fc6b06b7b5d9f83c2e6b870fbf4e942cb87821c1
Deleted: sha256:d7542f58fc662605bf236c8b14f0ec868a193dff03b7c3c7d31b95a26f8cf6ac
Deleted: sha256:abff988af48d0c020aaa5d3ff888ccaa750e6171686f1772c9f707f365651c5b
Deleted: sha256:714fec561c77db5746a0116a705b8c42f543820731ed6abb662988ed263d7713
Deleted: sha256:ca347b1bdf47c85bcd57be20ba3b2f82f8e824d2f6ecdd6257bae81fe0c7aae3
Deleted: sha256:83c8f3ad8f113acde04ecbe82abf8c93eb7a8cb624563bf720b44743ddadd977
Deleted: sha256:1cb198f8f20bb64130b160b16421c931ecdc936c49758884e0fe8df3549ecf48
Deleted: sha256:3732440e6e45bbf10886bc733560b0395291dbfaf96541605d16ce1b9abbf657
Deleted: sha256:498b66bbfba834ddb35821e4b32b67b266b80dbd3121ade407706ba245637022
Deleted: sha256:8d7b2524f59d63976c336390e2680ec98abb01aaaff0e955d8882afe6adcef32
Deleted: sha256:63bebbfcf896319f9117c7ec6b0248cc2b88f089d734d09dc9ecd169582a46d5
Deleted: sha256:19b04d38d4ccffb217ba2e3ddc6f5de445335d6faf0101136c5affe214c4bc89
Deleted: sha256:1a328c21c103dd746deae2d70c0303bd3327dd61d5f62e36c8ab363c7db75b28
Deleted: sha256:be41af558ff87ac30b384b3a5862c8266858ee284a014f85b2d50365720f92a3
Deleted: sha256:afdbf52831d3d55498e4712ccb079cacd883563016b836eb4dddf15a596bd8a6
Deleted: sha256:e14df4713e618e424b5d75d11e8be7e78b5ee77cdc1f7ac5c559da98b3e374af
Deleted: sha256:1334ba738c98ff0b01be52fea9d78d0e17e08cb9fbc3be24d4c1f1afe4eb0baa
Deleted: sha256:e824ed12f03ae29f64c33fb37fcbfbe5f4a4f8fb9a881c278c474292c8c64aff
Deleted: sha256:d0bdd98c403177d8568a6ac4d5ab8bfa941b0dfa4a7480fcd737b69db453ecbc
Deleted: sha256:57c5ce36bb7a59977a67ab92f3737e204bf6c71d0aee6a1e4d03928e120b95ca
Deleted: sha256:405b4b2f86105a140249e6d5d18acfa6c28477e0b35dca108dbdb548bc62e821
Deleted: sha256:5d3280dcecfb177d1f47a8ea6396cbdde818c1ee9086afeb9243044b8b9c1873
Deleted: sha256:8b5a218b86eefa188a6c68712c6fa4118238745c22118ddba74335d91c13cc7c
WARNING: Successfully resolved tag to sha256, but it is recommended to use sha256 directly.
Tag: [us.gcr.io/apache-beam-testing/java-postcommit-it/java:20221227095742]
- referencing digest: [us.gcr.io/apache-beam-testing/java-postcommit-it/java@sha256:660c38a98c611dc95417497c3aa6c1b2e1519628281d360cc8c14751e2107795]
Deleted [[us.gcr.io/apache-beam-testing/java-postcommit-it/java:20221227095742] (referencing [us.gcr.io/apache-beam-testing/java-postcommit-it/java@sha256:660c38a98c611dc95417497c3aa6c1b2e1519628281d360cc8c14751e2107795])].
Removing untagged image us.gcr.io/apache-beam-testing/java-postcommit-it/java@sha256:660c38a98c611dc95417497c3aa6c1b2e1519628281d360cc8c14751e2107795
Digests:
- us.gcr.io/apache-beam-testing/java-postcommit-it/java@sha256:660c38a98c611dc95417497c3aa6c1b2e1519628281d360cc8c14751e2107795
Deleted [us.gcr.io/apache-beam-testing/java-postcommit-it/java@sha256:660c38a98c611dc95417497c3aa6c1b2e1519628281d360cc8c14751e2107795].
FAILURE: Build failed with an exception.
* What went wrong:
Execution failed for task ':runners:google-cloud-dataflow-java:googleCloudPlatformRunnerV2IntegrationTest'.
> There were failing tests. See the report at: file://<https://ci-beam.apache.org/job/beam_PostCommit_Java_DataflowV2/ws/src/runners/google-cloud-dataflow-java/build/reports/tests/googleCloudPlatformRunnerV2IntegrationTest/index.html>
* Try:
> Run with --stacktrace option to get the stack trace.
> Run with --info or --debug option to get more log output.
* Get more help at https://help.gradle.org
Deprecated Gradle features were used in this build, making it incompatible with Gradle 8.0.
You can use '--warning-mode all' to show the individual deprecation warnings and determine if they come from your own scripts or plugins.
See https://docs.gradle.org/7.5.1/userguide/command_line_interface.html#sec:command_line_warnings
Execution optimizations have been disabled for 1 invalid unit(s) of work during this build to ensure correctness.
Please consult deprecation warnings for more details.
BUILD FAILED in 3h 21m 43s
145 actionable tasks: 93 executed, 48 from cache, 4 up-to-date
Publishing build scan...
https://gradle.com/s/kjch2gprqrwvw
Build step 'Invoke Gradle script' changed build result to FAILURE
Build step 'Invoke Gradle script' marked build as failure
---------------------------------------------------------------------
To unsubscribe, e-mail: builds-unsubscribe@beam.apache.org
For additional commands, e-mail: builds-help@beam.apache.org
Build failed in Jenkins: beam_PostCommit_Java_DataflowV2 #2487
Posted by Apache Jenkins Server <je...@builds.apache.org>.
See <https://ci-beam.apache.org/job/beam_PostCommit_Java_DataflowV2/2487/display/redirect?page=changes>
Changes:
[noreply] [BigQueryIO] Don't update schema of destination table when no schema is
------------------------------------------
[...truncated 52.25 KB...]
> Task :examples:java:compileTestJava FROM-CACHE
> Task :examples:java:testClasses
> Task :examples:java:testJar
> Task :sdks:java:container:pullLicenses
Collecting pip
Using cached pip-22.3.1-py3-none-any.whl (2.1 MB)
Collecting setuptools
Using cached setuptools-65.6.3-py3-none-any.whl (1.2 MB)
Collecting wheel
Using cached wheel-0.38.4-py3-none-any.whl (36 kB)
Installing collected packages: pip, setuptools, wheel
Attempting uninstall: pip
Found existing installation: pip 20.0.2
Uninstalling pip-20.0.2:
Successfully uninstalled pip-20.0.2
Attempting uninstall: setuptools
Found existing installation: setuptools 44.0.0
Uninstalling setuptools-44.0.0:
Successfully uninstalled setuptools-44.0.0
Successfully installed pip-22.3.1 setuptools-65.6.3 wheel-0.38.4
Collecting beautifulsoup4<5.0,>=4.9.0
Using cached beautifulsoup4-4.11.1-py3-none-any.whl (128 kB)
Collecting pyyaml<6.0.0,>=3.12
Using cached PyYAML-5.4.1-cp38-cp38-manylinux1_x86_64.whl (662 kB)
Collecting tenacity<6.0,>=5.0.2
Using cached tenacity-5.1.5-py2.py3-none-any.whl (34 kB)
Collecting soupsieve>1.2
Using cached soupsieve-2.3.2.post1-py3-none-any.whl (37 kB)
Collecting six>=1.9.0
Using cached six-1.16.0-py2.py3-none-any.whl (11 kB)
Installing collected packages: soupsieve, six, pyyaml, tenacity, beautifulsoup4
Successfully installed beautifulsoup4-4.11.1 pyyaml-5.4.1 six-1.16.0 soupsieve-2.3.2.post1 tenacity-5.1.5
Executing python <https://ci-beam.apache.org/job/beam_PostCommit_Java_DataflowV2/ws/src/sdks/java/container/license_scripts/pull_licenses_java.py> --license_index=<https://ci-beam.apache.org/job/beam_PostCommit_Java_DataflowV2/ws/src/sdks/java/container/build/reports/dependency-license/index.json> --output_dir=<https://ci-beam.apache.org/job/beam_PostCommit_Java_DataflowV2/ws/src/sdks/java/container/build/target/java_third_party_licenses> --dep_url_yaml=<https://ci-beam.apache.org/job/beam_PostCommit_Java_DataflowV2/ws/src/sdks/java/container/license_scripts/dep_urls_java.yaml> --manual_license_path=<https://ci-beam.apache.org/job/beam_PostCommit_Java_DataflowV2/ws/src/sdks/java/container/license_scripts/manual_licenses>
INFO:root:Pulling license for 235 dependencies using 16 threads.
INFO:root:Replaced local file URL with file://<https://ci-beam.apache.org/job/beam_PostCommit_Java_DataflowV2/ws/src/sdks/java/container/license_scripts/manual_licenses/xz/COPYING> for xz-1.5
INFO:root:pull_licenses_java.py succeed. It took 2.443261 seconds with 16 threads.
Copying licenses from <https://ci-beam.apache.org/job/beam_PostCommit_Java_DataflowV2/ws/src/sdks/java/container/build/target/java_third_party_licenses> to <https://ci-beam.apache.org/job/beam_PostCommit_Java_DataflowV2/ws/src/sdks/java/container/build/target/third_party_licenses.>
Finished license_scripts.sh
> Task :sdks:java:container:goPrepare UP-TO-DATE
> Task :sdks:java:container:java8:copyJavaThirdPartyLicenses
> Task :sdks:java:container:goBuild
/home/jenkins/go/bin/go1.19.3 build -o ./build/target/linux_amd64/boot boot.go boot_test.go
> Task :sdks:java:container:java8:copySdkHarnessLauncher
Execution optimizations have been disabled for task ':sdks:java:container:java8:copySdkHarnessLauncher' to ensure correctness due to the following reasons:
- Gradle detected a problem with the following location: '<https://ci-beam.apache.org/job/beam_PostCommit_Java_DataflowV2/ws/src/sdks/java/container/build/target'.> Reason: Task ':sdks:java:container:java8:copySdkHarnessLauncher' uses this output of task ':sdks:java:container:downloadCloudProfilerAgent' without declaring an explicit or implicit dependency. This can lead to incorrect results being produced, depending on what order the tasks are executed. Please refer to https://docs.gradle.org/7.5.1/userguide/validation_problems.html#implicit_dependency for more details about this problem.
- Gradle detected a problem with the following location: '<https://ci-beam.apache.org/job/beam_PostCommit_Java_DataflowV2/ws/src/sdks/java/container/build/target'.> Reason: Task ':sdks:java:container:java8:copySdkHarnessLauncher' uses this output of task ':sdks:java:container:pullLicenses' without declaring an explicit or implicit dependency. This can lead to incorrect results being produced, depending on what order the tasks are executed. Please refer to https://docs.gradle.org/7.5.1/userguide/validation_problems.html#implicit_dependency for more details about this problem.
> Task :sdks:java:io:google-cloud-platform:compileTestJava
Note: Some input files use or override a deprecated API.
Note: Recompile with -Xlint:deprecation for details.
Note: Some input files use unchecked or unsafe operations.
Note: Recompile with -Xlint:unchecked for details.
> Task :sdks:java:io:google-cloud-platform:testClasses
> Task :sdks:java:io:google-cloud-platform:testJar
> Task :release:go-licenses:java:dockerRun
go: downloading google.golang.org/grpc v1.50.1
go: downloading github.com/golang/protobuf v1.5.2
go: downloading google.golang.org/protobuf v1.28.1
go: downloading golang.org/x/sys v0.0.0-20220728004956-3c1f35247d10
go: downloading golang.org/x/net v0.0.0-20221012135044-0b7e1fb9d458
go: downloading google.golang.org/genproto v0.0.0-20221010155953-15ba04fc1c0e
go: added github.com/apache/beam/sdks/v2 v2.43.0
go: added github.com/golang/protobuf v1.5.2
go: added golang.org/x/net v0.0.0-20221012135044-0b7e1fb9d458
go: added golang.org/x/sys v0.0.0-20220728004956-3c1f35247d10
go: added golang.org/x/text v0.4.0
go: added google.golang.org/genproto v0.0.0-20221010155953-15ba04fc1c0e
go: added google.golang.org/grpc v1.50.1
go: added google.golang.org/protobuf v1.28.1
+ go-licenses save github.com/apache/beam/sdks/v2/java/container --save_path=/output/licenses
W1227 03:58:54.497583 35 library.go:101] "golang.org/x/sys/unix" contains non-Go code that can't be inspected for further dependencies:
/go/pkg/mod/golang.org/x/sys@v0.0.0-20220728004956-3c1f35247d10/unix/asm_linux_amd64.s
+ go-licenses csv github.com/apache/beam/sdks/v2/java/container
+ tee /output/licenses/list.csv
W1227 03:58:59.924015 79 library.go:101] "golang.org/x/sys/unix" contains non-Go code that can't be inspected for further dependencies:
/go/pkg/mod/golang.org/x/sys@v0.0.0-20220728004956-3c1f35247d10/unix/asm_linux_amd64.s
github.com/apache/beam/sdks/v2/go/pkg/beam,https://github.com/apache/beam/blob/sdks/v2.43.0/sdks/go/README.md,Apache-2.0
github.com/apache/beam/sdks/v2/java/container,https://github.com/apache/beam/blob/sdks/v2.43.0/sdks/LICENSE,Apache-2.0
github.com/golang/protobuf,https://github.com/golang/protobuf/blob/v1.5.2/LICENSE,BSD-3-Clause
golang.org/x/net,https://cs.opensource.google/go/x/net/+/0b7e1fb9:LICENSE,BSD-3-Clause
golang.org/x/sys,https://cs.opensource.google/go/x/sys/+/3c1f3524:LICENSE,BSD-3-Clause
golang.org/x/text,https://cs.opensource.google/go/x/text/+/v0.4.0:LICENSE,BSD-3-Clause
google.golang.org/genproto/googleapis/rpc/status,https://github.com/googleapis/go-genproto/blob/15ba04fc1c0e/LICENSE,Apache-2.0
google.golang.org/grpc,https://github.com/grpc/grpc-go/blob/v1.50.1/LICENSE,Apache-2.0
google.golang.org/protobuf,https://github.com/protocolbuffers/protobuf-go/blob/v1.28.1/LICENSE,BSD-3-Clause
+ chmod -R a+w /output/licenses
> Task :release:go-licenses:java:createLicenses
> Task :sdks:java:container:java8:copyGolangLicenses
> Task :sdks:java:container:java8:dockerPrepare
> Task :sdks:java:container:java8:docker
> Task :runners:google-cloud-dataflow-java:buildAndPushDockerJavaContainer
WARNING: `gcloud docker` will not be supported for Docker client versions above 18.03.
As an alternative, use `gcloud auth configure-docker` to configure `docker` to
use `gcloud` as a credential helper, then use `docker` as you would for non-GCR
registries, e.g. `docker pull gcr.io/project-id/my-image`. Add
`--verbosity=error` to silence this warning: `gcloud docker
--verbosity=error -- pull gcr.io/project-id/my-image`.
See: https://cloud.google.com/container-registry/docs/support/deprecation-notices#gcloud-docker
The push refers to repository [us.gcr.io/apache-beam-testing/java-postcommit-it/java]
db696752d5c7: Preparing
f7d6542dba17: Preparing
0ff35335295e: Preparing
3e9258183b17: Preparing
bc825d21fd78: Preparing
82947f518a28: Preparing
b6ae5f45e515: Preparing
ff78402dce17: Preparing
2476bdb667a1: Preparing
d0ffc6e006ac: Preparing
f096c35fb5bf: Preparing
b846d5342176: Preparing
bfb9b358712f: Preparing
e9a13679db55: Preparing
a1a8672fb9fc: Preparing
6b5aaff44254: Preparing
53a0b163e995: Preparing
b626401ef603: Preparing
9b55156abf26: Preparing
293d5db30c9f: Preparing
03127cdb479b: Preparing
9c742cd6c7a5: Preparing
b6ae5f45e515: Waiting
ff78402dce17: Waiting
82947f518a28: Waiting
6b5aaff44254: Waiting
293d5db30c9f: Waiting
bfb9b358712f: Waiting
03127cdb479b: Waiting
2476bdb667a1: Waiting
9c742cd6c7a5: Waiting
53a0b163e995: Waiting
9b55156abf26: Waiting
b626401ef603: Waiting
d0ffc6e006ac: Waiting
e9a13679db55: Waiting
bc825d21fd78: Pushed
0ff35335295e: Pushed
3e9258183b17: Pushed
f7d6542dba17: Pushed
db696752d5c7: Pushed
b6ae5f45e515: Pushed
ff78402dce17: Pushed
d0ffc6e006ac: Pushed
82947f518a28: Pushed
b846d5342176: Pushed
f096c35fb5bf: Pushed
2476bdb667a1: Pushed
6b5aaff44254: Layer already exists
b626401ef603: Layer already exists
53a0b163e995: Layer already exists
9b55156abf26: Layer already exists
293d5db30c9f: Layer already exists
03127cdb479b: Layer already exists
9c742cd6c7a5: Layer already exists
e9a13679db55: Pushed
a1a8672fb9fc: Pushed
bfb9b358712f: Pushed
20221227035742: digest: sha256:76b1f233bc9f5f450e48828d060254f6bda27f208a3a3bceb4bdf6aef9643155 size: 4934
> Task :runners:google-cloud-dataflow-java:coreSDKJavaRunnerV2IntegrationTest NO-SOURCE
> Task :runners:google-cloud-dataflow-java:examplesJavaRunnerV2IntegrationTest
***********************************************************
***********************************************************
**********************Set Up Pubsub************************
The Pub/Sub topic has been set up for this example: projects/apache-beam-testing/topics/testpipeline-jenkins-1227035943-898e6a9f
The Pub/Sub subscription has been set up for this example: projects/apache-beam-testing/subscriptions/testpipeline-jenkins-1227035943-898e6a9f
*************************Tear Down*************************
The Pub/Sub topic has been deleted: projects/apache-beam-testing/topics/testpipeline-jenkins-1227035943-898e6a9f
The Pub/Sub subscription has been deleted: projects/apache-beam-testing/subscriptions/testpipeline-jenkins-1227035943-898e6a9f
***********************************************************
***********************************************************
***********************************************************
***********************************************************
**********************Set Up Pubsub************************
The Pub/Sub topic has been set up for this example: projects/apache-beam-testing/topics/testpipeline-jenkins-1227035943-8d2c4270
The Pub/Sub subscription has been set up for this example: projects/apache-beam-testing/subscriptions/testpipeline-jenkins-1227035943-8d2c4270
*************************Tear Down*************************
The Pub/Sub topic has been deleted: projects/apache-beam-testing/topics/testpipeline-jenkins-1227035943-8d2c4270
The Pub/Sub subscription has been deleted: projects/apache-beam-testing/subscriptions/testpipeline-jenkins-1227035943-8d2c4270
***********************************************************
***********************************************************
> Task :runners:google-cloud-dataflow-java:googleCloudPlatformRunnerV2IntegrationTest
org.apache.beam.sdk.io.gcp.pubsub.PubsubSchemaIT > classMethod FAILED
java.nio.file.NoSuchFileException at PubsubSchemaIT.java:85
org.apache.beam.sdk.io.gcp.pubsub.PubsubSchemaIT > classMethod FAILED
io.grpc.StatusRuntimeException at PubsubSchemaIT.java:96
81 tests completed, 2 failed, 2 skipped
> Task :runners:google-cloud-dataflow-java:googleCloudPlatformRunnerV2IntegrationTest FAILED
> Task :runners:google-cloud-dataflow-java:cleanUpDockerJavaImages
Untagged: us.gcr.io/apache-beam-testing/java-postcommit-it/java:20221227035742
Untagged: us.gcr.io/apache-beam-testing/java-postcommit-it/java@sha256:76b1f233bc9f5f450e48828d060254f6bda27f208a3a3bceb4bdf6aef9643155
WARNING: Successfully resolved tag to sha256, but it is recommended to use sha256 directly.
Tag: [us.gcr.io/apache-beam-testing/java-postcommit-it/java:20221227035742]
- referencing digest: [us.gcr.io/apache-beam-testing/java-postcommit-it/java@sha256:76b1f233bc9f5f450e48828d060254f6bda27f208a3a3bceb4bdf6aef9643155]
Deleted [[us.gcr.io/apache-beam-testing/java-postcommit-it/java:20221227035742] (referencing [us.gcr.io/apache-beam-testing/java-postcommit-it/java@sha256:76b1f233bc9f5f450e48828d060254f6bda27f208a3a3bceb4bdf6aef9643155])].
Removing untagged image us.gcr.io/apache-beam-testing/java-postcommit-it/java@sha256:76b1f233bc9f5f450e48828d060254f6bda27f208a3a3bceb4bdf6aef9643155
Digests:
- us.gcr.io/apache-beam-testing/java-postcommit-it/java@sha256:76b1f233bc9f5f450e48828d060254f6bda27f208a3a3bceb4bdf6aef9643155
Deleted [us.gcr.io/apache-beam-testing/java-postcommit-it/java@sha256:76b1f233bc9f5f450e48828d060254f6bda27f208a3a3bceb4bdf6aef9643155].
FAILURE: Build failed with an exception.
* What went wrong:
Execution failed for task ':runners:google-cloud-dataflow-java:googleCloudPlatformRunnerV2IntegrationTest'.
> There were failing tests. See the report at: file://<https://ci-beam.apache.org/job/beam_PostCommit_Java_DataflowV2/ws/src/runners/google-cloud-dataflow-java/build/reports/tests/googleCloudPlatformRunnerV2IntegrationTest/index.html>
* Try:
> Run with --stacktrace option to get the stack trace.
> Run with --info or --debug option to get more log output.
* Get more help at https://help.gradle.org
Deprecated Gradle features were used in this build, making it incompatible with Gradle 8.0.
You can use '--warning-mode all' to show the individual deprecation warnings and determine if they come from your own scripts or plugins.
See https://docs.gradle.org/7.5.1/userguide/command_line_interface.html#sec:command_line_warnings
Execution optimizations have been disabled for 1 invalid unit(s) of work during this build to ensure correctness.
Please consult deprecation warnings for more details.
BUILD FAILED in 3h 24m 25s
145 actionable tasks: 94 executed, 47 from cache, 4 up-to-date
Publishing build scan...
https://gradle.com/s/vz6juyzxm7e6k
Build step 'Invoke Gradle script' changed build result to FAILURE
Build step 'Invoke Gradle script' marked build as failure
---------------------------------------------------------------------
To unsubscribe, e-mail: builds-unsubscribe@beam.apache.org
For additional commands, e-mail: builds-help@beam.apache.org
Build failed in Jenkins: beam_PostCommit_Java_DataflowV2 #2486
Posted by Apache Jenkins Server <je...@builds.apache.org>.
See <https://ci-beam.apache.org/job/beam_PostCommit_Java_DataflowV2/2486/display/redirect>
Changes:
------------------------------------------
[...truncated 53.15 KB...]
> Task :sdks:java:extensions:protobuf:testJar
> Task :examples:java:testJar
> Task :sdks:java:container:pullLicenses
Collecting pip
Using cached pip-22.3.1-py3-none-any.whl (2.1 MB)
> Task :sdks:java:io:google-cloud-platform:compileTestJava FROM-CACHE
> Task :sdks:java:io:google-cloud-platform:testClasses
> Task :sdks:java:io:google-cloud-platform:testJar
> Task :sdks:java:container:pullLicenses
Collecting setuptools
Using cached setuptools-65.6.3-py3-none-any.whl (1.2 MB)
Collecting wheel
Using cached wheel-0.38.4-py3-none-any.whl (36 kB)
Installing collected packages: pip, setuptools, wheel
Attempting uninstall: pip
Found existing installation: pip 20.0.2
Uninstalling pip-20.0.2:
Successfully uninstalled pip-20.0.2
Attempting uninstall: setuptools
Found existing installation: setuptools 44.0.0
Uninstalling setuptools-44.0.0:
Successfully uninstalled setuptools-44.0.0
Successfully installed pip-22.3.1 setuptools-65.6.3 wheel-0.38.4
Collecting beautifulsoup4<5.0,>=4.9.0
Using cached beautifulsoup4-4.11.1-py3-none-any.whl (128 kB)
Collecting pyyaml<6.0.0,>=3.12
Using cached PyYAML-5.4.1-cp38-cp38-manylinux1_x86_64.whl (662 kB)
Collecting tenacity<6.0,>=5.0.2
Using cached tenacity-5.1.5-py2.py3-none-any.whl (34 kB)
Collecting soupsieve>1.2
Using cached soupsieve-2.3.2.post1-py3-none-any.whl (37 kB)
Collecting six>=1.9.0
Using cached six-1.16.0-py2.py3-none-any.whl (11 kB)
Installing collected packages: soupsieve, six, pyyaml, tenacity, beautifulsoup4
Successfully installed beautifulsoup4-4.11.1 pyyaml-5.4.1 six-1.16.0 soupsieve-2.3.2.post1 tenacity-5.1.5
Executing python <https://ci-beam.apache.org/job/beam_PostCommit_Java_DataflowV2/ws/src/sdks/java/container/license_scripts/pull_licenses_java.py> --license_index=<https://ci-beam.apache.org/job/beam_PostCommit_Java_DataflowV2/ws/src/sdks/java/container/build/reports/dependency-license/index.json> --output_dir=<https://ci-beam.apache.org/job/beam_PostCommit_Java_DataflowV2/ws/src/sdks/java/container/build/target/java_third_party_licenses> --dep_url_yaml=<https://ci-beam.apache.org/job/beam_PostCommit_Java_DataflowV2/ws/src/sdks/java/container/license_scripts/dep_urls_java.yaml> --manual_license_path=<https://ci-beam.apache.org/job/beam_PostCommit_Java_DataflowV2/ws/src/sdks/java/container/license_scripts/manual_licenses>
INFO:root:Pulling license for 235 dependencies using 16 threads.
INFO:root:Replaced local file URL with file://<https://ci-beam.apache.org/job/beam_PostCommit_Java_DataflowV2/ws/src/sdks/java/container/license_scripts/manual_licenses/xz/COPYING> for xz-1.5
INFO:root:pull_licenses_java.py succeed. It took 2.331654 seconds with 16 threads.
Copying licenses from <https://ci-beam.apache.org/job/beam_PostCommit_Java_DataflowV2/ws/src/sdks/java/container/build/target/java_third_party_licenses> to <https://ci-beam.apache.org/job/beam_PostCommit_Java_DataflowV2/ws/src/sdks/java/container/build/target/third_party_licenses.>
Finished license_scripts.sh
> Task :sdks:java:container:goPrepare UP-TO-DATE
> Task :sdks:java:container:java8:copyJavaThirdPartyLicenses
> Task :sdks:java:container:goBuild
/home/jenkins/go/bin/go1.19.3 build -o ./build/target/linux_amd64/boot boot.go boot_test.go
> Task :sdks:java:container:java8:copySdkHarnessLauncher
Execution optimizations have been disabled for task ':sdks:java:container:java8:copySdkHarnessLauncher' to ensure correctness due to the following reasons:
- Gradle detected a problem with the following location: '<https://ci-beam.apache.org/job/beam_PostCommit_Java_DataflowV2/ws/src/sdks/java/container/build/target'.> Reason: Task ':sdks:java:container:java8:copySdkHarnessLauncher' uses this output of task ':sdks:java:container:downloadCloudProfilerAgent' without declaring an explicit or implicit dependency. This can lead to incorrect results being produced, depending on what order the tasks are executed. Please refer to https://docs.gradle.org/7.5.1/userguide/validation_problems.html#implicit_dependency for more details about this problem.
- Gradle detected a problem with the following location: '<https://ci-beam.apache.org/job/beam_PostCommit_Java_DataflowV2/ws/src/sdks/java/container/build/target'.> Reason: Task ':sdks:java:container:java8:copySdkHarnessLauncher' uses this output of task ':sdks:java:container:pullLicenses' without declaring an explicit or implicit dependency. This can lead to incorrect results being produced, depending on what order the tasks are executed. Please refer to https://docs.gradle.org/7.5.1/userguide/validation_problems.html#implicit_dependency for more details about this problem.
> Task :release:go-licenses:java:dockerRun
go: downloading github.com/golang/protobuf v1.5.2
go: downloading google.golang.org/grpc v1.50.1
go: downloading google.golang.org/protobuf v1.28.1
go: downloading golang.org/x/sys v0.0.0-20220728004956-3c1f35247d10
go: downloading golang.org/x/net v0.0.0-20221012135044-0b7e1fb9d458
go: downloading google.golang.org/genproto v0.0.0-20221010155953-15ba04fc1c0e
go: added github.com/apache/beam/sdks/v2 v2.43.0
go: added github.com/golang/protobuf v1.5.2
go: added golang.org/x/net v0.0.0-20221012135044-0b7e1fb9d458
go: added golang.org/x/sys v0.0.0-20220728004956-3c1f35247d10
go: added golang.org/x/text v0.4.0
go: added google.golang.org/genproto v0.0.0-20221010155953-15ba04fc1c0e
go: added google.golang.org/grpc v1.50.1
go: added google.golang.org/protobuf v1.28.1
+ go-licenses save github.com/apache/beam/sdks/v2/java/container --save_path=/output/licenses
W1226 21:58:54.459610 40 library.go:101] "golang.org/x/sys/unix" contains non-Go code that can't be inspected for further dependencies:
/go/pkg/mod/golang.org/x/sys@v0.0.0-20220728004956-3c1f35247d10/unix/asm_linux_amd64.s
+ go-licenses csv github.com/apache/beam/sdks/v2/java/container
+ tee /output/licenses/list.csv
W1226 21:58:59.357718 86 library.go:101] "golang.org/x/sys/unix" contains non-Go code that can't be inspected for further dependencies:
/go/pkg/mod/golang.org/x/sys@v0.0.0-20220728004956-3c1f35247d10/unix/asm_linux_amd64.s
github.com/apache/beam/sdks/v2/go/pkg/beam,https://github.com/apache/beam/blob/sdks/v2.43.0/sdks/go/README.md,Apache-2.0
github.com/apache/beam/sdks/v2/java/container,https://github.com/apache/beam/blob/sdks/v2.43.0/sdks/LICENSE,Apache-2.0
github.com/golang/protobuf,https://github.com/golang/protobuf/blob/v1.5.2/LICENSE,BSD-3-Clause
golang.org/x/net,https://cs.opensource.google/go/x/net/+/0b7e1fb9:LICENSE,BSD-3-Clause
golang.org/x/sys,https://cs.opensource.google/go/x/sys/+/3c1f3524:LICENSE,BSD-3-Clause
golang.org/x/text,https://cs.opensource.google/go/x/text/+/v0.4.0:LICENSE,BSD-3-Clause
google.golang.org/genproto/googleapis/rpc/status,https://github.com/googleapis/go-genproto/blob/15ba04fc1c0e/LICENSE,Apache-2.0
google.golang.org/grpc,https://github.com/grpc/grpc-go/blob/v1.50.1/LICENSE,Apache-2.0
google.golang.org/protobuf,https://github.com/protocolbuffers/protobuf-go/blob/v1.28.1/LICENSE,BSD-3-Clause
+ chmod -R a+w /output/licenses
> Task :release:go-licenses:java:createLicenses
> Task :sdks:java:container:java8:copyGolangLicenses
> Task :sdks:java:container:java8:dockerPrepare
> Task :sdks:java:container:java8:docker
> Task :runners:google-cloud-dataflow-java:buildAndPushDockerJavaContainer
WARNING: `gcloud docker` will not be supported for Docker client versions above 18.03.
As an alternative, use `gcloud auth configure-docker` to configure `docker` to
use `gcloud` as a credential helper, then use `docker` as you would for non-GCR
registries, e.g. `docker pull gcr.io/project-id/my-image`. Add
`--verbosity=error` to silence this warning: `gcloud docker
--verbosity=error -- pull gcr.io/project-id/my-image`.
See: https://cloud.google.com/container-registry/docs/support/deprecation-notices#gcloud-docker
The push refers to repository [us.gcr.io/apache-beam-testing/java-postcommit-it/java]
9829b89ad4c9: Preparing
05d443671cdb: Preparing
7313fda31133: Preparing
30dc182b4586: Preparing
02e8ac0c1544: Preparing
8f3171cb6566: Preparing
88257ae26d5b: Preparing
4c70b5627b70: Preparing
0432e525c687: Preparing
d4e049b067d1: Preparing
3ddbc6cdb8d1: Preparing
9cf0cc1a027d: Preparing
0c5ff5478b4a: Preparing
30a82de882df: Preparing
008743e1a584: Preparing
6b5aaff44254: Preparing
53a0b163e995: Preparing
b626401ef603: Preparing
9b55156abf26: Preparing
293d5db30c9f: Preparing
03127cdb479b: Preparing
9c742cd6c7a5: Preparing
9b55156abf26: Waiting
9cf0cc1a027d: Waiting
6b5aaff44254: Waiting
008743e1a584: Waiting
d4e049b067d1: Waiting
4c70b5627b70: Waiting
8f3171cb6566: Waiting
0c5ff5478b4a: Waiting
293d5db30c9f: Waiting
3ddbc6cdb8d1: Waiting
88257ae26d5b: Waiting
30a82de882df: Waiting
03127cdb479b: Waiting
b626401ef603: Waiting
53a0b163e995: Waiting
7313fda31133: Pushed
05d443671cdb: Pushed
30dc182b4586: Pushed
02e8ac0c1544: Pushed
9829b89ad4c9: Pushed
88257ae26d5b: Pushed
8f3171cb6566: Pushed
d4e049b067d1: Pushed
0432e525c687: Pushed
4c70b5627b70: Pushed
3ddbc6cdb8d1: Pushed
6b5aaff44254: Layer already exists
53a0b163e995: Layer already exists
b626401ef603: Layer already exists
9b55156abf26: Layer already exists
293d5db30c9f: Layer already exists
03127cdb479b: Layer already exists
9c742cd6c7a5: Layer already exists
9cf0cc1a027d: Pushed
30a82de882df: Pushed
008743e1a584: Pushed
0c5ff5478b4a: Pushed
20221226215741: digest: sha256:22d65e15780544fa5e4531a54d882418cb0a17e435ac8b6eeb1d1772bdc745a6 size: 4934
> Task :runners:google-cloud-dataflow-java:coreSDKJavaRunnerV2IntegrationTest NO-SOURCE
> Task :runners:google-cloud-dataflow-java:examplesJavaRunnerV2IntegrationTest
***********************************************************
***********************************************************
**********************Set Up Pubsub************************
The Pub/Sub topic has been set up for this example: projects/apache-beam-testing/topics/testpipeline-jenkins-1226215947-71affd19
The Pub/Sub subscription has been set up for this example: projects/apache-beam-testing/subscriptions/testpipeline-jenkins-1226215947-71affd19
*************************Tear Down*************************
The Pub/Sub topic has been deleted: projects/apache-beam-testing/topics/testpipeline-jenkins-1226215947-71affd19
The Pub/Sub subscription has been deleted: projects/apache-beam-testing/subscriptions/testpipeline-jenkins-1226215947-71affd19
***********************************************************
***********************************************************
***********************************************************
***********************************************************
**********************Set Up Pubsub************************
The Pub/Sub topic has been set up for this example: projects/apache-beam-testing/topics/testpipeline-jenkins-1226215947-6c21a721
The Pub/Sub subscription has been set up for this example: projects/apache-beam-testing/subscriptions/testpipeline-jenkins-1226215947-6c21a721
*************************Tear Down*************************
The Pub/Sub topic has been deleted: projects/apache-beam-testing/topics/testpipeline-jenkins-1226215947-6c21a721
The Pub/Sub subscription has been deleted: projects/apache-beam-testing/subscriptions/testpipeline-jenkins-1226215947-6c21a721
***********************************************************
***********************************************************
> Task :runners:google-cloud-dataflow-java:googleCloudPlatformRunnerV2IntegrationTest
org.apache.beam.sdk.io.gcp.pubsub.PubsubSchemaIT > classMethod FAILED
java.nio.file.NoSuchFileException at PubsubSchemaIT.java:85
org.apache.beam.sdk.io.gcp.pubsub.PubsubSchemaIT > classMethod FAILED
io.grpc.StatusRuntimeException at PubsubSchemaIT.java:96
org.apache.beam.sdk.io.gcp.spanner.changestreams.it.SpannerChangeStreamOrderedWithinKeyIT > testOrderedWithinKey FAILED
java.lang.RuntimeException at SpannerChangeStreamOrderedWithinKeyIT.java:149
81 tests completed, 3 failed, 2 skipped
> Task :runners:google-cloud-dataflow-java:googleCloudPlatformRunnerV2IntegrationTest FAILED
> Task :runners:google-cloud-dataflow-java:cleanUpDockerJavaImages
Untagged: us.gcr.io/apache-beam-testing/java-postcommit-it/java:20221226215741
Untagged: us.gcr.io/apache-beam-testing/java-postcommit-it/java@sha256:22d65e15780544fa5e4531a54d882418cb0a17e435ac8b6eeb1d1772bdc745a6
WARNING: Successfully resolved tag to sha256, but it is recommended to use sha256 directly.
Tag: [us.gcr.io/apache-beam-testing/java-postcommit-it/java:20221226215741]
- referencing digest: [us.gcr.io/apache-beam-testing/java-postcommit-it/java@sha256:22d65e15780544fa5e4531a54d882418cb0a17e435ac8b6eeb1d1772bdc745a6]
Deleted [[us.gcr.io/apache-beam-testing/java-postcommit-it/java:20221226215741] (referencing [us.gcr.io/apache-beam-testing/java-postcommit-it/java@sha256:22d65e15780544fa5e4531a54d882418cb0a17e435ac8b6eeb1d1772bdc745a6])].
Removing untagged image us.gcr.io/apache-beam-testing/java-postcommit-it/java@sha256:22d65e15780544fa5e4531a54d882418cb0a17e435ac8b6eeb1d1772bdc745a6
Digests:
- us.gcr.io/apache-beam-testing/java-postcommit-it/java@sha256:22d65e15780544fa5e4531a54d882418cb0a17e435ac8b6eeb1d1772bdc745a6
Deleted [us.gcr.io/apache-beam-testing/java-postcommit-it/java@sha256:22d65e15780544fa5e4531a54d882418cb0a17e435ac8b6eeb1d1772bdc745a6].
FAILURE: Build failed with an exception.
* What went wrong:
Execution failed for task ':runners:google-cloud-dataflow-java:googleCloudPlatformRunnerV2IntegrationTest'.
> There were failing tests. See the report at: file://<https://ci-beam.apache.org/job/beam_PostCommit_Java_DataflowV2/ws/src/runners/google-cloud-dataflow-java/build/reports/tests/googleCloudPlatformRunnerV2IntegrationTest/index.html>
* Try:
> Run with --stacktrace option to get the stack trace.
> Run with --info or --debug option to get more log output.
* Get more help at https://help.gradle.org
Deprecated Gradle features were used in this build, making it incompatible with Gradle 8.0.
You can use '--warning-mode all' to show the individual deprecation warnings and determine if they come from your own scripts or plugins.
See https://docs.gradle.org/7.5.1/userguide/command_line_interface.html#sec:command_line_warnings
Execution optimizations have been disabled for 1 invalid unit(s) of work during this build to ensure correctness.
Please consult deprecation warnings for more details.
BUILD FAILED in 3h 22m 31s
145 actionable tasks: 93 executed, 48 from cache, 4 up-to-date
Publishing build scan...
https://gradle.com/s/vdwawcccm7acq
Build step 'Invoke Gradle script' changed build result to FAILURE
Build step 'Invoke Gradle script' marked build as failure
---------------------------------------------------------------------
To unsubscribe, e-mail: builds-unsubscribe@beam.apache.org
For additional commands, e-mail: builds-help@beam.apache.org