You are viewing a plain text version of this content. The canonical link for it is here.
Posted to dev@zookeeper.apache.org by Apache Jenkins Server <je...@builds.apache.org> on 2016/07/17 10:10:57 UTC
ZooKeeper_branch35_openjdk7 - Build # 154 - Still Failing
See https://builds.apache.org/job/ZooKeeper_branch35_openjdk7/154/
###################################################################################
########################## LAST 60 LINES OF THE CONSOLE ###########################
[...truncated 435383 lines...]
[junit] at org.jboss.netty.channel.socket.nio.NioClientBoss.process(NioClientBoss.java:79)
[junit] at org.jboss.netty.channel.socket.nio.AbstractNioSelector.run(AbstractNioSelector.java:337)
[junit] at org.jboss.netty.channel.socket.nio.NioClientBoss.run(NioClientBoss.java:42)
[junit] at org.jboss.netty.util.ThreadRenamingRunnable.run(ThreadRenamingRunnable.java:108)
[junit] at org.jboss.netty.util.internal.DeadLockProofWorker$1.run(DeadLockProofWorker.java:42)
[junit] at java.util.concurrent.ThreadPoolExecutor.runWorker(ThreadPoolExecutor.java:1145)
[junit] at java.util.concurrent.ThreadPoolExecutor$Worker.run(ThreadPoolExecutor.java:615)
[junit] at java.lang.Thread.run(Thread.java:745)
[junit] 2016-07-17 10:04:11,569 [myid:] - WARN [New I/O boss #9405:ClientCnxnSocketNetty$ZKClientHandler@439] - Exception caught: [id: 0xad4e99b3] EXCEPTION: java.net.ConnectException: Connection refused: 127.0.0.1/127.0.0.1:16729
[junit] java.net.ConnectException: Connection refused: 127.0.0.1/127.0.0.1:16729
[junit] at sun.nio.ch.SocketChannelImpl.checkConnect(Native Method)
[junit] at sun.nio.ch.SocketChannelImpl.finishConnect(SocketChannelImpl.java:744)
[junit] at org.jboss.netty.channel.socket.nio.NioClientBoss.connect(NioClientBoss.java:152)
[junit] at org.jboss.netty.channel.socket.nio.NioClientBoss.processSelectedKeys(NioClientBoss.java:105)
[junit] at org.jboss.netty.channel.socket.nio.NioClientBoss.process(NioClientBoss.java:79)
[junit] at org.jboss.netty.channel.socket.nio.AbstractNioSelector.run(AbstractNioSelector.java:337)
[junit] at org.jboss.netty.channel.socket.nio.NioClientBoss.run(NioClientBoss.java:42)
[junit] at org.jboss.netty.util.ThreadRenamingRunnable.run(ThreadRenamingRunnable.java:108)
[junit] at org.jboss.netty.util.internal.DeadLockProofWorker$1.run(DeadLockProofWorker.java:42)
[junit] at java.util.concurrent.ThreadPoolExecutor.runWorker(ThreadPoolExecutor.java:1145)
[junit] at java.util.concurrent.ThreadPoolExecutor$Worker.run(ThreadPoolExecutor.java:615)
[junit] at java.lang.Thread.run(Thread.java:745)
[junit] 2016-07-17 10:04:11,569 [myid:] - INFO [New I/O boss #9405:ClientCnxnSocketNetty@208] - channel is told closing
[junit] 2016-07-17 10:04:11,569 [myid:127.0.0.1:16729] - INFO [main-SendThread(127.0.0.1:16729):ClientCnxn$SendThread@1231] - channel for sessionid 0x10151f04c860000 is lost, closing socket connection and attempting reconnect
[junit] 2016-07-17 10:04:11,570 [myid:] - INFO [main-EventThread:ClientCnxn$EventThread@513] - EventThread shut down for session: 0x10151f33f860000
[junit] 2016-07-17 10:04:11,571 [myid:] - INFO [main:ZooKeeper@1313] - Session: 0x10151f33f860000 closed
[junit] 2016-07-17 10:04:11,571 [myid:] - INFO [main:JUnit4ZKTestRunner$LoggedInvokeMethod@82] - Memory used 160267
[junit] 2016-07-17 10:04:11,571 [myid:] - INFO [main:JUnit4ZKTestRunner$LoggedInvokeMethod@87] - Number of threads 1641
[junit] 2016-07-17 10:04:11,571 [myid:] - INFO [main:JUnit4ZKTestRunner$LoggedInvokeMethod@102] - FINISHED TEST METHOD testWatcherAutoResetWithLocal
[junit] 2016-07-17 10:04:11,571 [myid:] - INFO [main:ClientBase@543] - tearDown starting
[junit] 2016-07-17 10:04:11,573 [myid:] - INFO [main:ClientBase@513] - STOPPING server
[junit] 2016-07-17 10:04:11,573 [myid:] - INFO [main:NettyServerCnxnFactory@464] - shutdown called 0.0.0.0/0.0.0.0:30317
[junit] 2016-07-17 10:04:11,582 [myid:] - INFO [main:ZooKeeperServer@498] - shutting down
[junit] 2016-07-17 10:04:11,583 [myid:] - INFO [main:SessionTrackerImpl@232] - Shutting down
[junit] 2016-07-17 10:04:11,583 [myid:] - INFO [main:PrepRequestProcessor@965] - Shutting down
[junit] 2016-07-17 10:04:11,583 [myid:] - INFO [main:SyncRequestProcessor@191] - Shutting down
[junit] 2016-07-17 10:04:11,583 [myid:] - INFO [SyncThread:0:SyncRequestProcessor@169] - SyncRequestProcessor exited!
[junit] 2016-07-17 10:04:11,583 [myid:] - INFO [ProcessThread(sid:0 cport:30317)::PrepRequestProcessor@154] - PrepRequestProcessor exited loop!
[junit] 2016-07-17 10:04:11,584 [myid:] - INFO [main:FinalRequestProcessor@479] - shutdown of request processor complete
[junit] 2016-07-17 10:04:11,585 [myid:] - INFO [main:MBeanRegistry@128] - Unregister MBean [org.apache.ZooKeeperService:name0=StandaloneServer_port30317,name1=InMemoryDataTree]
[junit] 2016-07-17 10:04:11,585 [myid:] - INFO [main:MBeanRegistry@128] - Unregister MBean [org.apache.ZooKeeperService:name0=StandaloneServer_port30317]
[junit] 2016-07-17 10:04:11,585 [myid:] - INFO [main:FourLetterWordMain@85] - connecting to 127.0.0.1 30317
[junit] 2016-07-17 10:04:11,586 [myid:] - INFO [main:JMXEnv@146] - ensureOnly:[]
[junit] 2016-07-17 10:04:11,592 [myid:] - INFO [main:ClientBase@568] - fdcount after test is: 4826 at start it was 4826
[junit] 2016-07-17 10:04:11,592 [myid:] - INFO [main:ZKTestCase$1@65] - SUCCEEDED testWatcherAutoResetWithLocal
[junit] 2016-07-17 10:04:11,592 [myid:] - INFO [main:ZKTestCase$1@60] - FINISHED testWatcherAutoResetWithLocal
[junit] Tests run: 101, Failures: 0, Errors: 0, Skipped: 0, Time elapsed: 497.973 sec, Thread: 8, Class: org.apache.zookeeper.test.NioNettySuiteTest
[junit] Test org.apache.zookeeper.test.NettyNettySuiteTest FAILED
BUILD FAILED
/home/jenkins/jenkins-slave/workspace/ZooKeeper_branch35_openjdk7/branch-3.5/build.xml:1322: The following error occurred while executing this line:
/home/jenkins/jenkins-slave/workspace/ZooKeeper_branch35_openjdk7/branch-3.5/build.xml:1207: Tests failed!
Total time: 13 minutes 11 seconds
Build step 'Invoke Ant' marked build as failure
Archiving artifacts
Recording test results
Email was triggered for: Failure - Any
Sending email for trigger: Failure - Any
###################################################################################
############################## FAILED TESTS (if any) ##############################
1 tests failed.
FAILED: org.apache.zookeeper.test.SessionTest.testSession
Error Message:
expected:<[SESSIONEXPIRED]> but was:<[not done]>
Stack Trace:
junit.framework.AssertionFailedError: expected:<[SESSIONEXPIRED]> but was:<[not done]>
at org.apache.zookeeper.test.SessionTest.testSession(SessionTest.java:235)
at org.apache.zookeeper.JUnit4ZKTestRunner$LoggedInvokeMethod.evaluate(JUnit4ZKTestRunner.java:79)
ZooKeeper_branch35_openjdk7 - Build # 155 - Still Failing
Posted by Apache Jenkins Server <je...@builds.apache.org>.
See https://builds.apache.org/job/ZooKeeper_branch35_openjdk7/155/
###################################################################################
########################## LAST 60 LINES OF THE CONSOLE ###########################
[...truncated 431401 lines...]
[junit] 2016-07-18 11:27:23,215 [myid:] - INFO [ProcessThread(sid:0 cport:11222)::PrepRequestProcessor@154] - PrepRequestProcessor exited loop!
[junit] 2016-07-18 11:27:23,216 [myid:] - INFO [SyncThread:0:SyncRequestProcessor@169] - SyncRequestProcessor exited!
[junit] 2016-07-18 11:27:23,216 [myid:] - INFO [main:FinalRequestProcessor@479] - shutdown of request processor complete
[junit] 2016-07-18 11:27:23,217 [myid:] - INFO [main:MBeanRegistry@128] - Unregister MBean [org.apache.ZooKeeperService:name0=StandaloneServer_port11222,name1=InMemoryDataTree]
[junit] 2016-07-18 11:27:23,217 [myid:] - INFO [main:MBeanRegistry@128] - Unregister MBean [org.apache.ZooKeeperService:name0=StandaloneServer_port11222]
[junit] 2016-07-18 11:27:23,217 [myid:] - INFO [main:FourLetterWordMain@85] - connecting to 127.0.0.1 11222
[junit] 2016-07-18 11:27:23,218 [myid:] - INFO [main:JMXEnv@146] - ensureOnly:[]
[junit] 2016-07-18 11:27:23,223 [myid:] - INFO [main:ClientBase@568] - fdcount after test is: 54 at start it was 43
[junit] 2016-07-18 11:27:23,223 [myid:] - INFO [main:ClientBase@570] - sleeping for 20 secs
[junit] 2016-07-18 11:27:23,224 [myid:] - INFO [main:ZKTestCase$1@65] - SUCCEEDED testQuota
[junit] 2016-07-18 11:27:23,225 [myid:] - INFO [main:ZKTestCase$1@60] - FINISHED testQuota
[junit] Tests run: 1, Failures: 0, Errors: 0, Time elapsed: 0.885 sec
junit.run-concurrent:
junit.run:
test-core-java:
call-test-cppunit:
init:
check-cppunit-makefile:
create-cppunit-makefile:
init:
check-cppunit-configure:
create-cppunit-configure:
[exec] configure.ac:37: warning: macro `AM_PATH_CPPUNIT' not found in library
[exec] libtoolize: putting auxiliary files in `.'.
[exec] libtoolize: copying file `./config.guess'
[exec] libtoolize: copying file `./config.sub'
[exec] libtoolize: copying file `./install-sh'
[exec] libtoolize: copying file `./ltmain.sh'
[exec] libtoolize: Consider adding `AC_CONFIG_MACRO_DIR([m4])' to configure.ac and
[exec] libtoolize: rerunning libtoolize, to keep the correct libtool macros in-tree.
[exec] libtoolize: Consider adding `-I m4' to ACLOCAL_AMFLAGS in Makefile.am.
[exec] configure.ac:37: warning: macro `AM_PATH_CPPUNIT' not found in library
[exec] configure.ac:37: error: possibly undefined macro: AM_PATH_CPPUNIT
[exec] If this token and others are legitimate, please use m4_pattern_allow.
[exec] See the Autoconf documentation.
[exec] autoreconf: /usr/bin/autoconf failed with exit status: 1
BUILD FAILED
/x1/jenkins/jenkins-slave/workspace/ZooKeeper_branch35_openjdk7/branch-3.5/build.xml:1322: The following error occurred while executing this line:
/x1/jenkins/jenkins-slave/workspace/ZooKeeper_branch35_openjdk7/branch-3.5/build.xml:1281: The following error occurred while executing this line:
/x1/jenkins/jenkins-slave/workspace/ZooKeeper_branch35_openjdk7/branch-3.5/build.xml:1268: The following error occurred while executing this line:
/x1/jenkins/jenkins-slave/workspace/ZooKeeper_branch35_openjdk7/branch-3.5/build.xml:1260: exec returned: 1
Total time: 75 minutes 27 seconds
Build step 'Invoke Ant' marked build as failure
Archiving artifacts
Recording test results
Email was triggered for: Failure - Any
Sending email for trigger: Failure - Any
###################################################################################
############################## FAILED TESTS (if any) ##############################
All tests passed