You are viewing a plain text version of this content. The canonical link for it is here.
Posted to mapreduce-dev@hadoop.apache.org by Apache Jenkins Server <je...@builds.apache.org> on 2016/05/29 20:00:10 UTC
Hadoop-Mapreduce-trunk-Java8 - Build # 1478 - Still Failing
See https://builds.apache.org/job/Hadoop-Mapreduce-trunk-Java8/1478/
###################################################################################
########################## LAST 60 LINES OF THE CONSOLE ###########################
[...truncated 21143 lines...]
[INFO] --- maven-assembly-plugin:2.4:single (package-mapreduce) @ hadoop-mapreduce ---
[WARNING] The following patterns were never triggered in this artifact inclusion filter:
o 'org.apache.hadoop:hadoop-yarn-server-tests'
[WARNING] The following patterns were never triggered in this artifact exclusion filter:
o 'org.apache.hadoop:hadoop-common'
o 'org.apache.hadoop:hadoop-hdfs'
o 'jdiff:jdiff:jar'
[INFO] ------------------------------------------------------------------------
[INFO] Reactor Summary:
[INFO]
[INFO] Apache Hadoop MapReduce Client ..................... SUCCESS [ 4.533 s]
[INFO] Apache Hadoop MapReduce Core ....................... SUCCESS [02:30 min]
[INFO] Apache Hadoop MapReduce Common ..................... SUCCESS [01:02 min]
[INFO] Apache Hadoop MapReduce Shuffle .................... SUCCESS [ 15.185 s]
[INFO] Apache Hadoop MapReduce App ........................ SUCCESS [08:44 min]
[INFO] Apache Hadoop MapReduce HistoryServer .............. SUCCESS [05:56 min]
[INFO] Apache Hadoop MapReduce JobClient .................. FAILURE [ 02:17 h]
[INFO] Apache Hadoop MapReduce HistoryServer Plugins ...... SUCCESS [ 6.918 s]
[INFO] Apache Hadoop MapReduce NativeTask ................. FAILURE [07:48 min]
[INFO] Apache Hadoop MapReduce Examples ................... SKIPPED
[INFO] Apache Hadoop MapReduce ............................ FAILURE [ 0.971 s]
[INFO] ------------------------------------------------------------------------
[INFO] BUILD FAILURE
[INFO] ------------------------------------------------------------------------
[INFO] Total time: 02:43 h
[INFO] Finished at: 2016-05-29T19:59:48+00:00
[INFO] Final Memory: 115M/2645M
[INFO] ------------------------------------------------------------------------
[WARNING] The requested profile "docs" could not be activated because it does not exist.
[WARNING] The requested profile "parallel-tests" could not be activated because it does not exist.
[ERROR] Failed to execute goal org.apache.maven.plugins:maven-surefire-plugin:2.17:test (default-test) on project hadoop-mapreduce-client-jobclient: There was a timeout or other error in the fork -> [Help 1]
[ERROR] Failed to execute goal org.apache.hadoop:hadoop-maven-plugins:3.0.0-alpha1-SNAPSHOT:cmake-test (nttest) on project hadoop-mapreduce-client-nativetask: Test /home/jenkins/jenkins-slave/workspace/Hadoop-Mapreduce-trunk-Java8/source/hadoop-mapreduce-project/hadoop-mapreduce-client/hadoop-mapreduce-client-nativetask/target/native/test/nttest returned ERROR CODE 127 -> [Help 2]
[ERROR] Failed to execute goal org.apache.maven.plugins:maven-assembly-plugin:2.4:single (package-mapreduce) on project hadoop-mapreduce: Failed to create assembly: Error adding file 'org.apache.hadoop:hadoop-mapreduce-client-jobclient:jar:3.0.0-alpha1-SNAPSHOT' to archive: /home/jenkins/jenkins-slave/workspace/Hadoop-Mapreduce-trunk-Java8/source/hadoop-mapreduce-project/hadoop-mapreduce-client/hadoop-mapreduce-client-jobclient/target/classes isn't a file. -> [Help 2]
[ERROR]
[ERROR] To see the full stack trace of the errors, re-run Maven with the -e switch.
[ERROR] Re-run Maven using the -X switch to enable full debug logging.
[ERROR]
[ERROR] For more information about the errors and possible solutions, please read the following articles:
[ERROR] [Help 1] http://cwiki.apache.org/confluence/display/MAVEN/MojoFailureException
[ERROR] [Help 2] http://cwiki.apache.org/confluence/display/MAVEN/MojoExecutionException
[ERROR]
[ERROR] After correcting the problems, you can resume the build with the command
[ERROR] mvn <goals> -rf :hadoop-mapreduce-client-jobclient
Build step 'Execute shell' marked build as failure
[FINDBUGS] Skipping publisher since build result is FAILURE
Archiving artifacts
Setting LATEST1_8_HOME=/home/jenkins/jenkins-slave/tools/hudson.model.JDK/latest1.8
Setting MAVEN_3_3_3_HOME=/home/jenkins/jenkins-slave/tools/hudson.tasks.Maven_MavenInstallation/maven-3.3.3
Recording test results
Setting LATEST1_8_HOME=/home/jenkins/jenkins-slave/tools/hudson.model.JDK/latest1.8
Setting MAVEN_3_3_3_HOME=/home/jenkins/jenkins-slave/tools/hudson.tasks.Maven_MavenInstallation/maven-3.3.3
Email was triggered for: Failure - Any
Sending email for trigger: Failure - Any
Setting LATEST1_8_HOME=/home/jenkins/jenkins-slave/tools/hudson.model.JDK/latest1.8
Setting MAVEN_3_3_3_HOME=/home/jenkins/jenkins-slave/tools/hudson.tasks.Maven_MavenInstallation/maven-3.3.3
Setting LATEST1_8_HOME=/home/jenkins/jenkins-slave/tools/hudson.model.JDK/latest1.8
Setting MAVEN_3_3_3_HOME=/home/jenkins/jenkins-slave/tools/hudson.tasks.Maven_MavenInstallation/maven-3.3.3
###################################################################################
############################## FAILED TESTS (if any) ##############################
56 tests failed.
FAILED: org.apache.hadoop.mapred.TestAuditLogger.testAuditLoggerWithIP
Error Message:
null
Stack Trace:
java.lang.NullPointerException: null
at org.apache.hadoop.ipc.ProtobufRpcEngine$Invoker.invoke(ProtobufRpcEngine.java:203)
at com.sun.proxy.$Proxy7.ping(Unknown Source)
at org.apache.hadoop.mapred.TestAuditLogger.testAuditLoggerWithIP(TestAuditLogger.java:157)
FAILED: org.apache.hadoop.mapred.TestClusterMRNotification.testMR
Error Message:
Job failed!
Stack Trace:
java.io.IOException: Job failed!
at org.apache.hadoop.mapred.JobClient.runJob(JobClient.java:876)
at org.apache.hadoop.mapred.NotificationTestCase.launchWordCount(NotificationTestCase.java:250)
at org.apache.hadoop.mapred.NotificationTestCase.testMR(NotificationTestCase.java:165)
at sun.reflect.NativeMethodAccessorImpl.invoke0(Native Method)
at sun.reflect.NativeMethodAccessorImpl.invoke(NativeMethodAccessorImpl.java:62)
at sun.reflect.DelegatingMethodAccessorImpl.invoke(DelegatingMethodAccessorImpl.java:43)
at java.lang.reflect.Method.invoke(Method.java:498)
at org.junit.runners.model.FrameworkMethod$1.runReflectiveCall(FrameworkMethod.java:47)
at org.junit.internal.runners.model.ReflectiveCallable.run(ReflectiveCallable.java:12)
at org.junit.runners.model.FrameworkMethod.invokeExplosively(FrameworkMethod.java:44)
at org.junit.internal.runners.statements.InvokeMethod.evaluate(InvokeMethod.java:17)
at org.junit.internal.runners.statements.RunBefores.evaluate(RunBefores.java:26)
at org.junit.internal.runners.statements.RunAfters.evaluate(RunAfters.java:27)
at org.junit.runners.ParentRunner.runLeaf(ParentRunner.java:271)
at org.junit.runners.BlockJUnit4ClassRunner.runChild(BlockJUnit4ClassRunner.java:70)
at org.junit.runners.BlockJUnit4ClassRunner.runChild(BlockJUnit4ClassRunner.java:50)
at org.junit.runners.ParentRunner$3.run(ParentRunner.java:238)
at org.junit.runners.ParentRunner$1.schedule(ParentRunner.java:63)
at org.junit.runners.ParentRunner.runChildren(ParentRunner.java:236)
at org.junit.runners.ParentRunner.access$000(ParentRunner.java:53)
at org.junit.runners.ParentRunner$2.evaluate(ParentRunner.java:229)
at org.junit.runners.ParentRunner.run(ParentRunner.java:309)
at org.apache.maven.surefire.junit4.JUnit4Provider.execute(JUnit4Provider.java:264)
at org.apache.maven.surefire.junit4.JUnit4Provider.executeTestSet(JUnit4Provider.java:153)
at org.apache.maven.surefire.junit4.JUnit4Provider.invoke(JUnit4Provider.java:124)
at org.apache.maven.surefire.booter.ForkedBooter.invokeProviderInSameClassLoader(ForkedBooter.java:200)
at org.apache.maven.surefire.booter.ForkedBooter.runSuitesInProcess(ForkedBooter.java:153)
at org.apache.maven.surefire.booter.ForkedBooter.main(ForkedBooter.java:103)
FAILED: org.apache.hadoop.mapred.TestClusterMapReduceTestCase.testMapReduceRestarting
Error Message:
Job failed!
Stack Trace:
java.io.IOException: Job failed!
at org.apache.hadoop.mapred.JobClient.runJob(JobClient.java:876)
at org.apache.hadoop.mapred.TestClusterMapReduceTestCase._testMapReduce(TestClusterMapReduceTestCase.java:73)
at org.apache.hadoop.mapred.TestClusterMapReduceTestCase.testMapReduceRestarting(TestClusterMapReduceTestCase.java:101)
FAILED: org.apache.hadoop.mapred.TestClusterMapReduceTestCase.testMapReduce
Error Message:
Job failed!
Stack Trace:
java.io.IOException: Job failed!
at org.apache.hadoop.mapred.JobClient.runJob(JobClient.java:876)
at org.apache.hadoop.mapred.TestClusterMapReduceTestCase._testMapReduce(TestClusterMapReduceTestCase.java:73)
at org.apache.hadoop.mapred.TestClusterMapReduceTestCase.testMapReduce(TestClusterMapReduceTestCase.java:96)
FAILED: org.apache.hadoop.mapred.TestJobCleanup.testDefaultCleanupAndAbort
Error Message:
Done file "/home/jenkins/jenkins-slave/workspace/Hadoop-Mapreduce-trunk-Java8/source/hadoop-mapreduce-project/hadoop-mapreduce-client/hadoop-mapreduce-client-jobclient/target/test-dir/test-job-cleanup/output-3/_SUCCESS" missing for job job_1464547071573_0004
Stack Trace:
java.lang.AssertionError: Done file "/home/jenkins/jenkins-slave/workspace/Hadoop-Mapreduce-trunk-Java8/source/hadoop-mapreduce-project/hadoop-mapreduce-client/hadoop-mapreduce-client-jobclient/target/test-dir/test-job-cleanup/output-3/_SUCCESS" missing for job job_1464547071573_0004
at org.junit.Assert.fail(Assert.java:88)
at org.junit.Assert.assertTrue(Assert.java:41)
at org.apache.hadoop.mapred.TestJobCleanup.testSuccessfulJob(TestJobCleanup.java:171)
at org.apache.hadoop.mapred.TestJobCleanup.testDefaultCleanupAndAbort(TestJobCleanup.java:268)
FAILED: org.apache.hadoop.mapred.TestJobCleanup.testCustomAbort
Error Message:
Done file "/home/jenkins/jenkins-slave/workspace/Hadoop-Mapreduce-trunk-Java8/source/hadoop-mapreduce-project/hadoop-mapreduce-client/hadoop-mapreduce-client-jobclient/target/test-dir/test-job-cleanup/output-4/_SUCCESS" missing for job job_1464547071573_0005
Stack Trace:
java.lang.AssertionError: Done file "/home/jenkins/jenkins-slave/workspace/Hadoop-Mapreduce-trunk-Java8/source/hadoop-mapreduce-project/hadoop-mapreduce-client/hadoop-mapreduce-client-jobclient/target/test-dir/test-job-cleanup/output-4/_SUCCESS" missing for job job_1464547071573_0005
at org.junit.Assert.fail(Assert.java:88)
at org.junit.Assert.assertTrue(Assert.java:41)
at org.apache.hadoop.mapred.TestJobCleanup.testSuccessfulJob(TestJobCleanup.java:171)
at org.apache.hadoop.mapred.TestJobCleanup.testCustomAbort(TestJobCleanup.java:288)
FAILED: org.apache.hadoop.mapred.TestJobCounters.testHeapUsageCounter
Error Message:
Job job_1464546768298_0001 failed!
Stack Trace:
java.lang.AssertionError: Job job_1464546768298_0001 failed!
at org.junit.Assert.fail(Assert.java:88)
at org.junit.Assert.assertTrue(Assert.java:41)
at org.apache.hadoop.mapred.TestJobCounters.runHeapUsageTestJob(TestJobCounters.java:633)
at org.apache.hadoop.mapred.TestJobCounters.testHeapUsageCounter(TestJobCounters.java:680)
FAILED: org.apache.hadoop.mapred.TestJobName.testComplexNameWithRegex
Error Message:
Job failed!
Stack Trace:
java.io.IOException: Job failed!
at org.apache.hadoop.mapred.JobClient.runJob(JobClient.java:876)
at org.apache.hadoop.mapred.TestJobName.testComplexNameWithRegex(TestJobName.java:95)
FAILED: org.apache.hadoop.mapred.TestJobName.testComplexName
Error Message:
Job failed!
Stack Trace:
java.io.IOException: Job failed!
at org.apache.hadoop.mapred.JobClient.runJob(JobClient.java:876)
at org.apache.hadoop.mapred.TestJobName.testComplexName(TestJobName.java:60)
FAILED: org.apache.hadoop.mapred.TestLazyOutput.testLazyOutput
Error Message:
Job failed!
Stack Trace:
java.io.IOException: Job failed!
at org.apache.hadoop.mapred.JobClient.runJob(JobClient.java:876)
at org.apache.hadoop.mapred.TestLazyOutput.runTestLazyOutput(TestLazyOutput.java:121)
at org.apache.hadoop.mapred.TestLazyOutput.testLazyOutput(TestLazyOutput.java:157)
FAILED: org.apache.hadoop.mapred.TestMRIntermediateDataEncryption.testMultipleMapsPerNode
Error Message:
expected:<8000> but was:<0>
Stack Trace:
java.lang.AssertionError: expected:<8000> but was:<0>
at org.junit.Assert.fail(Assert.java:88)
at org.junit.Assert.failNotEquals(Assert.java:743)
at org.junit.Assert.assertEquals(Assert.java:118)
at org.junit.Assert.assertEquals(Assert.java:555)
at org.junit.Assert.assertEquals(Assert.java:542)
at org.apache.hadoop.mapred.TestMRIntermediateDataEncryption.verifyOutput(TestMRIntermediateDataEncryption.java:200)
at org.apache.hadoop.mapred.TestMRIntermediateDataEncryption.runMergeTest(TestMRIntermediateDataEncryption.java:161)
at org.apache.hadoop.mapred.TestMRIntermediateDataEncryption.doEncryptionTest(TestMRIntermediateDataEncryption.java:95)
at org.apache.hadoop.mapred.TestMRIntermediateDataEncryption.doEncryptionTest(TestMRIntermediateDataEncryption.java:75)
at org.apache.hadoop.mapred.TestMRIntermediateDataEncryption.testMultipleMapsPerNode(TestMRIntermediateDataEncryption.java:65)
FAILED: org.apache.hadoop.mapred.TestMRIntermediateDataEncryption.testMultipleReducers
Error Message:
expected:<2000> but was:<0>
Stack Trace:
java.lang.AssertionError: expected:<2000> but was:<0>
at org.junit.Assert.fail(Assert.java:88)
at org.junit.Assert.failNotEquals(Assert.java:743)
at org.junit.Assert.assertEquals(Assert.java:118)
at org.junit.Assert.assertEquals(Assert.java:555)
at org.junit.Assert.assertEquals(Assert.java:542)
at org.apache.hadoop.mapred.TestMRIntermediateDataEncryption.verifyOutput(TestMRIntermediateDataEncryption.java:200)
at org.apache.hadoop.mapred.TestMRIntermediateDataEncryption.runMergeTest(TestMRIntermediateDataEncryption.java:161)
at org.apache.hadoop.mapred.TestMRIntermediateDataEncryption.doEncryptionTest(TestMRIntermediateDataEncryption.java:95)
at org.apache.hadoop.mapred.TestMRIntermediateDataEncryption.doEncryptionTest(TestMRIntermediateDataEncryption.java:75)
at org.apache.hadoop.mapred.TestMRIntermediateDataEncryption.testMultipleReducers(TestMRIntermediateDataEncryption.java:70)
FAILED: org.apache.hadoop.mapred.TestMRIntermediateDataEncryption.testSingleReducer
Error Message:
expected:<3000> but was:<0>
Stack Trace:
java.lang.AssertionError: expected:<3000> but was:<0>
at org.junit.Assert.fail(Assert.java:88)
at org.junit.Assert.failNotEquals(Assert.java:743)
at org.junit.Assert.assertEquals(Assert.java:118)
at org.junit.Assert.assertEquals(Assert.java:555)
at org.junit.Assert.assertEquals(Assert.java:542)
at org.apache.hadoop.mapred.TestMRIntermediateDataEncryption.verifyOutput(TestMRIntermediateDataEncryption.java:200)
at org.apache.hadoop.mapred.TestMRIntermediateDataEncryption.runMergeTest(TestMRIntermediateDataEncryption.java:161)
at org.apache.hadoop.mapred.TestMRIntermediateDataEncryption.doEncryptionTest(TestMRIntermediateDataEncryption.java:95)
at org.apache.hadoop.mapred.TestMRIntermediateDataEncryption.doEncryptionTest(TestMRIntermediateDataEncryption.java:75)
at org.apache.hadoop.mapred.TestMRIntermediateDataEncryption.testSingleReducer(TestMRIntermediateDataEncryption.java:55)
FAILED: org.apache.hadoop.mapred.TestMRTimelineEventHandling.testMRTimelineEventHandling
Error Message:
expected:<2> but was:<3>
Stack Trace:
java.lang.AssertionError: expected:<2> but was:<3>
at org.junit.Assert.fail(Assert.java:88)
at org.junit.Assert.failNotEquals(Assert.java:743)
at org.junit.Assert.assertEquals(Assert.java:118)
at org.junit.Assert.assertEquals(Assert.java:555)
at org.junit.Assert.assertEquals(Assert.java:542)
at org.apache.hadoop.mapred.TestMRTimelineEventHandling.testMRTimelineEventHandling(TestMRTimelineEventHandling.java:106)
FAILED: org.apache.hadoop.mapred.TestMRTimelineEventHandling.testMapreduceJobTimelineServiceEnabled
Error Message:
expected:<2> but was:<3>
Stack Trace:
java.lang.AssertionError: expected:<2> but was:<3>
at org.junit.Assert.fail(Assert.java:88)
at org.junit.Assert.failNotEquals(Assert.java:743)
at org.junit.Assert.assertEquals(Assert.java:118)
at org.junit.Assert.assertEquals(Assert.java:555)
at org.junit.Assert.assertEquals(Assert.java:542)
at org.apache.hadoop.mapred.TestMRTimelineEventHandling.testMapreduceJobTimelineServiceEnabled(TestMRTimelineEventHandling.java:165)
FAILED: org.apache.hadoop.mapred.TestMerge.testMerge
Error Message:
expected:<10000> but was:<0>
Stack Trace:
java.lang.AssertionError: expected:<10000> but was:<0>
at org.junit.Assert.fail(Assert.java:88)
at org.junit.Assert.failNotEquals(Assert.java:743)
at org.junit.Assert.assertEquals(Assert.java:118)
at org.junit.Assert.assertEquals(Assert.java:555)
at org.junit.Assert.assertEquals(Assert.java:542)
at org.apache.hadoop.mapred.TestMerge.verifyOutput(TestMerge.java:187)
at org.apache.hadoop.mapred.TestMerge.runMergeTest(TestMerge.java:147)
at org.apache.hadoop.mapred.TestMerge.testMerge(TestMerge.java:88)
FAILED: org.apache.hadoop.mapred.TestMiniMRChildTask.testTaskEnv
Error Message:
The environment checker job failed.
Stack Trace:
java.lang.AssertionError: The environment checker job failed.
at org.junit.Assert.fail(Assert.java:88)
at org.junit.Assert.assertTrue(Assert.java:41)
at org.apache.hadoop.mapred.TestMiniMRChildTask.runTestTaskEnv(TestMiniMRChildTask.java:550)
at org.apache.hadoop.mapred.TestMiniMRChildTask.testTaskEnv(TestMiniMRChildTask.java:472)
FAILED: org.apache.hadoop.mapred.TestMiniMRChildTask.testTaskOldEnv
Error Message:
The environment checker job failed.
Stack Trace:
java.lang.AssertionError: The environment checker job failed.
at org.junit.Assert.fail(Assert.java:88)
at org.junit.Assert.assertTrue(Assert.java:41)
at org.apache.hadoop.mapred.TestMiniMRChildTask.runTestTaskEnv(TestMiniMRChildTask.java:550)
at org.apache.hadoop.mapred.TestMiniMRChildTask.testTaskOldEnv(TestMiniMRChildTask.java:496)
FAILED: org.apache.hadoop.mapred.TestMiniMRChildTask.testMapRedExecutionEnv
Error Message:
null
Stack Trace:
java.lang.AssertionError: null
at org.junit.Assert.fail(Assert.java:86)
at org.junit.Assert.assertTrue(Assert.java:41)
at org.junit.Assert.assertTrue(Assert.java:52)
at org.apache.hadoop.mapred.TestMiniMRChildTask.launchTest(TestMiniMRChildTask.java:194)
at org.apache.hadoop.mapred.TestMiniMRChildTask.testMapRedExecutionEnv(TestMiniMRChildTask.java:448)
FAILED: org.apache.hadoop.mapred.TestMiniMRClientCluster.testJob
Error Message:
null
Stack Trace:
java.lang.AssertionError: null
at org.junit.Assert.fail(Assert.java:86)
at org.junit.Assert.assertTrue(Assert.java:41)
at org.junit.Assert.assertTrue(Assert.java:52)
at org.apache.hadoop.mapred.TestMiniMRClientCluster.testJob(TestMiniMRClientCluster.java:162)
FAILED: org.apache.hadoop.mapred.TestReduceFetch.testReduceFromMem
Error Message:
Job failed!
Stack Trace:
java.io.IOException: Job failed!
at org.apache.hadoop.mapred.JobClient.runJob(JobClient.java:876)
at org.apache.hadoop.mapred.TestReduceFetchFromPartialMem.runJob(TestReduceFetchFromPartialMem.java:292)
at org.apache.hadoop.mapred.TestReduceFetch.testReduceFromMem(TestReduceFetch.java:65)
FAILED: org.apache.hadoop.mapred.TestReduceFetch.testReduceFromDisk
Error Message:
Job failed!
Stack Trace:
java.io.IOException: Job failed!
at org.apache.hadoop.mapred.JobClient.runJob(JobClient.java:876)
at org.apache.hadoop.mapred.TestReduceFetchFromPartialMem.runJob(TestReduceFetchFromPartialMem.java:292)
at org.apache.hadoop.mapred.TestReduceFetch.testReduceFromDisk(TestReduceFetch.java:44)
FAILED: org.apache.hadoop.mapred.TestReduceFetch.testReduceFromPartialMem
Error Message:
Job failed!
Stack Trace:
java.io.IOException: Job failed!
at org.apache.hadoop.mapred.JobClient.runJob(JobClient.java:876)
at org.apache.hadoop.mapred.TestReduceFetchFromPartialMem.runJob(TestReduceFetchFromPartialMem.java:292)
at org.apache.hadoop.mapred.TestReduceFetchFromPartialMem.testReduceFromPartialMem(TestReduceFetchFromPartialMem.java:85)
at sun.reflect.NativeMethodAccessorImpl.invoke0(Native Method)
at sun.reflect.NativeMethodAccessorImpl.invoke(NativeMethodAccessorImpl.java:62)
at sun.reflect.DelegatingMethodAccessorImpl.invoke(DelegatingMethodAccessorImpl.java:43)
at java.lang.reflect.Method.invoke(Method.java:498)
at org.junit.runners.model.FrameworkMethod$1.runReflectiveCall(FrameworkMethod.java:47)
at org.junit.internal.runners.model.ReflectiveCallable.run(ReflectiveCallable.java:12)
at org.junit.runners.model.FrameworkMethod.invokeExplosively(FrameworkMethod.java:44)
at org.junit.internal.runners.statements.InvokeMethod.evaluate(InvokeMethod.java:17)
at org.junit.internal.runners.statements.RunBefores.evaluate(RunBefores.java:26)
at org.junit.internal.runners.statements.RunAfters.evaluate(RunAfters.java:27)
at org.junit.runners.ParentRunner.runLeaf(ParentRunner.java:271)
at org.junit.runners.BlockJUnit4ClassRunner.runChild(BlockJUnit4ClassRunner.java:70)
at org.junit.runners.BlockJUnit4ClassRunner.runChild(BlockJUnit4ClassRunner.java:50)
at org.junit.runners.ParentRunner$3.run(ParentRunner.java:238)
at org.junit.runners.ParentRunner$1.schedule(ParentRunner.java:63)
at org.junit.runners.ParentRunner.runChildren(ParentRunner.java:236)
at org.junit.runners.ParentRunner.access$000(ParentRunner.java:53)
at org.junit.runners.ParentRunner$2.evaluate(ParentRunner.java:229)
at org.junit.runners.ParentRunner.run(ParentRunner.java:309)
at org.apache.maven.surefire.junit4.JUnit4Provider.execute(JUnit4Provider.java:264)
at org.apache.maven.surefire.junit4.JUnit4Provider.executeTestSet(JUnit4Provider.java:153)
at org.apache.maven.surefire.junit4.JUnit4Provider.invoke(JUnit4Provider.java:124)
at org.apache.maven.surefire.booter.ForkedBooter.invokeProviderInSameClassLoader(ForkedBooter.java:200)
at org.apache.maven.surefire.booter.ForkedBooter.runSuitesInProcess(ForkedBooter.java:153)
at org.apache.maven.surefire.booter.ForkedBooter.main(ForkedBooter.java:103)
FAILED: org.apache.hadoop.mapred.TestReduceFetchFromPartialMem.testReduceFromPartialMem
Error Message:
Job failed!
Stack Trace:
java.io.IOException: Job failed!
at org.apache.hadoop.mapred.JobClient.runJob(JobClient.java:876)
at org.apache.hadoop.mapred.TestReduceFetchFromPartialMem.runJob(TestReduceFetchFromPartialMem.java:292)
at org.apache.hadoop.mapred.TestReduceFetchFromPartialMem.testReduceFromPartialMem(TestReduceFetchFromPartialMem.java:85)
FAILED: org.apache.hadoop.mapreduce.TestChild.testChild
Error Message:
null
Stack Trace:
java.lang.AssertionError: null
at org.junit.Assert.fail(Assert.java:86)
at org.junit.Assert.assertTrue(Assert.java:41)
at org.junit.Assert.assertTrue(Assert.java:52)
at org.apache.hadoop.mapreduce.TestChild.submitAndValidateJob(TestChild.java:144)
at org.apache.hadoop.mapreduce.TestChild.testChild(TestChild.java:159)
FAILED: org.apache.hadoop.mapreduce.TestLargeSort.testLargeSort
Error Message:
Large sort failed for 128 expected:<0> but was:<1>
Stack Trace:
java.lang.AssertionError: Large sort failed for 128 expected:<0> but was:<1>
at org.junit.Assert.fail(Assert.java:88)
at org.junit.Assert.failNotEquals(Assert.java:743)
at org.junit.Assert.assertEquals(Assert.java:118)
at org.junit.Assert.assertEquals(Assert.java:555)
at org.apache.hadoop.mapreduce.TestLargeSort.testLargeSort(TestLargeSort.java:62)
FAILED: org.apache.hadoop.mapreduce.TestMRJobClient.testJobClient
Error Message:
Exit code expected:<0> but was:<-1>
Stack Trace:
java.lang.AssertionError: Exit code expected:<0> but was:<-1>
at org.junit.Assert.fail(Assert.java:88)
at org.junit.Assert.failNotEquals(Assert.java:743)
at org.junit.Assert.assertEquals(Assert.java:118)
at org.junit.Assert.assertEquals(Assert.java:555)
at org.apache.hadoop.mapreduce.TestMRJobClient.testGetCounter(TestMRJobClient.java:630)
at org.apache.hadoop.mapreduce.TestMRJobClient.testJobClient(TestMRJobClient.java:146)
FAILED: org.apache.hadoop.mapreduce.TestMapReduceLazyOutput.testLazyOutput
Error Message:
null
Stack Trace:
java.lang.AssertionError: null
at org.junit.Assert.fail(Assert.java:86)
at org.junit.Assert.assertTrue(Assert.java:41)
at org.junit.Assert.assertTrue(Assert.java:52)
at org.apache.hadoop.mapreduce.TestMapReduceLazyOutput.runTestLazyOutput(TestMapReduceLazyOutput.java:111)
at org.apache.hadoop.mapreduce.TestMapReduceLazyOutput.testLazyOutput(TestMapReduceLazyOutput.java:147)
FAILED: org.apache.hadoop.mapreduce.lib.output.TestJobOutputCommitter.testCustomCleanup
Error Message:
Job failed!
Stack Trace:
java.lang.AssertionError: Job failed!
at org.junit.Assert.fail(Assert.java:88)
at org.junit.Assert.assertTrue(Assert.java:41)
at org.apache.hadoop.mapreduce.lib.output.TestJobOutputCommitter.testSuccessfulJob(TestJobOutputCommitter.java:154)
at org.apache.hadoop.mapreduce.lib.output.TestJobOutputCommitter.testCustomCleanup(TestJobOutputCommitter.java:277)
FAILED: org.apache.hadoop.mapreduce.lib.output.TestJobOutputCommitter.testDefaultCleanupAndAbort
Error Message:
Job failed!
Stack Trace:
java.lang.AssertionError: Job failed!
at org.junit.Assert.fail(Assert.java:88)
at org.junit.Assert.assertTrue(Assert.java:41)
at org.apache.hadoop.mapreduce.lib.output.TestJobOutputCommitter.testSuccessfulJob(TestJobOutputCommitter.java:154)
at org.apache.hadoop.mapreduce.lib.output.TestJobOutputCommitter.testDefaultCleanupAndAbort(TestJobOutputCommitter.java:230)
FAILED: org.apache.hadoop.mapreduce.lib.output.TestJobOutputCommitter.testCustomAbort
Error Message:
Job failed!
Stack Trace:
java.lang.AssertionError: Job failed!
at org.junit.Assert.fail(Assert.java:88)
at org.junit.Assert.assertTrue(Assert.java:41)
at org.apache.hadoop.mapreduce.lib.output.TestJobOutputCommitter.testSuccessfulJob(TestJobOutputCommitter.java:154)
at org.apache.hadoop.mapreduce.lib.output.TestJobOutputCommitter.testCustomAbort(TestJobOutputCommitter.java:250)
FAILED: org.apache.hadoop.mapreduce.security.TestBinaryTokenFile.testBinaryTokenFile
Error Message:
dist job res is not 0: expected:<0> but was:<1>
Stack Trace:
java.lang.AssertionError: dist job res is not 0: expected:<0> but was:<1>
at org.junit.Assert.fail(Assert.java:88)
at org.junit.Assert.failNotEquals(Assert.java:743)
at org.junit.Assert.assertEquals(Assert.java:118)
at org.junit.Assert.assertEquals(Assert.java:555)
at org.apache.hadoop.mapreduce.security.TestBinaryTokenFile.testBinaryTokenFile(TestBinaryTokenFile.java:260)
FAILED: org.apache.hadoop.mapreduce.security.TestBinaryTokenFile.testTokenCacheFile
Error Message:
dist job res is not 0: expected:<0> but was:<1>
Stack Trace:
java.lang.AssertionError: dist job res is not 0: expected:<0> but was:<1>
at org.junit.Assert.fail(Assert.java:88)
at org.junit.Assert.failNotEquals(Assert.java:743)
at org.junit.Assert.assertEquals(Assert.java:118)
at org.junit.Assert.assertEquals(Assert.java:555)
at org.apache.hadoop.mapreduce.security.TestBinaryTokenFile.testTokenCacheFile(TestBinaryTokenFile.java:289)
FAILED: org.apache.hadoop.mapreduce.security.TestMRCredentials.test
Error Message:
dist job res is not 0 expected:<1> but was:<0>
Stack Trace:
java.lang.AssertionError: dist job res is not 0 expected:<1> but was:<0>
at org.junit.Assert.fail(Assert.java:88)
at org.junit.Assert.failNotEquals(Assert.java:743)
at org.junit.Assert.assertEquals(Assert.java:118)
at org.junit.Assert.assertEquals(Assert.java:555)
at org.apache.hadoop.mapreduce.security.TestMRCredentials.test(TestMRCredentials.java:135)
FAILED: org.apache.hadoop.mapreduce.security.TestUmbilicalProtocolWithJobToken.testJobTokenRpc
Error Message:
null
Stack Trace:
java.lang.reflect.UndeclaredThrowableException: null
at org.apache.hadoop.ipc.ProtobufRpcEngine$Invoker.invoke(ProtobufRpcEngine.java:211)
at com.sun.proxy.$Proxy9.statusUpdate(Unknown Source)
at org.apache.hadoop.mapreduce.security.TestUmbilicalProtocolWithJobToken$1.run(TestUmbilicalProtocolWithJobToken.java:118)
at java.security.AccessController.doPrivileged(Native Method)
at javax.security.auth.Subject.doAs(Subject.java:422)
at org.apache.hadoop.security.UserGroupInformation.doAs(UserGroupInformation.java:1755)
at org.apache.hadoop.mapreduce.security.TestUmbilicalProtocolWithJobToken.testJobTokenRpc(TestUmbilicalProtocolWithJobToken.java:110)
FAILED: org.apache.hadoop.mapreduce.security.ssl.TestEncryptedShuffle.encryptedShuffleWithClientCerts
Error Message:
null
Stack Trace:
java.lang.AssertionError: null
at org.junit.Assert.fail(Assert.java:86)
at org.junit.Assert.assertTrue(Assert.java:41)
at org.junit.Assert.assertTrue(Assert.java:52)
at org.apache.hadoop.mapreduce.security.ssl.TestEncryptedShuffle.encryptedShuffleWithCerts(TestEncryptedShuffle.java:159)
at org.apache.hadoop.mapreduce.security.ssl.TestEncryptedShuffle.encryptedShuffleWithClientCerts(TestEncryptedShuffle.java:167)
FAILED: org.apache.hadoop.mapreduce.security.ssl.TestEncryptedShuffle.encryptedShuffleWithoutClientCerts
Error Message:
null
Stack Trace:
java.lang.AssertionError: null
at org.junit.Assert.fail(Assert.java:86)
at org.junit.Assert.assertTrue(Assert.java:41)
at org.junit.Assert.assertTrue(Assert.java:52)
at org.apache.hadoop.mapreduce.security.ssl.TestEncryptedShuffle.encryptedShuffleWithCerts(TestEncryptedShuffle.java:159)
at org.apache.hadoop.mapreduce.security.ssl.TestEncryptedShuffle.encryptedShuffleWithoutClientCerts(TestEncryptedShuffle.java:172)
FAILED: org.apache.hadoop.mapreduce.v2.TestMRAMWithNonNormalizedCapabilities.testJobWithNonNormalizedCapabilities
Error Message:
Job should be completed
Stack Trace:
java.lang.AssertionError: Job should be completed
at org.junit.Assert.fail(Assert.java:88)
at org.junit.Assert.assertTrue(Assert.java:41)
at org.apache.hadoop.mapreduce.v2.TestMRAMWithNonNormalizedCapabilities.testJobWithNonNormalizedCapabilities(TestMRAMWithNonNormalizedCapabilities.java:104)
FAILED: org.apache.hadoop.mapreduce.v2.TestMRJobs.testDistributedCache
Error Message:
null
Stack Trace:
java.lang.AssertionError: null
at org.junit.Assert.fail(Assert.java:86)
at org.junit.Assert.assertTrue(Assert.java:41)
at org.junit.Assert.assertTrue(Assert.java:52)
at org.apache.hadoop.mapreduce.v2.TestMRJobs._testDistributedCache(TestMRJobs.java:960)
at org.apache.hadoop.mapreduce.v2.TestMRJobs.testDistributedCache(TestMRJobs.java:970)
FAILED: org.apache.hadoop.mapreduce.v2.TestMRJobs.testSleepJobWithRemoteJar
Error Message:
null
Stack Trace:
java.lang.AssertionError: null
at org.junit.Assert.fail(Assert.java:86)
at org.junit.Assert.assertTrue(Assert.java:41)
at org.junit.Assert.assertTrue(Assert.java:52)
at org.apache.hadoop.mapreduce.v2.TestMRJobs.testSleepJobInternal(TestMRJobs.java:235)
at org.apache.hadoop.mapreduce.v2.TestMRJobs.testSleepJobWithRemoteJar(TestMRJobs.java:198)
FAILED: org.apache.hadoop.mapreduce.v2.TestMRJobs.testConfVerificationWithJobClient
Error Message:
Job status: Task failed task_1464544636893_0003_m_000000
Job failed as tasks failed. failedMaps:1 failedReduces:0
Stack Trace:
java.lang.AssertionError: Job status: Task failed task_1464544636893_0003_m_000000
Job failed as tasks failed. failedMaps:1 failedReduces:0
at org.junit.Assert.fail(Assert.java:88)
at org.junit.Assert.assertTrue(Assert.java:41)
at org.apache.hadoop.mapreduce.v2.TestMRJobs.testConfVerification(TestMRJobs.java:416)
at org.apache.hadoop.mapreduce.v2.TestMRJobs.testConfVerificationWithJobClient(TestMRJobs.java:326)
FAILED: org.apache.hadoop.mapreduce.v2.TestMRJobs.testConfVerificationWithClassloaderCustomClasses
Error Message:
Job status: Task failed task_1464544636893_0005_m_000000
Job failed as tasks failed. failedMaps:1 failedReduces:0
Stack Trace:
java.lang.AssertionError: Job status: Task failed task_1464544636893_0005_m_000000
Job failed as tasks failed. failedMaps:1 failedReduces:0
at org.junit.Assert.fail(Assert.java:88)
at org.junit.Assert.assertTrue(Assert.java:41)
at org.apache.hadoop.mapreduce.v2.TestMRJobs.testConfVerification(TestMRJobs.java:416)
at org.apache.hadoop.mapreduce.v2.TestMRJobs.testConfVerificationWithClassloaderCustomClasses(TestMRJobs.java:316)
FAILED: org.apache.hadoop.mapreduce.v2.TestMRJobs.testSleepJob
Error Message:
null
Stack Trace:
java.lang.AssertionError: null
at org.junit.Assert.fail(Assert.java:86)
at org.junit.Assert.assertTrue(Assert.java:41)
at org.junit.Assert.assertTrue(Assert.java:52)
at org.apache.hadoop.mapreduce.v2.TestMRJobs.testSleepJobInternal(TestMRJobs.java:235)
at org.apache.hadoop.mapreduce.v2.TestMRJobs.testSleepJob(TestMRJobs.java:193)
FAILED: org.apache.hadoop.mapreduce.v2.TestMRJobs.testConfVerificationWithOutClassloader
Error Message:
Job status: Task failed task_1464544636893_0007_m_000000
Job failed as tasks failed. failedMaps:1 failedReduces:0
Stack Trace:
java.lang.AssertionError: Job status: Task failed task_1464544636893_0007_m_000000
Job failed as tasks failed. failedMaps:1 failedReduces:0
at org.junit.Assert.fail(Assert.java:88)
at org.junit.Assert.assertTrue(Assert.java:41)
at org.apache.hadoop.mapreduce.v2.TestMRJobs.testConfVerification(TestMRJobs.java:416)
at org.apache.hadoop.mapreduce.v2.TestMRJobs.testConfVerificationWithOutClassloader(TestMRJobs.java:321)
FAILED: org.apache.hadoop.mapreduce.v2.TestMRJobs.testRandomWriter
Error Message:
null
Stack Trace:
java.lang.AssertionError: null
at org.junit.Assert.fail(Assert.java:86)
at org.junit.Assert.assertTrue(Assert.java:41)
at org.junit.Assert.assertTrue(Assert.java:52)
at org.apache.hadoop.mapreduce.v2.TestMRJobs.testRandomWriter(TestMRJobs.java:513)
FAILED: org.apache.hadoop.mapreduce.v2.TestMRJobs.testContainerRollingLog
Error Message:
No MapTask log found! expected:<1> but was:<4>
Stack Trace:
java.lang.AssertionError: No MapTask log found! expected:<1> but was:<4>
at org.junit.Assert.fail(Assert.java:88)
at org.junit.Assert.failNotEquals(Assert.java:743)
at org.junit.Assert.assertEquals(Assert.java:118)
at org.junit.Assert.assertEquals(Assert.java:555)
at org.apache.hadoop.mapreduce.v2.TestMRJobs.testContainerRollingLog(TestMRJobs.java:790)
FAILED: org.apache.hadoop.mapreduce.v2.TestMRJobs.testJobWithChangePriority
Error Message:
null
Stack Trace:
java.lang.AssertionError: null
at org.junit.Assert.fail(Assert.java:86)
at org.junit.Assert.assertTrue(Assert.java:41)
at org.junit.Assert.assertTrue(Assert.java:52)
at org.apache.hadoop.mapreduce.v2.TestMRJobs.testJobWithChangePriority(TestMRJobs.java:289)
FAILED: org.apache.hadoop.mapreduce.v2.TestMRJobs.testConfVerificationWithClassloader
Error Message:
Job status: Task failed task_1464544636893_0011_m_000000
Job failed as tasks failed. failedMaps:1 failedReduces:0
Stack Trace:
java.lang.AssertionError: Job status: Task failed task_1464544636893_0011_m_000000
Job failed as tasks failed. failedMaps:1 failedReduces:0
at org.junit.Assert.fail(Assert.java:88)
at org.junit.Assert.assertTrue(Assert.java:41)
at org.apache.hadoop.mapreduce.v2.TestMRJobs.testConfVerification(TestMRJobs.java:416)
at org.apache.hadoop.mapreduce.v2.TestMRJobs.testConfVerificationWithClassloader(TestMRJobs.java:310)
FAILED: org.apache.hadoop.mapreduce.v2.TestMRJobsWithHistoryService.testJobHistoryData
Error Message:
expected:<null> but was:<Counters: 13
Job Counters
Failed map tasks=10
Killed map tasks=2
Killed reduce tasks=2
Launched map tasks=12
Other local map tasks=12
Total time spent by all maps in occupied slots (ms)=20767
Total time spent by all reduces in occupied slots (ms)=0
Total time spent by all map tasks (ms)=20767
Total vcore-milliseconds taken by all map tasks=20767
Total megabyte-milliseconds taken by all map tasks=21265408
Map-Reduce Framework
CPU time spent (ms)=0
Physical memory (bytes) snapshot=0
Virtual memory (bytes) snapshot=0>
Stack Trace:
java.lang.AssertionError: expected:<null> but was:<Counters: 13
Job Counters
Failed map tasks=10
Killed map tasks=2
Killed reduce tasks=2
Launched map tasks=12
Other local map tasks=12
Total time spent by all maps in occupied slots (ms)=20767
Total time spent by all reduces in occupied slots (ms)=0
Total time spent by all map tasks (ms)=20767
Total vcore-milliseconds taken by all map tasks=20767
Total megabyte-milliseconds taken by all map tasks=21265408
Map-Reduce Framework
CPU time spent (ms)=0
Physical memory (bytes) snapshot=0
Virtual memory (bytes) snapshot=0>
at org.junit.Assert.fail(Assert.java:88)
at org.junit.Assert.failNotEquals(Assert.java:743)
at org.junit.Assert.assertEquals(Assert.java:118)
at org.junit.Assert.assertEquals(Assert.java:144)
at org.apache.hadoop.mapreduce.v2.TestMRJobsWithHistoryService.testJobHistoryData(TestMRJobsWithHistoryService.java:158)
FAILED: org.apache.hadoop.mapreduce.v2.TestMRJobsWithProfiler.testDefaultProfiler
Error Message:
expected:<4> but was:<0>
Stack Trace:
java.lang.AssertionError: expected:<4> but was:<0>
at org.junit.Assert.fail(Assert.java:88)
at org.junit.Assert.failNotEquals(Assert.java:743)
at org.junit.Assert.assertEquals(Assert.java:118)
at org.junit.Assert.assertEquals(Assert.java:555)
at org.junit.Assert.assertEquals(Assert.java:542)
at org.apache.hadoop.mapreduce.v2.TestMRJobsWithProfiler.testProfilerInternal(TestMRJobsWithProfiler.java:212)
at org.apache.hadoop.mapreduce.v2.TestMRJobsWithProfiler.testDefaultProfiler(TestMRJobsWithProfiler.java:111)
FAILED: org.apache.hadoop.mapreduce.v2.TestMRJobsWithProfiler.testDifferentProfilers
Error Message:
expected:<4> but was:<0>
Stack Trace:
java.lang.AssertionError: expected:<4> but was:<0>
at org.junit.Assert.fail(Assert.java:88)
at org.junit.Assert.failNotEquals(Assert.java:743)
at org.junit.Assert.assertEquals(Assert.java:118)
at org.junit.Assert.assertEquals(Assert.java:555)
at org.junit.Assert.assertEquals(Assert.java:542)
at org.apache.hadoop.mapreduce.v2.TestMRJobsWithProfiler.testProfilerInternal(TestMRJobsWithProfiler.java:212)
at org.apache.hadoop.mapreduce.v2.TestMRJobsWithProfiler.testDifferentProfilers(TestMRJobsWithProfiler.java:117)
FAILED: org.apache.hadoop.mapreduce.v2.TestMROldApiJobs.testJobFail
Error Message:
null
Stack Trace:
java.lang.AssertionError: null
at org.junit.Assert.fail(Assert.java:86)
at org.junit.Assert.assertTrue(Assert.java:41)
at org.junit.Assert.assertTrue(Assert.java:52)
at org.apache.hadoop.mapreduce.v2.TestMROldApiJobs.testJobFail(TestMROldApiJobs.java:151)
FAILED: org.apache.hadoop.mapreduce.v2.TestMROldApiJobs.testJobSucceed
Error Message:
Job expected to succeed failed
Stack Trace:
java.lang.AssertionError: Job expected to succeed failed
at org.junit.Assert.fail(Assert.java:88)
at org.junit.Assert.assertTrue(Assert.java:41)
at org.apache.hadoop.mapreduce.v2.TestMROldApiJobs.runJobSucceed(TestMROldApiJobs.java:178)
at org.apache.hadoop.mapreduce.v2.TestMROldApiJobs.testJobSucceed(TestMROldApiJobs.java:116)
FAILED: org.apache.hadoop.mapreduce.v2.TestMiniMRProxyUser.__testCurrentUser
Error Message:
null
Stack Trace:
java.lang.AssertionError: null
at org.junit.Assert.fail(Assert.java:86)
at org.junit.Assert.assertTrue(Assert.java:41)
at org.junit.Assert.assertTrue(Assert.java:52)
at org.apache.hadoop.mapreduce.v2.TestMiniMRProxyUser.mrRun(TestMiniMRProxyUser.java:127)
at org.apache.hadoop.mapreduce.v2.TestMiniMRProxyUser.__testCurrentUser(TestMiniMRProxyUser.java:132)
FAILED: org.apache.hadoop.mapreduce.v2.TestMiniMRProxyUser.testValidProxyUser
Error Message:
null
Stack Trace:
java.lang.AssertionError: null
at org.junit.Assert.fail(Assert.java:86)
at org.junit.Assert.assertTrue(Assert.java:41)
at org.junit.Assert.assertTrue(Assert.java:52)
at org.apache.hadoop.mapreduce.v2.TestMiniMRProxyUser.mrRun(TestMiniMRProxyUser.java:127)
at org.apache.hadoop.mapreduce.v2.TestMiniMRProxyUser.access$000(TestMiniMRProxyUser.java:43)
FAILED: org.apache.hadoop.mapreduce.v2.TestSpeculativeExecution.testSpeculativeExecution
Error Message:
null
Stack Trace:
java.lang.AssertionError: null
at org.junit.Assert.fail(Assert.java:86)
at org.junit.Assert.assertTrue(Assert.java:41)
at org.junit.Assert.assertTrue(Assert.java:52)
at org.apache.hadoop.mapreduce.v2.TestSpeculativeExecution.testSpeculativeExecution(TestSpeculativeExecution.java:210)
Hadoop-Mapreduce-trunk-Java8 - Build # 1499 - Still Failing
Posted by Apache Jenkins Server <je...@builds.apache.org>.
See https://builds.apache.org/job/Hadoop-Mapreduce-trunk-Java8/1499/
###################################################################################
########################## LAST 60 LINES OF THE CONSOLE ###########################
[...truncated 20551 lines...]
[WARNING] The following patterns were never triggered in this artifact exclusion filter:
o 'org.apache.hadoop:hadoop-common'
o 'org.apache.hadoop:hadoop-hdfs'
o 'jdiff:jdiff:jar'
[INFO] ------------------------------------------------------------------------
[INFO] Reactor Summary:
[INFO]
[INFO] Apache Hadoop MapReduce Client ..................... SUCCESS [ 5.959 s]
[INFO] Apache Hadoop MapReduce Core ....................... SUCCESS [02:55 min]
[INFO] Apache Hadoop MapReduce Common ..................... SUCCESS [01:20 min]
[INFO] Apache Hadoop MapReduce Shuffle .................... SUCCESS [ 17.250 s]
[INFO] Apache Hadoop MapReduce App ........................ SUCCESS [09:40 min]
[INFO] Apache Hadoop MapReduce HistoryServer .............. SUCCESS [06:44 min]
[INFO] Apache Hadoop MapReduce JobClient .................. FAILURE [ 01:53 h]
[INFO] Apache Hadoop MapReduce HistoryServer Plugins ...... SUCCESS [ 6.682 s]
[INFO] Apache Hadoop MapReduce NativeTask ................. FAILURE [07:47 min]
[INFO] Apache Hadoop MapReduce Examples ................... SKIPPED
[INFO] Apache Hadoop MapReduce ............................ FAILURE [ 1.091 s]
[INFO] ------------------------------------------------------------------------
[INFO] BUILD FAILURE
[INFO] ------------------------------------------------------------------------
[INFO] Total time: 02:22 h
[INFO] Finished at: 2016-06-04T05:10:47+00:00
[INFO] Final Memory: 115M/2353M
[INFO] ------------------------------------------------------------------------
[WARNING] The requested profile "docs" could not be activated because it does not exist.
[WARNING] The requested profile "parallel-tests" could not be activated because it does not exist.
[ERROR] Failed to execute goal org.apache.maven.plugins:maven-surefire-plugin:2.17:test (default-test) on project hadoop-mapreduce-client-jobclient: There are test failures.
[ERROR]
[ERROR] Please refer to /home/jenkins/jenkins-slave/workspace/Hadoop-Mapreduce-trunk-Java8/source/hadoop-mapreduce-project/hadoop-mapreduce-client/hadoop-mapreduce-client-jobclient/target/surefire-reports for the individual test results.
[ERROR] -> [Help 1]
[ERROR] Failed to execute goal org.apache.hadoop:hadoop-maven-plugins:3.0.0-alpha1-SNAPSHOT:cmake-test (nttest) on project hadoop-mapreduce-client-nativetask: Test /home/jenkins/jenkins-slave/workspace/Hadoop-Mapreduce-trunk-Java8/source/hadoop-mapreduce-project/hadoop-mapreduce-client/hadoop-mapreduce-client-nativetask/target/native/test/nttest returned ERROR CODE 127 -> [Help 2]
[ERROR] Failed to execute goal org.apache.maven.plugins:maven-assembly-plugin:2.4:single (package-mapreduce) on project hadoop-mapreduce: Failed to create assembly: Error adding file 'org.apache.hadoop:hadoop-mapreduce-client-jobclient:jar:3.0.0-alpha1-SNAPSHOT' to archive: /home/jenkins/jenkins-slave/workspace/Hadoop-Mapreduce-trunk-Java8/source/hadoop-mapreduce-project/hadoop-mapreduce-client/hadoop-mapreduce-client-jobclient/target/classes isn't a file. -> [Help 2]
[ERROR]
[ERROR] To see the full stack trace of the errors, re-run Maven with the -e switch.
[ERROR] Re-run Maven using the -X switch to enable full debug logging.
[ERROR]
[ERROR] For more information about the errors and possible solutions, please read the following articles:
[ERROR] [Help 1] http://cwiki.apache.org/confluence/display/MAVEN/MojoFailureException
[ERROR] [Help 2] http://cwiki.apache.org/confluence/display/MAVEN/MojoExecutionException
[ERROR]
[ERROR] After correcting the problems, you can resume the build with the command
[ERROR] mvn <goals> -rf :hadoop-mapreduce-client-jobclient
Build step 'Execute shell' marked build as failure
[FINDBUGS] Skipping publisher since build result is FAILURE
Archiving artifacts
Setting LATEST1_8_HOME=/home/jenkins/jenkins-slave/tools/hudson.model.JDK/latest1.8
Setting MAVEN_3_3_3_HOME=/home/jenkins/jenkins-slave/tools/hudson.tasks.Maven_MavenInstallation/maven-3.3.3
Recording test results
Setting LATEST1_8_HOME=/home/jenkins/jenkins-slave/tools/hudson.model.JDK/latest1.8
Setting MAVEN_3_3_3_HOME=/home/jenkins/jenkins-slave/tools/hudson.tasks.Maven_MavenInstallation/maven-3.3.3
Email was triggered for: Failure - Any
Sending email for trigger: Failure - Any
Setting LATEST1_8_HOME=/home/jenkins/jenkins-slave/tools/hudson.model.JDK/latest1.8
Setting MAVEN_3_3_3_HOME=/home/jenkins/jenkins-slave/tools/hudson.tasks.Maven_MavenInstallation/maven-3.3.3
Setting LATEST1_8_HOME=/home/jenkins/jenkins-slave/tools/hudson.model.JDK/latest1.8
Setting MAVEN_3_3_3_HOME=/home/jenkins/jenkins-slave/tools/hudson.tasks.Maven_MavenInstallation/maven-3.3.3
###################################################################################
############################## FAILED TESTS (if any) ##############################
3 tests failed.
FAILED: org.apache.hadoop.mapred.TestMRCJCFileOutputCommitter.testAbort
Error Message:
Output directory not empty expected:<0> but was:<4>
Stack Trace:
java.lang.AssertionError: Output directory not empty expected:<0> but was:<4>
at org.junit.Assert.fail(Assert.java:88)
at org.junit.Assert.failNotEquals(Assert.java:743)
at org.junit.Assert.assertEquals(Assert.java:118)
at org.junit.Assert.assertEquals(Assert.java:555)
at org.apache.hadoop.mapred.TestMRCJCFileOutputCommitter.testAbort(TestMRCJCFileOutputCommitter.java:153)
FAILED: org.apache.hadoop.mapred.TestMiniMRChildTask.testTaskEnv
Error Message:
The environment checker job failed.
Stack Trace:
java.lang.AssertionError: The environment checker job failed.
at org.junit.Assert.fail(Assert.java:88)
at org.junit.Assert.assertTrue(Assert.java:41)
at org.apache.hadoop.mapred.TestMiniMRChildTask.runTestTaskEnv(TestMiniMRChildTask.java:550)
at org.apache.hadoop.mapred.TestMiniMRChildTask.testTaskEnv(TestMiniMRChildTask.java:472)
FAILED: org.apache.hadoop.mapred.TestMiniMRChildTask.testTaskOldEnv
Error Message:
The environment checker job failed.
Stack Trace:
java.lang.AssertionError: The environment checker job failed.
at org.junit.Assert.fail(Assert.java:88)
at org.junit.Assert.assertTrue(Assert.java:41)
at org.apache.hadoop.mapred.TestMiniMRChildTask.runTestTaskEnv(TestMiniMRChildTask.java:550)
at org.apache.hadoop.mapred.TestMiniMRChildTask.testTaskOldEnv(TestMiniMRChildTask.java:496)
Hadoop-Mapreduce-trunk-Java8 - Build # 1498 - Still Failing
Posted by Apache Jenkins Server <je...@builds.apache.org>.
See https://builds.apache.org/job/Hadoop-Mapreduce-trunk-Java8/1498/
###################################################################################
########################## LAST 60 LINES OF THE CONSOLE ###########################
[...truncated 20611 lines...]
[INFO] Executed tasks
[INFO]
[INFO] --- maven-assembly-plugin:2.4:single (package-mapreduce) @ hadoop-mapreduce ---
[WARNING] The following patterns were never triggered in this artifact inclusion filter:
o 'org.apache.hadoop:hadoop-yarn-server-tests'
[INFO] ------------------------------------------------------------------------
[INFO] Reactor Summary:
[INFO]
[INFO] Apache Hadoop MapReduce Client ..................... SUCCESS [ 5.628 s]
[INFO] Apache Hadoop MapReduce Core ....................... SUCCESS [02:36 min]
[INFO] Apache Hadoop MapReduce Common ..................... SUCCESS [01:02 min]
[INFO] Apache Hadoop MapReduce Shuffle .................... SUCCESS [ 16.238 s]
[INFO] Apache Hadoop MapReduce App ........................ SUCCESS [08:51 min]
[INFO] Apache Hadoop MapReduce HistoryServer .............. SUCCESS [06:07 min]
[INFO] Apache Hadoop MapReduce JobClient .................. FAILURE [ 01:50 h]
[INFO] Apache Hadoop MapReduce HistoryServer Plugins ...... SUCCESS [ 7.486 s]
[INFO] Apache Hadoop MapReduce NativeTask ................. FAILURE [07:53 min]
[INFO] Apache Hadoop MapReduce Examples ................... SKIPPED
[INFO] Apache Hadoop MapReduce ............................ FAILURE [ 1.265 s]
[INFO] ------------------------------------------------------------------------
[INFO] BUILD FAILURE
[INFO] ------------------------------------------------------------------------
[INFO] Total time: 02:17 h
[INFO] Finished at: 2016-06-04T02:45:04+00:00
[INFO] Final Memory: 115M/2426M
[INFO] ------------------------------------------------------------------------
[WARNING] The requested profile "docs" could not be activated because it does not exist.
[WARNING] The requested profile "parallel-tests" could not be activated because it does not exist.
[ERROR] Failed to execute goal org.apache.maven.plugins:maven-surefire-plugin:2.17:test (default-test) on project hadoop-mapreduce-client-jobclient: There are test failures.
[ERROR]
[ERROR] Please refer to /home/jenkins/jenkins-slave/workspace/Hadoop-Mapreduce-trunk-Java8/source/hadoop-mapreduce-project/hadoop-mapreduce-client/hadoop-mapreduce-client-jobclient/target/surefire-reports for the individual test results.
[ERROR] -> [Help 1]
[ERROR] Failed to execute goal org.apache.hadoop:hadoop-maven-plugins:3.0.0-alpha1-SNAPSHOT:cmake-test (nttest) on project hadoop-mapreduce-client-nativetask: Test /home/jenkins/jenkins-slave/workspace/Hadoop-Mapreduce-trunk-Java8/source/hadoop-mapreduce-project/hadoop-mapreduce-client/hadoop-mapreduce-client-nativetask/target/native/test/nttest returned ERROR CODE 127 -> [Help 2]
[ERROR] Failed to execute goal org.apache.maven.plugins:maven-assembly-plugin:2.4:single (package-mapreduce) on project hadoop-mapreduce: Failed to create assembly: Error adding file 'org.apache.hadoop:hadoop-mapreduce-client-jobclient:jar:3.0.0-alpha1-SNAPSHOT' to archive: /home/jenkins/jenkins-slave/workspace/Hadoop-Mapreduce-trunk-Java8/source/hadoop-mapreduce-project/hadoop-mapreduce-client/hadoop-mapreduce-client-jobclient/target/classes isn't a file. -> [Help 2]
[ERROR]
[ERROR] To see the full stack trace of the errors, re-run Maven with the -e switch.
[ERROR] Re-run Maven using the -X switch to enable full debug logging.
[ERROR]
[ERROR] For more information about the errors and possible solutions, please read the following articles:
[ERROR] [Help 1] http://cwiki.apache.org/confluence/display/MAVEN/MojoFailureException
[ERROR] [Help 2] http://cwiki.apache.org/confluence/display/MAVEN/MojoExecutionException
[ERROR]
[ERROR] After correcting the problems, you can resume the build with the command
[ERROR] mvn <goals> -rf :hadoop-mapreduce-client-jobclient
Build step 'Execute shell' marked build as failure
[FINDBUGS] Skipping publisher since build result is FAILURE
Archiving artifacts
Setting LATEST1_8_HOME=/home/jenkins/jenkins-slave/tools/hudson.model.JDK/latest1.8
Setting MAVEN_3_3_3_HOME=/home/jenkins/jenkins-slave/tools/hudson.tasks.Maven_MavenInstallation/maven-3.3.3
Recording test results
Setting LATEST1_8_HOME=/home/jenkins/jenkins-slave/tools/hudson.model.JDK/latest1.8
Setting MAVEN_3_3_3_HOME=/home/jenkins/jenkins-slave/tools/hudson.tasks.Maven_MavenInstallation/maven-3.3.3
Email was triggered for: Failure - Any
Sending email for trigger: Failure - Any
Setting LATEST1_8_HOME=/home/jenkins/jenkins-slave/tools/hudson.model.JDK/latest1.8
Setting MAVEN_3_3_3_HOME=/home/jenkins/jenkins-slave/tools/hudson.tasks.Maven_MavenInstallation/maven-3.3.3
Setting LATEST1_8_HOME=/home/jenkins/jenkins-slave/tools/hudson.model.JDK/latest1.8
Setting MAVEN_3_3_3_HOME=/home/jenkins/jenkins-slave/tools/hudson.tasks.Maven_MavenInstallation/maven-3.3.3
###################################################################################
############################## FAILED TESTS (if any) ##############################
3 tests failed.
FAILED: org.apache.hadoop.mapred.TestMRTimelineEventHandling.testMapreduceJobTimelineServiceEnabled
Error Message:
org.apache.hadoop.yarn.exceptions.YarnRuntimeException: Failed to intialize existing directories
Stack Trace:
org.apache.hadoop.yarn.exceptions.YarnRuntimeException: org.apache.hadoop.yarn.exceptions.YarnRuntimeException: Failed to intialize existing directories
at org.apache.hadoop.fs.RawLocalFileSystem.listStatus(RawLocalFileSystem.java:469)
at org.apache.hadoop.fs.DelegateToFileSystem.listStatus(DelegateToFileSystem.java:168)
at org.apache.hadoop.fs.ChecksumFs.listStatus(ChecksumFs.java:519)
at org.apache.hadoop.fs.AbstractFileSystem$1.<init>(AbstractFileSystem.java:890)
at org.apache.hadoop.fs.AbstractFileSystem.listStatusIterator(AbstractFileSystem.java:888)
at org.apache.hadoop.fs.FileContext$22.next(FileContext.java:1492)
at org.apache.hadoop.fs.FileContext$22.next(FileContext.java:1487)
at org.apache.hadoop.fs.FSLinkResolver.resolve(FSLinkResolver.java:90)
at org.apache.hadoop.fs.FileContext.listStatus(FileContext.java:1494)
at org.apache.hadoop.mapreduce.v2.jobhistory.JobHistoryUtils.localGlobber(JobHistoryUtils.java:457)
at org.apache.hadoop.mapreduce.v2.jobhistory.JobHistoryUtils.localGlobber(JobHistoryUtils.java:444)
at org.apache.hadoop.mapreduce.v2.jobhistory.JobHistoryUtils.localGlobber(JobHistoryUtils.java:439)
at org.apache.hadoop.mapreduce.v2.hs.HistoryFileManager.findTimestampedDirectories(HistoryFileManager.java:843)
at org.apache.hadoop.mapreduce.v2.hs.HistoryFileManager.initExisting(HistoryFileManager.java:737)
at org.apache.hadoop.mapreduce.v2.hs.JobHistory.serviceInit(JobHistory.java:98)
at org.apache.hadoop.service.AbstractService.init(AbstractService.java:163)
at org.apache.hadoop.service.CompositeService.serviceInit(CompositeService.java:107)
at org.apache.hadoop.mapreduce.v2.hs.JobHistoryServer.serviceInit(JobHistoryServer.java:152)
at org.apache.hadoop.service.AbstractService.init(AbstractService.java:163)
at org.apache.hadoop.mapreduce.v2.MiniMRYarnCluster$JobHistoryServerWrapper.serviceStart(MiniMRYarnCluster.java:232)
at org.apache.hadoop.service.AbstractService.start(AbstractService.java:193)
at org.apache.hadoop.service.CompositeService.serviceStart(CompositeService.java:120)
at org.apache.hadoop.yarn.server.MiniYARNCluster.serviceStart(MiniYARNCluster.java:295)
at org.apache.hadoop.mapreduce.v2.MiniMRYarnCluster.serviceStart(MiniMRYarnCluster.java:191)
at org.apache.hadoop.service.AbstractService.start(AbstractService.java:193)
at org.apache.hadoop.mapred.TestMRTimelineEventHandling.testMapreduceJobTimelineServiceEnabled(TestMRTimelineEventHandling.java:194)
FAILED: org.apache.hadoop.mapred.TestMiniMRChildTask.testTaskEnv
Error Message:
The environment checker job failed.
Stack Trace:
java.lang.AssertionError: The environment checker job failed.
at org.junit.Assert.fail(Assert.java:88)
at org.junit.Assert.assertTrue(Assert.java:41)
at org.apache.hadoop.mapred.TestMiniMRChildTask.runTestTaskEnv(TestMiniMRChildTask.java:550)
at org.apache.hadoop.mapred.TestMiniMRChildTask.testTaskEnv(TestMiniMRChildTask.java:472)
FAILED: org.apache.hadoop.mapred.TestMiniMRChildTask.testTaskOldEnv
Error Message:
The environment checker job failed.
Stack Trace:
java.lang.AssertionError: The environment checker job failed.
at org.junit.Assert.fail(Assert.java:88)
at org.junit.Assert.assertTrue(Assert.java:41)
at org.apache.hadoop.mapred.TestMiniMRChildTask.runTestTaskEnv(TestMiniMRChildTask.java:550)
at org.apache.hadoop.mapred.TestMiniMRChildTask.testTaskOldEnv(TestMiniMRChildTask.java:496)
Hadoop-Mapreduce-trunk-Java8 - Build # 1497 - Still Failing
Posted by Apache Jenkins Server <je...@builds.apache.org>.
See https://builds.apache.org/job/Hadoop-Mapreduce-trunk-Java8/1497/
###################################################################################
########################## LAST 60 LINES OF THE CONSOLE ###########################
[...truncated 20635 lines...]
[WARNING] The following patterns were never triggered in this artifact exclusion filter:
o 'org.apache.hadoop:hadoop-common'
o 'org.apache.hadoop:hadoop-hdfs'
o 'jdiff:jdiff:jar'
[INFO] ------------------------------------------------------------------------
[INFO] Reactor Summary:
[INFO]
[INFO] Apache Hadoop MapReduce Client ..................... SUCCESS [ 5.390 s]
[INFO] Apache Hadoop MapReduce Core ....................... SUCCESS [02:54 min]
[INFO] Apache Hadoop MapReduce Common ..................... SUCCESS [01:28 min]
[INFO] Apache Hadoop MapReduce Shuffle .................... SUCCESS [ 17.495 s]
[INFO] Apache Hadoop MapReduce App ........................ SUCCESS [09:39 min]
[INFO] Apache Hadoop MapReduce HistoryServer .............. SUCCESS [06:25 min]
[INFO] Apache Hadoop MapReduce JobClient .................. FAILURE [ 01:56 h]
[INFO] Apache Hadoop MapReduce HistoryServer Plugins ...... SUCCESS [ 7.519 s]
[INFO] Apache Hadoop MapReduce NativeTask ................. FAILURE [08:14 min]
[INFO] Apache Hadoop MapReduce Examples ................... SKIPPED
[INFO] Apache Hadoop MapReduce ............................ FAILURE [ 1.833 s]
[INFO] ------------------------------------------------------------------------
[INFO] BUILD FAILURE
[INFO] ------------------------------------------------------------------------
[INFO] Total time: 02:26 h
[INFO] Finished at: 2016-06-04T00:25:17+00:00
[INFO] Final Memory: 119M/2611M
[INFO] ------------------------------------------------------------------------
[WARNING] The requested profile "docs" could not be activated because it does not exist.
[WARNING] The requested profile "parallel-tests" could not be activated because it does not exist.
[ERROR] Failed to execute goal org.apache.maven.plugins:maven-surefire-plugin:2.17:test (default-test) on project hadoop-mapreduce-client-jobclient: There are test failures.
[ERROR]
[ERROR] Please refer to /home/jenkins/jenkins-slave/workspace/Hadoop-Mapreduce-trunk-Java8/source/hadoop-mapreduce-project/hadoop-mapreduce-client/hadoop-mapreduce-client-jobclient/target/surefire-reports for the individual test results.
[ERROR] -> [Help 1]
[ERROR] Failed to execute goal org.apache.hadoop:hadoop-maven-plugins:3.0.0-alpha1-SNAPSHOT:cmake-test (nttest) on project hadoop-mapreduce-client-nativetask: Test /home/jenkins/jenkins-slave/workspace/Hadoop-Mapreduce-trunk-Java8/source/hadoop-mapreduce-project/hadoop-mapreduce-client/hadoop-mapreduce-client-nativetask/target/native/test/nttest returned ERROR CODE 127 -> [Help 2]
[ERROR] Failed to execute goal org.apache.maven.plugins:maven-assembly-plugin:2.4:single (package-mapreduce) on project hadoop-mapreduce: Failed to create assembly: Error adding file 'org.apache.hadoop:hadoop-mapreduce-client-jobclient:jar:3.0.0-alpha1-SNAPSHOT' to archive: /home/jenkins/jenkins-slave/workspace/Hadoop-Mapreduce-trunk-Java8/source/hadoop-mapreduce-project/hadoop-mapreduce-client/hadoop-mapreduce-client-jobclient/target/classes isn't a file. -> [Help 2]
[ERROR]
[ERROR] To see the full stack trace of the errors, re-run Maven with the -e switch.
[ERROR] Re-run Maven using the -X switch to enable full debug logging.
[ERROR]
[ERROR] For more information about the errors and possible solutions, please read the following articles:
[ERROR] [Help 1] http://cwiki.apache.org/confluence/display/MAVEN/MojoFailureException
[ERROR] [Help 2] http://cwiki.apache.org/confluence/display/MAVEN/MojoExecutionException
[ERROR]
[ERROR] After correcting the problems, you can resume the build with the command
[ERROR] mvn <goals> -rf :hadoop-mapreduce-client-jobclient
Build step 'Execute shell' marked build as failure
[FINDBUGS] Skipping publisher since build result is FAILURE
Archiving artifacts
Setting LATEST1_8_HOME=/home/jenkins/jenkins-slave/tools/hudson.model.JDK/latest1.8
Setting MAVEN_3_3_3_HOME=/home/jenkins/jenkins-slave/tools/hudson.tasks.Maven_MavenInstallation/maven-3.3.3
Recording test results
Setting LATEST1_8_HOME=/home/jenkins/jenkins-slave/tools/hudson.model.JDK/latest1.8
Setting MAVEN_3_3_3_HOME=/home/jenkins/jenkins-slave/tools/hudson.tasks.Maven_MavenInstallation/maven-3.3.3
Email was triggered for: Failure - Any
Sending email for trigger: Failure - Any
Setting LATEST1_8_HOME=/home/jenkins/jenkins-slave/tools/hudson.model.JDK/latest1.8
Setting MAVEN_3_3_3_HOME=/home/jenkins/jenkins-slave/tools/hudson.tasks.Maven_MavenInstallation/maven-3.3.3
Setting LATEST1_8_HOME=/home/jenkins/jenkins-slave/tools/hudson.model.JDK/latest1.8
Setting MAVEN_3_3_3_HOME=/home/jenkins/jenkins-slave/tools/hudson.tasks.Maven_MavenInstallation/maven-3.3.3
###################################################################################
############################## FAILED TESTS (if any) ##############################
2 tests failed.
FAILED: org.apache.hadoop.mapred.TestMiniMRChildTask.testTaskEnv
Error Message:
The environment checker job failed.
Stack Trace:
java.lang.AssertionError: The environment checker job failed.
at org.junit.Assert.fail(Assert.java:88)
at org.junit.Assert.assertTrue(Assert.java:41)
at org.apache.hadoop.mapred.TestMiniMRChildTask.runTestTaskEnv(TestMiniMRChildTask.java:550)
at org.apache.hadoop.mapred.TestMiniMRChildTask.testTaskEnv(TestMiniMRChildTask.java:472)
FAILED: org.apache.hadoop.mapred.TestMiniMRChildTask.testTaskOldEnv
Error Message:
The environment checker job failed.
Stack Trace:
java.lang.AssertionError: The environment checker job failed.
at org.junit.Assert.fail(Assert.java:88)
at org.junit.Assert.assertTrue(Assert.java:41)
at org.apache.hadoop.mapred.TestMiniMRChildTask.runTestTaskEnv(TestMiniMRChildTask.java:550)
at org.apache.hadoop.mapred.TestMiniMRChildTask.testTaskOldEnv(TestMiniMRChildTask.java:496)
Hadoop-Mapreduce-trunk-Java8 - Build # 1496 - Still Failing
Posted by Apache Jenkins Server <je...@builds.apache.org>.
See https://builds.apache.org/job/Hadoop-Mapreduce-trunk-Java8/1496/
###################################################################################
########################## LAST 60 LINES OF THE CONSOLE ###########################
[...truncated 20591 lines...]
[WARNING] The following patterns were never triggered in this artifact exclusion filter:
o 'org.apache.hadoop:hadoop-common'
o 'org.apache.hadoop:hadoop-hdfs'
o 'jdiff:jdiff:jar'
[INFO] ------------------------------------------------------------------------
[INFO] Reactor Summary:
[INFO]
[INFO] Apache Hadoop MapReduce Client ..................... SUCCESS [ 5.689 s]
[INFO] Apache Hadoop MapReduce Core ....................... SUCCESS [02:51 min]
[INFO] Apache Hadoop MapReduce Common ..................... SUCCESS [01:16 min]
[INFO] Apache Hadoop MapReduce Shuffle .................... SUCCESS [ 17.309 s]
[INFO] Apache Hadoop MapReduce App ........................ SUCCESS [09:14 min]
[INFO] Apache Hadoop MapReduce HistoryServer .............. SUCCESS [06:21 min]
[INFO] Apache Hadoop MapReduce JobClient .................. FAILURE [ 01:57 h]
[INFO] Apache Hadoop MapReduce HistoryServer Plugins ...... SUCCESS [ 15.063 s]
[INFO] Apache Hadoop MapReduce NativeTask ................. FAILURE [08:12 min]
[INFO] Apache Hadoop MapReduce Examples ................... SKIPPED
[INFO] Apache Hadoop MapReduce ............................ FAILURE [ 1.295 s]
[INFO] ------------------------------------------------------------------------
[INFO] BUILD FAILURE
[INFO] ------------------------------------------------------------------------
[INFO] Total time: 02:26 h
[INFO] Finished at: 2016-06-03T21:56:38+00:00
[INFO] Final Memory: 109M/2306M
[INFO] ------------------------------------------------------------------------
[WARNING] The requested profile "docs" could not be activated because it does not exist.
[WARNING] The requested profile "parallel-tests" could not be activated because it does not exist.
[ERROR] Failed to execute goal org.apache.maven.plugins:maven-surefire-plugin:2.17:test (default-test) on project hadoop-mapreduce-client-jobclient: There are test failures.
[ERROR]
[ERROR] Please refer to /home/jenkins/jenkins-slave/workspace/Hadoop-Mapreduce-trunk-Java8/source/hadoop-mapreduce-project/hadoop-mapreduce-client/hadoop-mapreduce-client-jobclient/target/surefire-reports for the individual test results.
[ERROR] -> [Help 1]
[ERROR] Failed to execute goal org.apache.hadoop:hadoop-maven-plugins:3.0.0-alpha1-SNAPSHOT:cmake-test (nttest) on project hadoop-mapreduce-client-nativetask: Test /home/jenkins/jenkins-slave/workspace/Hadoop-Mapreduce-trunk-Java8/source/hadoop-mapreduce-project/hadoop-mapreduce-client/hadoop-mapreduce-client-nativetask/target/native/test/nttest returned ERROR CODE 127 -> [Help 2]
[ERROR] Failed to execute goal org.apache.maven.plugins:maven-assembly-plugin:2.4:single (package-mapreduce) on project hadoop-mapreduce: Failed to create assembly: Error adding file 'org.apache.hadoop:hadoop-mapreduce-client-jobclient:jar:3.0.0-alpha1-SNAPSHOT' to archive: /home/jenkins/jenkins-slave/workspace/Hadoop-Mapreduce-trunk-Java8/source/hadoop-mapreduce-project/hadoop-mapreduce-client/hadoop-mapreduce-client-jobclient/target/classes isn't a file. -> [Help 2]
[ERROR]
[ERROR] To see the full stack trace of the errors, re-run Maven with the -e switch.
[ERROR] Re-run Maven using the -X switch to enable full debug logging.
[ERROR]
[ERROR] For more information about the errors and possible solutions, please read the following articles:
[ERROR] [Help 1] http://cwiki.apache.org/confluence/display/MAVEN/MojoFailureException
[ERROR] [Help 2] http://cwiki.apache.org/confluence/display/MAVEN/MojoExecutionException
[ERROR]
[ERROR] After correcting the problems, you can resume the build with the command
[ERROR] mvn <goals> -rf :hadoop-mapreduce-client-jobclient
Build step 'Execute shell' marked build as failure
[FINDBUGS] Skipping publisher since build result is FAILURE
Archiving artifacts
Setting LATEST1_8_HOME=/home/jenkins/jenkins-slave/tools/hudson.model.JDK/latest1.8
Setting MAVEN_3_3_3_HOME=/home/jenkins/jenkins-slave/tools/hudson.tasks.Maven_MavenInstallation/maven-3.3.3
Recording test results
Setting LATEST1_8_HOME=/home/jenkins/jenkins-slave/tools/hudson.model.JDK/latest1.8
Setting MAVEN_3_3_3_HOME=/home/jenkins/jenkins-slave/tools/hudson.tasks.Maven_MavenInstallation/maven-3.3.3
Email was triggered for: Failure - Any
Sending email for trigger: Failure - Any
Setting LATEST1_8_HOME=/home/jenkins/jenkins-slave/tools/hudson.model.JDK/latest1.8
Setting MAVEN_3_3_3_HOME=/home/jenkins/jenkins-slave/tools/hudson.tasks.Maven_MavenInstallation/maven-3.3.3
Setting LATEST1_8_HOME=/home/jenkins/jenkins-slave/tools/hudson.model.JDK/latest1.8
Setting MAVEN_3_3_3_HOME=/home/jenkins/jenkins-slave/tools/hudson.tasks.Maven_MavenInstallation/maven-3.3.3
###################################################################################
############################## FAILED TESTS (if any) ##############################
3 tests failed.
FAILED: org.apache.hadoop.mapred.TestMRTimelineEventHandling.testMRTimelineEventHandling
Error Message:
Job didn't finish in 30 seconds
Stack Trace:
java.io.IOException: Job didn't finish in 30 seconds
at org.apache.hadoop.mapred.UtilsForTests.runJobSucceed(UtilsForTests.java:622)
at org.apache.hadoop.mapred.TestMRTimelineEventHandling.testMRTimelineEventHandling(TestMRTimelineEventHandling.java:105)
FAILED: org.apache.hadoop.mapred.TestMiniMRChildTask.testTaskEnv
Error Message:
The environment checker job failed.
Stack Trace:
java.lang.AssertionError: The environment checker job failed.
at org.junit.Assert.fail(Assert.java:88)
at org.junit.Assert.assertTrue(Assert.java:41)
at org.apache.hadoop.mapred.TestMiniMRChildTask.runTestTaskEnv(TestMiniMRChildTask.java:550)
at org.apache.hadoop.mapred.TestMiniMRChildTask.testTaskEnv(TestMiniMRChildTask.java:472)
FAILED: org.apache.hadoop.mapred.TestMiniMRChildTask.testTaskOldEnv
Error Message:
The environment checker job failed.
Stack Trace:
java.lang.AssertionError: The environment checker job failed.
at org.junit.Assert.fail(Assert.java:88)
at org.junit.Assert.assertTrue(Assert.java:41)
at org.apache.hadoop.mapred.TestMiniMRChildTask.runTestTaskEnv(TestMiniMRChildTask.java:550)
at org.apache.hadoop.mapred.TestMiniMRChildTask.testTaskOldEnv(TestMiniMRChildTask.java:496)
Hadoop-Mapreduce-trunk-Java8 - Build # 1495 - Still Failing
Posted by Apache Jenkins Server <je...@builds.apache.org>.
See https://builds.apache.org/job/Hadoop-Mapreduce-trunk-Java8/1495/
###################################################################################
########################## LAST 60 LINES OF THE CONSOLE ###########################
[...truncated 20592 lines...]
[WARNING] The following patterns were never triggered in this artifact exclusion filter:
o 'org.apache.hadoop:hadoop-common'
o 'org.apache.hadoop:hadoop-hdfs'
o 'jdiff:jdiff:jar'
[INFO] ------------------------------------------------------------------------
[INFO] Reactor Summary:
[INFO]
[INFO] Apache Hadoop MapReduce Client ..................... SUCCESS [ 4.659 s]
[INFO] Apache Hadoop MapReduce Core ....................... SUCCESS [02:33 min]
[INFO] Apache Hadoop MapReduce Common ..................... SUCCESS [01:02 min]
[INFO] Apache Hadoop MapReduce Shuffle .................... SUCCESS [ 15.342 s]
[INFO] Apache Hadoop MapReduce App ........................ SUCCESS [08:47 min]
[INFO] Apache Hadoop MapReduce HistoryServer .............. SUCCESS [05:58 min]
[INFO] Apache Hadoop MapReduce JobClient .................. FAILURE [ 01:44 h]
[INFO] Apache Hadoop MapReduce HistoryServer Plugins ...... SUCCESS [ 6.819 s]
[INFO] Apache Hadoop MapReduce NativeTask ................. FAILURE [07:55 min]
[INFO] Apache Hadoop MapReduce Examples ................... SKIPPED
[INFO] Apache Hadoop MapReduce ............................ FAILURE [ 1.242 s]
[INFO] ------------------------------------------------------------------------
[INFO] BUILD FAILURE
[INFO] ------------------------------------------------------------------------
[INFO] Total time: 02:11 h
[INFO] Finished at: 2016-06-03T19:27:30+00:00
[INFO] Final Memory: 114M/2392M
[INFO] ------------------------------------------------------------------------
[WARNING] The requested profile "docs" could not be activated because it does not exist.
[WARNING] The requested profile "parallel-tests" could not be activated because it does not exist.
[ERROR] Failed to execute goal org.apache.maven.plugins:maven-surefire-plugin:2.17:test (default-test) on project hadoop-mapreduce-client-jobclient: There are test failures.
[ERROR]
[ERROR] Please refer to /home/jenkins/jenkins-slave/workspace/Hadoop-Mapreduce-trunk-Java8/source/hadoop-mapreduce-project/hadoop-mapreduce-client/hadoop-mapreduce-client-jobclient/target/surefire-reports for the individual test results.
[ERROR] -> [Help 1]
[ERROR] Failed to execute goal org.apache.hadoop:hadoop-maven-plugins:3.0.0-alpha1-SNAPSHOT:cmake-test (nttest) on project hadoop-mapreduce-client-nativetask: Test /home/jenkins/jenkins-slave/workspace/Hadoop-Mapreduce-trunk-Java8/source/hadoop-mapreduce-project/hadoop-mapreduce-client/hadoop-mapreduce-client-nativetask/target/native/test/nttest returned ERROR CODE 127 -> [Help 2]
[ERROR] Failed to execute goal org.apache.maven.plugins:maven-assembly-plugin:2.4:single (package-mapreduce) on project hadoop-mapreduce: Failed to create assembly: Error adding file 'org.apache.hadoop:hadoop-mapreduce-client-jobclient:jar:3.0.0-alpha1-SNAPSHOT' to archive: /home/jenkins/jenkins-slave/workspace/Hadoop-Mapreduce-trunk-Java8/source/hadoop-mapreduce-project/hadoop-mapreduce-client/hadoop-mapreduce-client-jobclient/target/classes isn't a file. -> [Help 2]
[ERROR]
[ERROR] To see the full stack trace of the errors, re-run Maven with the -e switch.
[ERROR] Re-run Maven using the -X switch to enable full debug logging.
[ERROR]
[ERROR] For more information about the errors and possible solutions, please read the following articles:
[ERROR] [Help 1] http://cwiki.apache.org/confluence/display/MAVEN/MojoFailureException
[ERROR] [Help 2] http://cwiki.apache.org/confluence/display/MAVEN/MojoExecutionException
[ERROR]
[ERROR] After correcting the problems, you can resume the build with the command
[ERROR] mvn <goals> -rf :hadoop-mapreduce-client-jobclient
Build step 'Execute shell' marked build as failure
[FINDBUGS] Skipping publisher since build result is FAILURE
Archiving artifacts
Setting LATEST1_8_HOME=/home/jenkins/jenkins-slave/tools/hudson.model.JDK/latest1.8
Setting MAVEN_3_3_3_HOME=/home/jenkins/jenkins-slave/tools/hudson.tasks.Maven_MavenInstallation/maven-3.3.3
Recording test results
Setting LATEST1_8_HOME=/home/jenkins/jenkins-slave/tools/hudson.model.JDK/latest1.8
Setting MAVEN_3_3_3_HOME=/home/jenkins/jenkins-slave/tools/hudson.tasks.Maven_MavenInstallation/maven-3.3.3
Email was triggered for: Failure - Any
Sending email for trigger: Failure - Any
Setting LATEST1_8_HOME=/home/jenkins/jenkins-slave/tools/hudson.model.JDK/latest1.8
Setting MAVEN_3_3_3_HOME=/home/jenkins/jenkins-slave/tools/hudson.tasks.Maven_MavenInstallation/maven-3.3.3
Setting LATEST1_8_HOME=/home/jenkins/jenkins-slave/tools/hudson.model.JDK/latest1.8
Setting MAVEN_3_3_3_HOME=/home/jenkins/jenkins-slave/tools/hudson.tasks.Maven_MavenInstallation/maven-3.3.3
###################################################################################
############################## FAILED TESTS (if any) ##############################
3 tests failed.
FAILED: org.apache.hadoop.mapred.TestMRCJCFileOutputCommitter.testAbort
Error Message:
Output directory not empty expected:<0> but was:<4>
Stack Trace:
java.lang.AssertionError: Output directory not empty expected:<0> but was:<4>
at org.junit.Assert.fail(Assert.java:88)
at org.junit.Assert.failNotEquals(Assert.java:743)
at org.junit.Assert.assertEquals(Assert.java:118)
at org.junit.Assert.assertEquals(Assert.java:555)
at org.apache.hadoop.mapred.TestMRCJCFileOutputCommitter.testAbort(TestMRCJCFileOutputCommitter.java:153)
FAILED: org.apache.hadoop.mapred.TestMiniMRChildTask.testTaskEnv
Error Message:
The environment checker job failed.
Stack Trace:
java.lang.AssertionError: The environment checker job failed.
at org.junit.Assert.fail(Assert.java:88)
at org.junit.Assert.assertTrue(Assert.java:41)
at org.apache.hadoop.mapred.TestMiniMRChildTask.runTestTaskEnv(TestMiniMRChildTask.java:550)
at org.apache.hadoop.mapred.TestMiniMRChildTask.testTaskEnv(TestMiniMRChildTask.java:472)
FAILED: org.apache.hadoop.mapred.TestMiniMRChildTask.testTaskOldEnv
Error Message:
The environment checker job failed.
Stack Trace:
java.lang.AssertionError: The environment checker job failed.
at org.junit.Assert.fail(Assert.java:88)
at org.junit.Assert.assertTrue(Assert.java:41)
at org.apache.hadoop.mapred.TestMiniMRChildTask.runTestTaskEnv(TestMiniMRChildTask.java:550)
at org.apache.hadoop.mapred.TestMiniMRChildTask.testTaskOldEnv(TestMiniMRChildTask.java:496)
Hadoop-Mapreduce-trunk-Java8 - Build # 1494 - Still Failing
Posted by Apache Jenkins Server <je...@builds.apache.org>.
See https://builds.apache.org/job/Hadoop-Mapreduce-trunk-Java8/1494/
###################################################################################
########################## LAST 60 LINES OF THE CONSOLE ###########################
[...truncated 4098 lines...]
o 'org.apache.hadoop:hadoop-yarn-server-tests'
[WARNING] The following patterns were never triggered in this artifact exclusion filter:
o 'org.apache.hadoop:hadoop-common'
o 'org.apache.hadoop:hadoop-hdfs'
o 'jdiff:jdiff:jar'
[INFO] ------------------------------------------------------------------------
[INFO] Reactor Summary:
[INFO]
[INFO] Apache Hadoop MapReduce Client ..................... SUCCESS [ 4.509 s]
[INFO] Apache Hadoop MapReduce Core ....................... FAILURE [01:37 min]
[INFO] Apache Hadoop MapReduce Common ..................... SKIPPED
[INFO] Apache Hadoop MapReduce Shuffle .................... SKIPPED
[INFO] Apache Hadoop MapReduce App ........................ SKIPPED
[INFO] Apache Hadoop MapReduce HistoryServer .............. SKIPPED
[INFO] Apache Hadoop MapReduce JobClient .................. SKIPPED
[INFO] Apache Hadoop MapReduce HistoryServer Plugins ...... SKIPPED
[INFO] Apache Hadoop MapReduce NativeTask ................. SKIPPED
[INFO] Apache Hadoop MapReduce Examples ................... SKIPPED
[INFO] Apache Hadoop MapReduce ............................ FAILURE [ 1.129 s]
[INFO] ------------------------------------------------------------------------
[INFO] BUILD FAILURE
[INFO] ------------------------------------------------------------------------
[INFO] Total time: 01:44 min
[INFO] Finished at: 2016-06-02T21:26:49+00:00
[INFO] Final Memory: 67M/1228M
[INFO] ------------------------------------------------------------------------
[WARNING] The requested profile "docs" could not be activated because it does not exist.
[WARNING] The requested profile "parallel-tests" could not be activated because it does not exist.
[ERROR] Failed to execute goal org.apache.maven.plugins:maven-surefire-plugin:2.17:test (default-test) on project hadoop-mapreduce-client-core: There are test failures.
[ERROR]
[ERROR] Please refer to /home/jenkins/jenkins-slave/workspace/Hadoop-Mapreduce-trunk-Java8/source/hadoop-mapreduce-project/hadoop-mapreduce-client/hadoop-mapreduce-client-core/target/surefire-reports for the individual test results.
[ERROR] -> [Help 1]
[ERROR] Failed to execute goal org.apache.maven.plugins:maven-assembly-plugin:2.4:single (package-mapreduce) on project hadoop-mapreduce: Failed to create assembly: Error adding file 'org.apache.hadoop:hadoop-mapreduce-client-core:jar:3.0.0-alpha1-SNAPSHOT' to archive: /home/jenkins/jenkins-slave/workspace/Hadoop-Mapreduce-trunk-Java8/source/hadoop-mapreduce-project/hadoop-mapreduce-client/hadoop-mapreduce-client-core/target/classes isn't a file. -> [Help 2]
[ERROR]
[ERROR] To see the full stack trace of the errors, re-run Maven with the -e switch.
[ERROR] Re-run Maven using the -X switch to enable full debug logging.
[ERROR]
[ERROR] For more information about the errors and possible solutions, please read the following articles:
[ERROR] [Help 1] http://cwiki.apache.org/confluence/display/MAVEN/MojoFailureException
[ERROR] [Help 2] http://cwiki.apache.org/confluence/display/MAVEN/MojoExecutionException
[ERROR]
[ERROR] After correcting the problems, you can resume the build with the command
[ERROR] mvn <goals> -rf :hadoop-mapreduce-client-core
Build step 'Execute shell' marked build as failure
[FINDBUGS] Skipping publisher since build result is FAILURE
Archiving artifacts
Setting LATEST1_8_HOME=/home/jenkins/jenkins-slave/tools/hudson.model.JDK/latest1.8
Setting MAVEN_3_3_3_HOME=/home/jenkins/jenkins-slave/tools/hudson.tasks.Maven_MavenInstallation/maven-3.3.3
Recording test results
Setting LATEST1_8_HOME=/home/jenkins/jenkins-slave/tools/hudson.model.JDK/latest1.8
Setting MAVEN_3_3_3_HOME=/home/jenkins/jenkins-slave/tools/hudson.tasks.Maven_MavenInstallation/maven-3.3.3
Email was triggered for: Failure - Any
Sending email for trigger: Failure - Any
Setting LATEST1_8_HOME=/home/jenkins/jenkins-slave/tools/hudson.model.JDK/latest1.8
Setting MAVEN_3_3_3_HOME=/home/jenkins/jenkins-slave/tools/hudson.tasks.Maven_MavenInstallation/maven-3.3.3
Setting LATEST1_8_HOME=/home/jenkins/jenkins-slave/tools/hudson.model.JDK/latest1.8
Setting MAVEN_3_3_3_HOME=/home/jenkins/jenkins-slave/tools/hudson.tasks.Maven_MavenInstallation/maven-3.3.3
###################################################################################
############################## FAILED TESTS (if any) ##############################
1 tests failed.
FAILED: org.apache.hadoop.mapreduce.tools.TestCLI.testGetJob
Error Message:
null
Stack Trace:
java.lang.AssertionError: null
at org.junit.Assert.fail(Assert.java:86)
at org.junit.Assert.assertTrue(Assert.java:41)
at org.junit.Assert.assertTrue(Assert.java:52)
at org.apache.hadoop.mapreduce.tools.TestCLI.testGetJob(TestCLI.java:181)
Hadoop-Mapreduce-trunk-Java8 - Build # 1493 - Still Failing
Posted by Apache Jenkins Server <je...@builds.apache.org>.
See https://builds.apache.org/job/Hadoop-Mapreduce-trunk-Java8/1493/
###################################################################################
########################## LAST 60 LINES OF THE CONSOLE ###########################
[...truncated 20580 lines...]
[WARNING] The following patterns were never triggered in this artifact exclusion filter:
o 'org.apache.hadoop:hadoop-common'
o 'org.apache.hadoop:hadoop-hdfs'
o 'jdiff:jdiff:jar'
[INFO] ------------------------------------------------------------------------
[INFO] Reactor Summary:
[INFO]
[INFO] Apache Hadoop MapReduce Client ..................... SUCCESS [ 5.093 s]
[INFO] Apache Hadoop MapReduce Core ....................... SUCCESS [02:35 min]
[INFO] Apache Hadoop MapReduce Common ..................... SUCCESS [01:03 min]
[INFO] Apache Hadoop MapReduce Shuffle .................... SUCCESS [ 15.148 s]
[INFO] Apache Hadoop MapReduce App ........................ SUCCESS [08:45 min]
[INFO] Apache Hadoop MapReduce HistoryServer .............. SUCCESS [05:59 min]
[INFO] Apache Hadoop MapReduce JobClient .................. FAILURE [ 01:39 h]
[INFO] Apache Hadoop MapReduce HistoryServer Plugins ...... SUCCESS [ 6.730 s]
[INFO] Apache Hadoop MapReduce NativeTask ................. FAILURE [07:48 min]
[INFO] Apache Hadoop MapReduce Examples ................... SKIPPED
[INFO] Apache Hadoop MapReduce ............................ FAILURE [ 1.139 s]
[INFO] ------------------------------------------------------------------------
[INFO] BUILD FAILURE
[INFO] ------------------------------------------------------------------------
[INFO] Total time: 02:06 h
[INFO] Finished at: 2016-06-02T21:22:52+00:00
[INFO] Final Memory: 116M/2474M
[INFO] ------------------------------------------------------------------------
[WARNING] The requested profile "docs" could not be activated because it does not exist.
[WARNING] The requested profile "parallel-tests" could not be activated because it does not exist.
[ERROR] Failed to execute goal org.apache.maven.plugins:maven-surefire-plugin:2.17:test (default-test) on project hadoop-mapreduce-client-jobclient: There are test failures.
[ERROR]
[ERROR] Please refer to /home/jenkins/jenkins-slave/workspace/Hadoop-Mapreduce-trunk-Java8/source/hadoop-mapreduce-project/hadoop-mapreduce-client/hadoop-mapreduce-client-jobclient/target/surefire-reports for the individual test results.
[ERROR] -> [Help 1]
[ERROR] Failed to execute goal org.apache.hadoop:hadoop-maven-plugins:3.0.0-alpha1-SNAPSHOT:cmake-test (nttest) on project hadoop-mapreduce-client-nativetask: Test /home/jenkins/jenkins-slave/workspace/Hadoop-Mapreduce-trunk-Java8/source/hadoop-mapreduce-project/hadoop-mapreduce-client/hadoop-mapreduce-client-nativetask/target/native/test/nttest returned ERROR CODE 127 -> [Help 2]
[ERROR] Failed to execute goal org.apache.maven.plugins:maven-assembly-plugin:2.4:single (package-mapreduce) on project hadoop-mapreduce: Failed to create assembly: Error adding file 'org.apache.hadoop:hadoop-mapreduce-client-jobclient:jar:3.0.0-alpha1-SNAPSHOT' to archive: /home/jenkins/jenkins-slave/workspace/Hadoop-Mapreduce-trunk-Java8/source/hadoop-mapreduce-project/hadoop-mapreduce-client/hadoop-mapreduce-client-jobclient/target/classes isn't a file. -> [Help 2]
[ERROR]
[ERROR] To see the full stack trace of the errors, re-run Maven with the -e switch.
[ERROR] Re-run Maven using the -X switch to enable full debug logging.
[ERROR]
[ERROR] For more information about the errors and possible solutions, please read the following articles:
[ERROR] [Help 1] http://cwiki.apache.org/confluence/display/MAVEN/MojoFailureException
[ERROR] [Help 2] http://cwiki.apache.org/confluence/display/MAVEN/MojoExecutionException
[ERROR]
[ERROR] After correcting the problems, you can resume the build with the command
[ERROR] mvn <goals> -rf :hadoop-mapreduce-client-jobclient
Build step 'Execute shell' marked build as failure
[FINDBUGS] Skipping publisher since build result is FAILURE
Archiving artifacts
Setting LATEST1_8_HOME=/home/jenkins/jenkins-slave/tools/hudson.model.JDK/latest1.8
Setting MAVEN_3_3_3_HOME=/home/jenkins/jenkins-slave/tools/hudson.tasks.Maven_MavenInstallation/maven-3.3.3
Recording test results
Setting LATEST1_8_HOME=/home/jenkins/jenkins-slave/tools/hudson.model.JDK/latest1.8
Setting MAVEN_3_3_3_HOME=/home/jenkins/jenkins-slave/tools/hudson.tasks.Maven_MavenInstallation/maven-3.3.3
Email was triggered for: Failure - Any
Sending email for trigger: Failure - Any
Setting LATEST1_8_HOME=/home/jenkins/jenkins-slave/tools/hudson.model.JDK/latest1.8
Setting MAVEN_3_3_3_HOME=/home/jenkins/jenkins-slave/tools/hudson.tasks.Maven_MavenInstallation/maven-3.3.3
Setting LATEST1_8_HOME=/home/jenkins/jenkins-slave/tools/hudson.model.JDK/latest1.8
Setting MAVEN_3_3_3_HOME=/home/jenkins/jenkins-slave/tools/hudson.tasks.Maven_MavenInstallation/maven-3.3.3
###################################################################################
############################## FAILED TESTS (if any) ##############################
2 tests failed.
FAILED: org.apache.hadoop.mapred.TestMiniMRChildTask.testTaskEnv
Error Message:
The environment checker job failed.
Stack Trace:
java.lang.AssertionError: The environment checker job failed.
at org.junit.Assert.fail(Assert.java:88)
at org.junit.Assert.assertTrue(Assert.java:41)
at org.apache.hadoop.mapred.TestMiniMRChildTask.runTestTaskEnv(TestMiniMRChildTask.java:550)
at org.apache.hadoop.mapred.TestMiniMRChildTask.testTaskEnv(TestMiniMRChildTask.java:472)
FAILED: org.apache.hadoop.mapred.TestMiniMRChildTask.testTaskOldEnv
Error Message:
The environment checker job failed.
Stack Trace:
java.lang.AssertionError: The environment checker job failed.
at org.junit.Assert.fail(Assert.java:88)
at org.junit.Assert.assertTrue(Assert.java:41)
at org.apache.hadoop.mapred.TestMiniMRChildTask.runTestTaskEnv(TestMiniMRChildTask.java:550)
at org.apache.hadoop.mapred.TestMiniMRChildTask.testTaskOldEnv(TestMiniMRChildTask.java:496)
Hadoop-Mapreduce-trunk-Java8 - Build # 1492 - Still Failing
Posted by Apache Jenkins Server <je...@builds.apache.org>.
See https://builds.apache.org/job/Hadoop-Mapreduce-trunk-Java8/1492/
###################################################################################
########################## LAST 60 LINES OF THE CONSOLE ###########################
[...truncated 4094 lines...]
main:
[INFO] Executed tasks
[INFO]
[INFO] --- maven-assembly-plugin:2.4:single (package-mapreduce) @ hadoop-mapreduce ---
[WARNING] The following patterns were never triggered in this artifact inclusion filter:
o 'org.apache.hadoop:hadoop-yarn-server-tests'
[INFO] ------------------------------------------------------------------------
[INFO] Reactor Summary:
[INFO]
[INFO] Apache Hadoop MapReduce Client ..................... SUCCESS [ 4.595 s]
[INFO] Apache Hadoop MapReduce Core ....................... FAILURE [01:39 min]
[INFO] Apache Hadoop MapReduce Common ..................... SKIPPED
[INFO] Apache Hadoop MapReduce Shuffle .................... SKIPPED
[INFO] Apache Hadoop MapReduce App ........................ SKIPPED
[INFO] Apache Hadoop MapReduce HistoryServer .............. SKIPPED
[INFO] Apache Hadoop MapReduce JobClient .................. SKIPPED
[INFO] Apache Hadoop MapReduce HistoryServer Plugins ...... SKIPPED
[INFO] Apache Hadoop MapReduce NativeTask ................. SKIPPED
[INFO] Apache Hadoop MapReduce Examples ................... SKIPPED
[INFO] Apache Hadoop MapReduce ............................ FAILURE [ 1.066 s]
[INFO] ------------------------------------------------------------------------
[INFO] BUILD FAILURE
[INFO] ------------------------------------------------------------------------
[INFO] Total time: 01:46 min
[INFO] Finished at: 2016-06-02T18:37:49+00:00
[INFO] Final Memory: 68M/1261M
[INFO] ------------------------------------------------------------------------
[WARNING] The requested profile "docs" could not be activated because it does not exist.
[WARNING] The requested profile "parallel-tests" could not be activated because it does not exist.
[ERROR] Failed to execute goal org.apache.maven.plugins:maven-surefire-plugin:2.17:test (default-test) on project hadoop-mapreduce-client-core: There are test failures.
[ERROR]
[ERROR] Please refer to /home/jenkins/jenkins-slave/workspace/Hadoop-Mapreduce-trunk-Java8/source/hadoop-mapreduce-project/hadoop-mapreduce-client/hadoop-mapreduce-client-core/target/surefire-reports for the individual test results.
[ERROR] -> [Help 1]
[ERROR] Failed to execute goal org.apache.maven.plugins:maven-assembly-plugin:2.4:single (package-mapreduce) on project hadoop-mapreduce: Failed to create assembly: Error adding file 'org.apache.hadoop:hadoop-mapreduce-client-core:jar:3.0.0-alpha1-SNAPSHOT' to archive: /home/jenkins/jenkins-slave/workspace/Hadoop-Mapreduce-trunk-Java8/source/hadoop-mapreduce-project/hadoop-mapreduce-client/hadoop-mapreduce-client-core/target/classes isn't a file. -> [Help 2]
[ERROR]
[ERROR] To see the full stack trace of the errors, re-run Maven with the -e switch.
[ERROR] Re-run Maven using the -X switch to enable full debug logging.
[ERROR]
[ERROR] For more information about the errors and possible solutions, please read the following articles:
[ERROR] [Help 1] http://cwiki.apache.org/confluence/display/MAVEN/MojoFailureException
[ERROR] [Help 2] http://cwiki.apache.org/confluence/display/MAVEN/MojoExecutionException
[ERROR]
[ERROR] After correcting the problems, you can resume the build with the command
[ERROR] mvn <goals> -rf :hadoop-mapreduce-client-core
Build step 'Execute shell' marked build as failure
[FINDBUGS] Skipping publisher since build result is FAILURE
Archiving artifacts
Setting LATEST1_8_HOME=/home/jenkins/jenkins-slave/tools/hudson.model.JDK/latest1.8
Setting MAVEN_3_3_3_HOME=/home/jenkins/jenkins-slave/tools/hudson.tasks.Maven_MavenInstallation/maven-3.3.3
Recording test results
Setting LATEST1_8_HOME=/home/jenkins/jenkins-slave/tools/hudson.model.JDK/latest1.8
Setting MAVEN_3_3_3_HOME=/home/jenkins/jenkins-slave/tools/hudson.tasks.Maven_MavenInstallation/maven-3.3.3
Email was triggered for: Failure - Any
Sending email for trigger: Failure - Any
Setting LATEST1_8_HOME=/home/jenkins/jenkins-slave/tools/hudson.model.JDK/latest1.8
Setting MAVEN_3_3_3_HOME=/home/jenkins/jenkins-slave/tools/hudson.tasks.Maven_MavenInstallation/maven-3.3.3
Setting LATEST1_8_HOME=/home/jenkins/jenkins-slave/tools/hudson.model.JDK/latest1.8
Setting MAVEN_3_3_3_HOME=/home/jenkins/jenkins-slave/tools/hudson.tasks.Maven_MavenInstallation/maven-3.3.3
###################################################################################
############################## FAILED TESTS (if any) ##############################
1 tests failed.
FAILED: org.apache.hadoop.mapreduce.tools.TestCLI.testGetJob
Error Message:
null
Stack Trace:
java.lang.AssertionError: null
at org.junit.Assert.fail(Assert.java:86)
at org.junit.Assert.assertTrue(Assert.java:41)
at org.junit.Assert.assertTrue(Assert.java:52)
at org.apache.hadoop.mapreduce.tools.TestCLI.testGetJob(TestCLI.java:181)
Hadoop-Mapreduce-trunk-Java8 - Build # 1491 - Still Failing
Posted by Apache Jenkins Server <je...@builds.apache.org>.
See https://builds.apache.org/job/Hadoop-Mapreduce-trunk-Java8/1491/
###################################################################################
########################## LAST 60 LINES OF THE CONSOLE ###########################
[...truncated 21133 lines...]
[WARNING] The following patterns were never triggered in this artifact exclusion filter:
o 'org.apache.hadoop:hadoop-common'
o 'org.apache.hadoop:hadoop-hdfs'
o 'jdiff:jdiff:jar'
[INFO] ------------------------------------------------------------------------
[INFO] Reactor Summary:
[INFO]
[INFO] Apache Hadoop MapReduce Client ..................... SUCCESS [ 5.367 s]
[INFO] Apache Hadoop MapReduce Core ....................... SUCCESS [02:34 min]
[INFO] Apache Hadoop MapReduce Common ..................... SUCCESS [01:02 min]
[INFO] Apache Hadoop MapReduce Shuffle .................... SUCCESS [ 16.453 s]
[INFO] Apache Hadoop MapReduce App ........................ SUCCESS [08:50 min]
[INFO] Apache Hadoop MapReduce HistoryServer .............. SUCCESS [06:00 min]
[INFO] Apache Hadoop MapReduce JobClient .................. FAILURE [ 01:49 h]
[INFO] Apache Hadoop MapReduce HistoryServer Plugins ...... SUCCESS [ 6.995 s]
[INFO] Apache Hadoop MapReduce NativeTask ................. FAILURE [07:52 min]
[INFO] Apache Hadoop MapReduce Examples ................... SKIPPED
[INFO] Apache Hadoop MapReduce ............................ FAILURE [ 1.236 s]
[INFO] ------------------------------------------------------------------------
[INFO] BUILD FAILURE
[INFO] ------------------------------------------------------------------------
[INFO] Total time: 02:16 h
[INFO] Finished at: 2016-06-02T18:33:47+00:00
[INFO] Final Memory: 108M/2658M
[INFO] ------------------------------------------------------------------------
[WARNING] The requested profile "docs" could not be activated because it does not exist.
[WARNING] The requested profile "parallel-tests" could not be activated because it does not exist.
[ERROR] Failed to execute goal org.apache.maven.plugins:maven-surefire-plugin:2.17:test (default-test) on project hadoop-mapreduce-client-jobclient: There are test failures.
[ERROR]
[ERROR] Please refer to /home/jenkins/jenkins-slave/workspace/Hadoop-Mapreduce-trunk-Java8/source/hadoop-mapreduce-project/hadoop-mapreduce-client/hadoop-mapreduce-client-jobclient/target/surefire-reports for the individual test results.
[ERROR] -> [Help 1]
[ERROR] Failed to execute goal org.apache.hadoop:hadoop-maven-plugins:3.0.0-alpha1-SNAPSHOT:cmake-test (nttest) on project hadoop-mapreduce-client-nativetask: Test /home/jenkins/jenkins-slave/workspace/Hadoop-Mapreduce-trunk-Java8/source/hadoop-mapreduce-project/hadoop-mapreduce-client/hadoop-mapreduce-client-nativetask/target/native/test/nttest returned ERROR CODE 127 -> [Help 2]
[ERROR] Failed to execute goal org.apache.maven.plugins:maven-assembly-plugin:2.4:single (package-mapreduce) on project hadoop-mapreduce: Failed to create assembly: Error adding file 'org.apache.hadoop:hadoop-mapreduce-client-jobclient:jar:3.0.0-alpha1-SNAPSHOT' to archive: /home/jenkins/jenkins-slave/workspace/Hadoop-Mapreduce-trunk-Java8/source/hadoop-mapreduce-project/hadoop-mapreduce-client/hadoop-mapreduce-client-jobclient/target/classes isn't a file. -> [Help 2]
[ERROR]
[ERROR] To see the full stack trace of the errors, re-run Maven with the -e switch.
[ERROR] Re-run Maven using the -X switch to enable full debug logging.
[ERROR]
[ERROR] For more information about the errors and possible solutions, please read the following articles:
[ERROR] [Help 1] http://cwiki.apache.org/confluence/display/MAVEN/MojoFailureException
[ERROR] [Help 2] http://cwiki.apache.org/confluence/display/MAVEN/MojoExecutionException
[ERROR]
[ERROR] After correcting the problems, you can resume the build with the command
[ERROR] mvn <goals> -rf :hadoop-mapreduce-client-jobclient
Build step 'Execute shell' marked build as failure
[FINDBUGS] Skipping publisher since build result is FAILURE
Archiving artifacts
Setting LATEST1_8_HOME=/home/jenkins/jenkins-slave/tools/hudson.model.JDK/latest1.8
Setting MAVEN_3_3_3_HOME=/home/jenkins/jenkins-slave/tools/hudson.tasks.Maven_MavenInstallation/maven-3.3.3
Recording test results
Setting LATEST1_8_HOME=/home/jenkins/jenkins-slave/tools/hudson.model.JDK/latest1.8
Setting MAVEN_3_3_3_HOME=/home/jenkins/jenkins-slave/tools/hudson.tasks.Maven_MavenInstallation/maven-3.3.3
Email was triggered for: Failure - Any
Sending email for trigger: Failure - Any
Setting LATEST1_8_HOME=/home/jenkins/jenkins-slave/tools/hudson.model.JDK/latest1.8
Setting MAVEN_3_3_3_HOME=/home/jenkins/jenkins-slave/tools/hudson.tasks.Maven_MavenInstallation/maven-3.3.3
Setting LATEST1_8_HOME=/home/jenkins/jenkins-slave/tools/hudson.model.JDK/latest1.8
Setting MAVEN_3_3_3_HOME=/home/jenkins/jenkins-slave/tools/hudson.tasks.Maven_MavenInstallation/maven-3.3.3
###################################################################################
############################## FAILED TESTS (if any) ##############################
2 tests failed.
FAILED: org.apache.hadoop.mapred.TestMiniMRChildTask.testTaskEnv
Error Message:
The environment checker job failed.
Stack Trace:
java.lang.AssertionError: The environment checker job failed.
at org.junit.Assert.fail(Assert.java:88)
at org.junit.Assert.assertTrue(Assert.java:41)
at org.apache.hadoop.mapred.TestMiniMRChildTask.runTestTaskEnv(TestMiniMRChildTask.java:550)
at org.apache.hadoop.mapred.TestMiniMRChildTask.testTaskEnv(TestMiniMRChildTask.java:472)
FAILED: org.apache.hadoop.mapred.TestMiniMRChildTask.testTaskOldEnv
Error Message:
The environment checker job failed.
Stack Trace:
java.lang.AssertionError: The environment checker job failed.
at org.junit.Assert.fail(Assert.java:88)
at org.junit.Assert.assertTrue(Assert.java:41)
at org.apache.hadoop.mapred.TestMiniMRChildTask.runTestTaskEnv(TestMiniMRChildTask.java:550)
at org.apache.hadoop.mapred.TestMiniMRChildTask.testTaskOldEnv(TestMiniMRChildTask.java:496)
Hadoop-Mapreduce-trunk-Java8 - Build # 1490 - Still Failing
Posted by Apache Jenkins Server <je...@builds.apache.org>.
See https://builds.apache.org/job/Hadoop-Mapreduce-trunk-Java8/1490/
###################################################################################
########################## LAST 60 LINES OF THE CONSOLE ###########################
[...truncated 4093 lines...]
main:
[INFO] Executed tasks
[INFO]
[INFO] --- maven-assembly-plugin:2.4:single (package-mapreduce) @ hadoop-mapreduce ---
[WARNING] The following patterns were never triggered in this artifact inclusion filter:
o 'org.apache.hadoop:hadoop-yarn-server-tests'
[INFO] ------------------------------------------------------------------------
[INFO] Reactor Summary:
[INFO]
[INFO] Apache Hadoop MapReduce Client ..................... SUCCESS [ 4.179 s]
[INFO] Apache Hadoop MapReduce Core ....................... FAILURE [01:37 min]
[INFO] Apache Hadoop MapReduce Common ..................... SKIPPED
[INFO] Apache Hadoop MapReduce Shuffle .................... SKIPPED
[INFO] Apache Hadoop MapReduce App ........................ SKIPPED
[INFO] Apache Hadoop MapReduce HistoryServer .............. SKIPPED
[INFO] Apache Hadoop MapReduce JobClient .................. SKIPPED
[INFO] Apache Hadoop MapReduce HistoryServer Plugins ...... SKIPPED
[INFO] Apache Hadoop MapReduce NativeTask ................. SKIPPED
[INFO] Apache Hadoop MapReduce Examples ................... SKIPPED
[INFO] Apache Hadoop MapReduce ............................ FAILURE [ 1.002 s]
[INFO] ------------------------------------------------------------------------
[INFO] BUILD FAILURE
[INFO] ------------------------------------------------------------------------
[INFO] Total time: 01:44 min
[INFO] Finished at: 2016-06-02T12:17:50+00:00
[INFO] Final Memory: 68M/1265M
[INFO] ------------------------------------------------------------------------
[WARNING] The requested profile "docs" could not be activated because it does not exist.
[WARNING] The requested profile "parallel-tests" could not be activated because it does not exist.
[ERROR] Failed to execute goal org.apache.maven.plugins:maven-surefire-plugin:2.17:test (default-test) on project hadoop-mapreduce-client-core: There are test failures.
[ERROR]
[ERROR] Please refer to /home/jenkins/jenkins-slave/workspace/Hadoop-Mapreduce-trunk-Java8/source/hadoop-mapreduce-project/hadoop-mapreduce-client/hadoop-mapreduce-client-core/target/surefire-reports for the individual test results.
[ERROR] -> [Help 1]
[ERROR] Failed to execute goal org.apache.maven.plugins:maven-assembly-plugin:2.4:single (package-mapreduce) on project hadoop-mapreduce: Failed to create assembly: Error adding file 'org.apache.hadoop:hadoop-mapreduce-client-core:jar:3.0.0-alpha1-SNAPSHOT' to archive: /home/jenkins/jenkins-slave/workspace/Hadoop-Mapreduce-trunk-Java8/source/hadoop-mapreduce-project/hadoop-mapreduce-client/hadoop-mapreduce-client-core/target/classes isn't a file. -> [Help 2]
[ERROR]
[ERROR] To see the full stack trace of the errors, re-run Maven with the -e switch.
[ERROR] Re-run Maven using the -X switch to enable full debug logging.
[ERROR]
[ERROR] For more information about the errors and possible solutions, please read the following articles:
[ERROR] [Help 1] http://cwiki.apache.org/confluence/display/MAVEN/MojoFailureException
[ERROR] [Help 2] http://cwiki.apache.org/confluence/display/MAVEN/MojoExecutionException
[ERROR]
[ERROR] After correcting the problems, you can resume the build with the command
[ERROR] mvn <goals> -rf :hadoop-mapreduce-client-core
Build step 'Execute shell' marked build as failure
[FINDBUGS] Skipping publisher since build result is FAILURE
Archiving artifacts
Setting LATEST1_8_HOME=/home/jenkins/jenkins-slave/tools/hudson.model.JDK/latest1.8
Setting MAVEN_3_3_3_HOME=/home/jenkins/jenkins-slave/tools/hudson.tasks.Maven_MavenInstallation/maven-3.3.3
Recording test results
Setting LATEST1_8_HOME=/home/jenkins/jenkins-slave/tools/hudson.model.JDK/latest1.8
Setting MAVEN_3_3_3_HOME=/home/jenkins/jenkins-slave/tools/hudson.tasks.Maven_MavenInstallation/maven-3.3.3
Email was triggered for: Failure - Any
Sending email for trigger: Failure - Any
Setting LATEST1_8_HOME=/home/jenkins/jenkins-slave/tools/hudson.model.JDK/latest1.8
Setting MAVEN_3_3_3_HOME=/home/jenkins/jenkins-slave/tools/hudson.tasks.Maven_MavenInstallation/maven-3.3.3
Setting LATEST1_8_HOME=/home/jenkins/jenkins-slave/tools/hudson.model.JDK/latest1.8
Setting MAVEN_3_3_3_HOME=/home/jenkins/jenkins-slave/tools/hudson.tasks.Maven_MavenInstallation/maven-3.3.3
###################################################################################
############################## FAILED TESTS (if any) ##############################
1 tests failed.
FAILED: org.apache.hadoop.mapreduce.tools.TestCLI.testGetJob
Error Message:
null
Stack Trace:
java.lang.AssertionError: null
at org.junit.Assert.fail(Assert.java:86)
at org.junit.Assert.assertTrue(Assert.java:41)
at org.junit.Assert.assertTrue(Assert.java:52)
at org.apache.hadoop.mapreduce.tools.TestCLI.testGetJob(TestCLI.java:181)
Hadoop-Mapreduce-trunk-Java8 - Build # 1489 - Still Failing
Posted by Apache Jenkins Server <je...@builds.apache.org>.
See https://builds.apache.org/job/Hadoop-Mapreduce-trunk-Java8/1489/
###################################################################################
########################## LAST 60 LINES OF THE CONSOLE ###########################
[...truncated 4093 lines...]
main:
[INFO] Executed tasks
[INFO]
[INFO] --- maven-assembly-plugin:2.4:single (package-mapreduce) @ hadoop-mapreduce ---
[WARNING] The following patterns were never triggered in this artifact inclusion filter:
o 'org.apache.hadoop:hadoop-yarn-server-tests'
[INFO] ------------------------------------------------------------------------
[INFO] Reactor Summary:
[INFO]
[INFO] Apache Hadoop MapReduce Client ..................... SUCCESS [ 6.822 s]
[INFO] Apache Hadoop MapReduce Core ....................... FAILURE [01:56 min]
[INFO] Apache Hadoop MapReduce Common ..................... SKIPPED
[INFO] Apache Hadoop MapReduce Shuffle .................... SKIPPED
[INFO] Apache Hadoop MapReduce App ........................ SKIPPED
[INFO] Apache Hadoop MapReduce HistoryServer .............. SKIPPED
[INFO] Apache Hadoop MapReduce JobClient .................. SKIPPED
[INFO] Apache Hadoop MapReduce HistoryServer Plugins ...... SKIPPED
[INFO] Apache Hadoop MapReduce NativeTask ................. SKIPPED
[INFO] Apache Hadoop MapReduce Examples ................... SKIPPED
[INFO] Apache Hadoop MapReduce ............................ FAILURE [ 1.131 s]
[INFO] ------------------------------------------------------------------------
[INFO] BUILD FAILURE
[INFO] ------------------------------------------------------------------------
[INFO] Total time: 02:05 min
[INFO] Finished at: 2016-06-02T11:19:05+00:00
[INFO] Final Memory: 69M/1281M
[INFO] ------------------------------------------------------------------------
[WARNING] The requested profile "docs" could not be activated because it does not exist.
[WARNING] The requested profile "parallel-tests" could not be activated because it does not exist.
[ERROR] Failed to execute goal org.apache.maven.plugins:maven-surefire-plugin:2.17:test (default-test) on project hadoop-mapreduce-client-core: There are test failures.
[ERROR]
[ERROR] Please refer to /home/jenkins/jenkins-slave/workspace/Hadoop-Mapreduce-trunk-Java8/source/hadoop-mapreduce-project/hadoop-mapreduce-client/hadoop-mapreduce-client-core/target/surefire-reports for the individual test results.
[ERROR] -> [Help 1]
[ERROR] Failed to execute goal org.apache.maven.plugins:maven-assembly-plugin:2.4:single (package-mapreduce) on project hadoop-mapreduce: Failed to create assembly: Error adding file 'org.apache.hadoop:hadoop-mapreduce-client-core:jar:3.0.0-alpha1-SNAPSHOT' to archive: /home/jenkins/jenkins-slave/workspace/Hadoop-Mapreduce-trunk-Java8/source/hadoop-mapreduce-project/hadoop-mapreduce-client/hadoop-mapreduce-client-core/target/classes isn't a file. -> [Help 2]
[ERROR]
[ERROR] To see the full stack trace of the errors, re-run Maven with the -e switch.
[ERROR] Re-run Maven using the -X switch to enable full debug logging.
[ERROR]
[ERROR] For more information about the errors and possible solutions, please read the following articles:
[ERROR] [Help 1] http://cwiki.apache.org/confluence/display/MAVEN/MojoFailureException
[ERROR] [Help 2] http://cwiki.apache.org/confluence/display/MAVEN/MojoExecutionException
[ERROR]
[ERROR] After correcting the problems, you can resume the build with the command
[ERROR] mvn <goals> -rf :hadoop-mapreduce-client-core
Build step 'Execute shell' marked build as failure
[FINDBUGS] Skipping publisher since build result is FAILURE
Archiving artifacts
Setting LATEST1_8_HOME=/home/jenkins/jenkins-slave/tools/hudson.model.JDK/latest1.8
Setting MAVEN_3_3_3_HOME=/home/jenkins/jenkins-slave/tools/hudson.tasks.Maven_MavenInstallation/maven-3.3.3
Recording test results
Setting LATEST1_8_HOME=/home/jenkins/jenkins-slave/tools/hudson.model.JDK/latest1.8
Setting MAVEN_3_3_3_HOME=/home/jenkins/jenkins-slave/tools/hudson.tasks.Maven_MavenInstallation/maven-3.3.3
Email was triggered for: Failure - Any
Sending email for trigger: Failure - Any
Setting LATEST1_8_HOME=/home/jenkins/jenkins-slave/tools/hudson.model.JDK/latest1.8
Setting MAVEN_3_3_3_HOME=/home/jenkins/jenkins-slave/tools/hudson.tasks.Maven_MavenInstallation/maven-3.3.3
Setting LATEST1_8_HOME=/home/jenkins/jenkins-slave/tools/hudson.model.JDK/latest1.8
Setting MAVEN_3_3_3_HOME=/home/jenkins/jenkins-slave/tools/hudson.tasks.Maven_MavenInstallation/maven-3.3.3
###################################################################################
############################## FAILED TESTS (if any) ##############################
1 tests failed.
FAILED: org.apache.hadoop.mapreduce.tools.TestCLI.testGetJob
Error Message:
null
Stack Trace:
java.lang.AssertionError: null
at org.junit.Assert.fail(Assert.java:86)
at org.junit.Assert.assertTrue(Assert.java:41)
at org.junit.Assert.assertTrue(Assert.java:52)
at org.apache.hadoop.mapreduce.tools.TestCLI.testGetJob(TestCLI.java:181)
Hadoop-Mapreduce-trunk-Java8 - Build # 1488 - Still Failing
Posted by Apache Jenkins Server <je...@builds.apache.org>.
See https://builds.apache.org/job/Hadoop-Mapreduce-trunk-Java8/1488/
###################################################################################
########################## LAST 60 LINES OF THE CONSOLE ###########################
[...truncated 4093 lines...]
main:
[INFO] Executed tasks
[INFO]
[INFO] --- maven-assembly-plugin:2.4:single (package-mapreduce) @ hadoop-mapreduce ---
[WARNING] The following patterns were never triggered in this artifact inclusion filter:
o 'org.apache.hadoop:hadoop-yarn-server-tests'
[INFO] ------------------------------------------------------------------------
[INFO] Reactor Summary:
[INFO]
[INFO] Apache Hadoop MapReduce Client ..................... SUCCESS [ 4.403 s]
[INFO] Apache Hadoop MapReduce Core ....................... FAILURE [01:37 min]
[INFO] Apache Hadoop MapReduce Common ..................... SKIPPED
[INFO] Apache Hadoop MapReduce Shuffle .................... SKIPPED
[INFO] Apache Hadoop MapReduce App ........................ SKIPPED
[INFO] Apache Hadoop MapReduce HistoryServer .............. SKIPPED
[INFO] Apache Hadoop MapReduce JobClient .................. SKIPPED
[INFO] Apache Hadoop MapReduce HistoryServer Plugins ...... SKIPPED
[INFO] Apache Hadoop MapReduce NativeTask ................. SKIPPED
[INFO] Apache Hadoop MapReduce Examples ................... SKIPPED
[INFO] Apache Hadoop MapReduce ............................ FAILURE [ 0.998 s]
[INFO] ------------------------------------------------------------------------
[INFO] BUILD FAILURE
[INFO] ------------------------------------------------------------------------
[INFO] Total time: 01:44 min
[INFO] Finished at: 2016-06-02T10:17:56+00:00
[INFO] Final Memory: 68M/1252M
[INFO] ------------------------------------------------------------------------
[WARNING] The requested profile "docs" could not be activated because it does not exist.
[WARNING] The requested profile "parallel-tests" could not be activated because it does not exist.
[ERROR] Failed to execute goal org.apache.maven.plugins:maven-surefire-plugin:2.17:test (default-test) on project hadoop-mapreduce-client-core: There are test failures.
[ERROR]
[ERROR] Please refer to /home/jenkins/jenkins-slave/workspace/Hadoop-Mapreduce-trunk-Java8/source/hadoop-mapreduce-project/hadoop-mapreduce-client/hadoop-mapreduce-client-core/target/surefire-reports for the individual test results.
[ERROR] -> [Help 1]
[ERROR] Failed to execute goal org.apache.maven.plugins:maven-assembly-plugin:2.4:single (package-mapreduce) on project hadoop-mapreduce: Failed to create assembly: Error adding file 'org.apache.hadoop:hadoop-mapreduce-client-core:jar:3.0.0-alpha1-SNAPSHOT' to archive: /home/jenkins/jenkins-slave/workspace/Hadoop-Mapreduce-trunk-Java8/source/hadoop-mapreduce-project/hadoop-mapreduce-client/hadoop-mapreduce-client-core/target/classes isn't a file. -> [Help 2]
[ERROR]
[ERROR] To see the full stack trace of the errors, re-run Maven with the -e switch.
[ERROR] Re-run Maven using the -X switch to enable full debug logging.
[ERROR]
[ERROR] For more information about the errors and possible solutions, please read the following articles:
[ERROR] [Help 1] http://cwiki.apache.org/confluence/display/MAVEN/MojoFailureException
[ERROR] [Help 2] http://cwiki.apache.org/confluence/display/MAVEN/MojoExecutionException
[ERROR]
[ERROR] After correcting the problems, you can resume the build with the command
[ERROR] mvn <goals> -rf :hadoop-mapreduce-client-core
Build step 'Execute shell' marked build as failure
[FINDBUGS] Skipping publisher since build result is FAILURE
Archiving artifacts
Setting LATEST1_8_HOME=/home/jenkins/jenkins-slave/tools/hudson.model.JDK/latest1.8
Setting MAVEN_3_3_3_HOME=/home/jenkins/jenkins-slave/tools/hudson.tasks.Maven_MavenInstallation/maven-3.3.3
Recording test results
Setting LATEST1_8_HOME=/home/jenkins/jenkins-slave/tools/hudson.model.JDK/latest1.8
Setting MAVEN_3_3_3_HOME=/home/jenkins/jenkins-slave/tools/hudson.tasks.Maven_MavenInstallation/maven-3.3.3
Email was triggered for: Failure - Any
Sending email for trigger: Failure - Any
Setting LATEST1_8_HOME=/home/jenkins/jenkins-slave/tools/hudson.model.JDK/latest1.8
Setting MAVEN_3_3_3_HOME=/home/jenkins/jenkins-slave/tools/hudson.tasks.Maven_MavenInstallation/maven-3.3.3
Setting LATEST1_8_HOME=/home/jenkins/jenkins-slave/tools/hudson.model.JDK/latest1.8
Setting MAVEN_3_3_3_HOME=/home/jenkins/jenkins-slave/tools/hudson.tasks.Maven_MavenInstallation/maven-3.3.3
###################################################################################
############################## FAILED TESTS (if any) ##############################
1 tests failed.
FAILED: org.apache.hadoop.mapreduce.tools.TestCLI.testGetJob
Error Message:
null
Stack Trace:
java.lang.AssertionError: null
at org.junit.Assert.fail(Assert.java:86)
at org.junit.Assert.assertTrue(Assert.java:41)
at org.junit.Assert.assertTrue(Assert.java:52)
at org.apache.hadoop.mapreduce.tools.TestCLI.testGetJob(TestCLI.java:181)
Hadoop-Mapreduce-trunk-Java8 - Build # 1487 - Still Failing
Posted by Apache Jenkins Server <je...@builds.apache.org>.
See https://builds.apache.org/job/Hadoop-Mapreduce-trunk-Java8/1487/
###################################################################################
########################## LAST 60 LINES OF THE CONSOLE ###########################
[...truncated 20605 lines...]
[WARNING] The following patterns were never triggered in this artifact exclusion filter:
o 'org.apache.hadoop:hadoop-common'
o 'org.apache.hadoop:hadoop-hdfs'
o 'jdiff:jdiff:jar'
[INFO] ------------------------------------------------------------------------
[INFO] Reactor Summary:
[INFO]
[INFO] Apache Hadoop MapReduce Client ..................... SUCCESS [ 4.538 s]
[INFO] Apache Hadoop MapReduce Core ....................... SUCCESS [02:35 min]
[INFO] Apache Hadoop MapReduce Common ..................... SUCCESS [01:03 min]
[INFO] Apache Hadoop MapReduce Shuffle .................... SUCCESS [ 15.525 s]
[INFO] Apache Hadoop MapReduce App ........................ SUCCESS [08:49 min]
[INFO] Apache Hadoop MapReduce HistoryServer .............. SUCCESS [05:57 min]
[INFO] Apache Hadoop MapReduce JobClient .................. FAILURE [ 01:49 h]
[INFO] Apache Hadoop MapReduce HistoryServer Plugins ...... SUCCESS [ 7.458 s]
[INFO] Apache Hadoop MapReduce NativeTask ................. FAILURE [07:46 min]
[INFO] Apache Hadoop MapReduce Examples ................... SKIPPED
[INFO] Apache Hadoop MapReduce ............................ FAILURE [ 11.800 s]
[INFO] ------------------------------------------------------------------------
[INFO] BUILD FAILURE
[INFO] ------------------------------------------------------------------------
[INFO] Total time: 02:16 h
[INFO] Finished at: 2016-06-02T01:50:14+00:00
[INFO] Final Memory: 117M/2208M
[INFO] ------------------------------------------------------------------------
[WARNING] The requested profile "docs" could not be activated because it does not exist.
[WARNING] The requested profile "parallel-tests" could not be activated because it does not exist.
[ERROR] Failed to execute goal org.apache.maven.plugins:maven-surefire-plugin:2.17:test (default-test) on project hadoop-mapreduce-client-jobclient: There are test failures.
[ERROR]
[ERROR] Please refer to /home/jenkins/jenkins-slave/workspace/Hadoop-Mapreduce-trunk-Java8/source/hadoop-mapreduce-project/hadoop-mapreduce-client/hadoop-mapreduce-client-jobclient/target/surefire-reports for the individual test results.
[ERROR] -> [Help 1]
[ERROR] Failed to execute goal org.apache.hadoop:hadoop-maven-plugins:3.0.0-alpha1-SNAPSHOT:cmake-test (nttest) on project hadoop-mapreduce-client-nativetask: Test /home/jenkins/jenkins-slave/workspace/Hadoop-Mapreduce-trunk-Java8/source/hadoop-mapreduce-project/hadoop-mapreduce-client/hadoop-mapreduce-client-nativetask/target/native/test/nttest returned ERROR CODE 127 -> [Help 2]
[ERROR] Failed to execute goal org.apache.maven.plugins:maven-assembly-plugin:2.4:single (package-mapreduce) on project hadoop-mapreduce: Failed to create assembly: Error adding file 'org.apache.hadoop:hadoop-mapreduce-client-jobclient:jar:3.0.0-alpha1-SNAPSHOT' to archive: /home/jenkins/jenkins-slave/workspace/Hadoop-Mapreduce-trunk-Java8/source/hadoop-mapreduce-project/hadoop-mapreduce-client/hadoop-mapreduce-client-jobclient/target/classes isn't a file. -> [Help 2]
[ERROR]
[ERROR] To see the full stack trace of the errors, re-run Maven with the -e switch.
[ERROR] Re-run Maven using the -X switch to enable full debug logging.
[ERROR]
[ERROR] For more information about the errors and possible solutions, please read the following articles:
[ERROR] [Help 1] http://cwiki.apache.org/confluence/display/MAVEN/MojoFailureException
[ERROR] [Help 2] http://cwiki.apache.org/confluence/display/MAVEN/MojoExecutionException
[ERROR]
[ERROR] After correcting the problems, you can resume the build with the command
[ERROR] mvn <goals> -rf :hadoop-mapreduce-client-jobclient
Build step 'Execute shell' marked build as failure
[FINDBUGS] Skipping publisher since build result is FAILURE
Archiving artifacts
Setting LATEST1_8_HOME=/home/jenkins/jenkins-slave/tools/hudson.model.JDK/latest1.8
Setting MAVEN_3_3_3_HOME=/home/jenkins/jenkins-slave/tools/hudson.tasks.Maven_MavenInstallation/maven-3.3.3
Recording test results
Setting LATEST1_8_HOME=/home/jenkins/jenkins-slave/tools/hudson.model.JDK/latest1.8
Setting MAVEN_3_3_3_HOME=/home/jenkins/jenkins-slave/tools/hudson.tasks.Maven_MavenInstallation/maven-3.3.3
Email was triggered for: Failure - Any
Sending email for trigger: Failure - Any
Setting LATEST1_8_HOME=/home/jenkins/jenkins-slave/tools/hudson.model.JDK/latest1.8
Setting MAVEN_3_3_3_HOME=/home/jenkins/jenkins-slave/tools/hudson.tasks.Maven_MavenInstallation/maven-3.3.3
Setting LATEST1_8_HOME=/home/jenkins/jenkins-slave/tools/hudson.model.JDK/latest1.8
Setting MAVEN_3_3_3_HOME=/home/jenkins/jenkins-slave/tools/hudson.tasks.Maven_MavenInstallation/maven-3.3.3
###################################################################################
############################## FAILED TESTS (if any) ##############################
3 tests failed.
FAILED: org.apache.hadoop.mapreduce.TestMRJobClient.testJobClient
Error Message:
File does not exist: hdfs://localhost:58331/tmp/hadoop-yarn/staging/history/done_intermediate/jenkins/job_1464826863159_0001_conf.xml
Stack Trace:
java.io.FileNotFoundException: File does not exist: hdfs://localhost:58331/tmp/hadoop-yarn/staging/history/done_intermediate/jenkins/job_1464826863159_0001_conf.xml
at org.apache.hadoop.hdfs.DistributedFileSystem$27.doCall(DistributedFileSystem.java:1371)
at org.apache.hadoop.hdfs.DistributedFileSystem$27.doCall(DistributedFileSystem.java:1364)
at org.apache.hadoop.fs.FileSystemLinkResolver.resolve(FileSystemLinkResolver.java:81)
at org.apache.hadoop.hdfs.DistributedFileSystem.getFileStatus(DistributedFileSystem.java:1379)
at org.apache.hadoop.fs.FileUtil.copy(FileUtil.java:339)
at org.apache.hadoop.fs.FileUtil.copy(FileUtil.java:291)
at org.apache.hadoop.fs.FileSystem.copyToLocalFile(FileSystem.java:2069)
at org.apache.hadoop.fs.FileSystem.copyToLocalFile(FileSystem.java:2038)
at org.apache.hadoop.fs.FileSystem.copyToLocalFile(FileSystem.java:2014)
at org.apache.hadoop.mapreduce.tools.CLI.run(CLI.java:500)
at org.apache.hadoop.util.ToolRunner.run(ToolRunner.java:76)
at org.apache.hadoop.mapreduce.TestMRJobClient.runTool(TestMRJobClient.java:99)
at org.apache.hadoop.mapreduce.TestMRJobClient.testConfig(TestMRJobClient.java:555)
at org.apache.hadoop.mapreduce.TestMRJobClient.testJobClient(TestMRJobClient.java:172)
FAILED: org.apache.hadoop.mapred.TestMiniMRChildTask.testTaskEnv
Error Message:
The environment checker job failed.
Stack Trace:
java.lang.AssertionError: The environment checker job failed.
at org.junit.Assert.fail(Assert.java:88)
at org.junit.Assert.assertTrue(Assert.java:41)
at org.apache.hadoop.mapred.TestMiniMRChildTask.runTestTaskEnv(TestMiniMRChildTask.java:550)
at org.apache.hadoop.mapred.TestMiniMRChildTask.testTaskEnv(TestMiniMRChildTask.java:472)
FAILED: org.apache.hadoop.mapred.TestMiniMRChildTask.testTaskOldEnv
Error Message:
The environment checker job failed.
Stack Trace:
java.lang.AssertionError: The environment checker job failed.
at org.junit.Assert.fail(Assert.java:88)
at org.junit.Assert.assertTrue(Assert.java:41)
at org.apache.hadoop.mapred.TestMiniMRChildTask.runTestTaskEnv(TestMiniMRChildTask.java:550)
at org.apache.hadoop.mapred.TestMiniMRChildTask.testTaskOldEnv(TestMiniMRChildTask.java:496)
Hadoop-Mapreduce-trunk-Java8 - Build # 1486 - Still Failing
Posted by Apache Jenkins Server <je...@builds.apache.org>.
See https://builds.apache.org/job/Hadoop-Mapreduce-trunk-Java8/1486/
###################################################################################
########################## LAST 60 LINES OF THE CONSOLE ###########################
[...truncated 20586 lines...]
[INFO] Executed tasks
[INFO]
[INFO] --- maven-assembly-plugin:2.4:single (package-mapreduce) @ hadoop-mapreduce ---
[WARNING] The following patterns were never triggered in this artifact inclusion filter:
o 'org.apache.hadoop:hadoop-yarn-server-tests'
[INFO] ------------------------------------------------------------------------
[INFO] Reactor Summary:
[INFO]
[INFO] Apache Hadoop MapReduce Client ..................... SUCCESS [ 4.900 s]
[INFO] Apache Hadoop MapReduce Core ....................... SUCCESS [02:33 min]
[INFO] Apache Hadoop MapReduce Common ..................... SUCCESS [01:03 min]
[INFO] Apache Hadoop MapReduce Shuffle .................... SUCCESS [ 15.654 s]
[INFO] Apache Hadoop MapReduce App ........................ SUCCESS [08:49 min]
[INFO] Apache Hadoop MapReduce HistoryServer .............. SUCCESS [06:01 min]
[INFO] Apache Hadoop MapReduce JobClient .................. FAILURE [ 01:48 h]
[INFO] Apache Hadoop MapReduce HistoryServer Plugins ...... SUCCESS [ 6.750 s]
[INFO] Apache Hadoop MapReduce NativeTask ................. FAILURE [07:48 min]
[INFO] Apache Hadoop MapReduce Examples ................... SKIPPED
[INFO] Apache Hadoop MapReduce ............................ FAILURE [ 0.883 s]
[INFO] ------------------------------------------------------------------------
[INFO] BUILD FAILURE
[INFO] ------------------------------------------------------------------------
[INFO] Total time: 02:15 h
[INFO] Finished at: 2016-06-01T23:31:18+00:00
[INFO] Final Memory: 116M/2387M
[INFO] ------------------------------------------------------------------------
[WARNING] The requested profile "docs" could not be activated because it does not exist.
[WARNING] The requested profile "parallel-tests" could not be activated because it does not exist.
[ERROR] Failed to execute goal org.apache.maven.plugins:maven-surefire-plugin:2.17:test (default-test) on project hadoop-mapreduce-client-jobclient: There are test failures.
[ERROR]
[ERROR] Please refer to /home/jenkins/jenkins-slave/workspace/Hadoop-Mapreduce-trunk-Java8/source/hadoop-mapreduce-project/hadoop-mapreduce-client/hadoop-mapreduce-client-jobclient/target/surefire-reports for the individual test results.
[ERROR] -> [Help 1]
[ERROR] Failed to execute goal org.apache.hadoop:hadoop-maven-plugins:3.0.0-alpha1-SNAPSHOT:cmake-test (nttest) on project hadoop-mapreduce-client-nativetask: Test /home/jenkins/jenkins-slave/workspace/Hadoop-Mapreduce-trunk-Java8/source/hadoop-mapreduce-project/hadoop-mapreduce-client/hadoop-mapreduce-client-nativetask/target/native/test/nttest returned ERROR CODE 127 -> [Help 2]
[ERROR] Failed to execute goal org.apache.maven.plugins:maven-assembly-plugin:2.4:single (package-mapreduce) on project hadoop-mapreduce: Failed to create assembly: Error adding file 'org.apache.hadoop:hadoop-mapreduce-client-jobclient:jar:3.0.0-alpha1-SNAPSHOT' to archive: /home/jenkins/jenkins-slave/workspace/Hadoop-Mapreduce-trunk-Java8/source/hadoop-mapreduce-project/hadoop-mapreduce-client/hadoop-mapreduce-client-jobclient/target/classes isn't a file. -> [Help 2]
[ERROR]
[ERROR] To see the full stack trace of the errors, re-run Maven with the -e switch.
[ERROR] Re-run Maven using the -X switch to enable full debug logging.
[ERROR]
[ERROR] For more information about the errors and possible solutions, please read the following articles:
[ERROR] [Help 1] http://cwiki.apache.org/confluence/display/MAVEN/MojoFailureException
[ERROR] [Help 2] http://cwiki.apache.org/confluence/display/MAVEN/MojoExecutionException
[ERROR]
[ERROR] After correcting the problems, you can resume the build with the command
[ERROR] mvn <goals> -rf :hadoop-mapreduce-client-jobclient
Build step 'Execute shell' marked build as failure
[FINDBUGS] Skipping publisher since build result is FAILURE
Archiving artifacts
Setting LATEST1_8_HOME=/home/jenkins/jenkins-slave/tools/hudson.model.JDK/latest1.8
Setting MAVEN_3_3_3_HOME=/home/jenkins/jenkins-slave/tools/hudson.tasks.Maven_MavenInstallation/maven-3.3.3
Recording test results
Setting LATEST1_8_HOME=/home/jenkins/jenkins-slave/tools/hudson.model.JDK/latest1.8
Setting MAVEN_3_3_3_HOME=/home/jenkins/jenkins-slave/tools/hudson.tasks.Maven_MavenInstallation/maven-3.3.3
Email was triggered for: Failure - Any
Sending email for trigger: Failure - Any
Setting LATEST1_8_HOME=/home/jenkins/jenkins-slave/tools/hudson.model.JDK/latest1.8
Setting MAVEN_3_3_3_HOME=/home/jenkins/jenkins-slave/tools/hudson.tasks.Maven_MavenInstallation/maven-3.3.3
Setting LATEST1_8_HOME=/home/jenkins/jenkins-slave/tools/hudson.model.JDK/latest1.8
Setting MAVEN_3_3_3_HOME=/home/jenkins/jenkins-slave/tools/hudson.tasks.Maven_MavenInstallation/maven-3.3.3
###################################################################################
############################## FAILED TESTS (if any) ##############################
3 tests failed.
FAILED: org.apache.hadoop.mapred.TestMRCJCFileOutputCommitter.testAbort
Error Message:
Output directory not empty expected:<0> but was:<4>
Stack Trace:
java.lang.AssertionError: Output directory not empty expected:<0> but was:<4>
at org.junit.Assert.fail(Assert.java:88)
at org.junit.Assert.failNotEquals(Assert.java:743)
at org.junit.Assert.assertEquals(Assert.java:118)
at org.junit.Assert.assertEquals(Assert.java:555)
at org.apache.hadoop.mapred.TestMRCJCFileOutputCommitter.testAbort(TestMRCJCFileOutputCommitter.java:153)
FAILED: org.apache.hadoop.mapred.TestMiniMRChildTask.testTaskEnv
Error Message:
The environment checker job failed.
Stack Trace:
java.lang.AssertionError: The environment checker job failed.
at org.junit.Assert.fail(Assert.java:88)
at org.junit.Assert.assertTrue(Assert.java:41)
at org.apache.hadoop.mapred.TestMiniMRChildTask.runTestTaskEnv(TestMiniMRChildTask.java:550)
at org.apache.hadoop.mapred.TestMiniMRChildTask.testTaskEnv(TestMiniMRChildTask.java:472)
FAILED: org.apache.hadoop.mapred.TestMiniMRChildTask.testTaskOldEnv
Error Message:
The environment checker job failed.
Stack Trace:
java.lang.AssertionError: The environment checker job failed.
at org.junit.Assert.fail(Assert.java:88)
at org.junit.Assert.assertTrue(Assert.java:41)
at org.apache.hadoop.mapred.TestMiniMRChildTask.runTestTaskEnv(TestMiniMRChildTask.java:550)
at org.apache.hadoop.mapred.TestMiniMRChildTask.testTaskOldEnv(TestMiniMRChildTask.java:496)
Hadoop-Mapreduce-trunk-Java8 - Build # 1485 - Still Failing
Posted by Apache Jenkins Server <je...@builds.apache.org>.
See https://builds.apache.org/job/Hadoop-Mapreduce-trunk-Java8/1485/
###################################################################################
########################## LAST 60 LINES OF THE CONSOLE ###########################
[...truncated 18280 lines...]
[INFO] Executed tasks
[INFO]
[INFO] --- maven-assembly-plugin:2.4:single (package-mapreduce) @ hadoop-mapreduce ---
[WARNING] The following patterns were never triggered in this artifact inclusion filter:
o 'org.apache.hadoop:hadoop-yarn-server-tests'
[INFO] ------------------------------------------------------------------------
[INFO] Reactor Summary:
[INFO]
[INFO] Apache Hadoop MapReduce Client ..................... SUCCESS [ 5.634 s]
[INFO] Apache Hadoop MapReduce Core ....................... SUCCESS [02:48 min]
[INFO] Apache Hadoop MapReduce Common ..................... SUCCESS [01:05 min]
[INFO] Apache Hadoop MapReduce Shuffle .................... SUCCESS [ 16.093 s]
[INFO] Apache Hadoop MapReduce App ........................ FAILURE [08:40 min]
[INFO] Apache Hadoop MapReduce HistoryServer .............. SKIPPED
[INFO] Apache Hadoop MapReduce JobClient .................. SKIPPED
[INFO] Apache Hadoop MapReduce HistoryServer Plugins ...... SUCCESS [ 6.927 s]
[INFO] Apache Hadoop MapReduce NativeTask ................. FAILURE [07:57 min]
[INFO] Apache Hadoop MapReduce Examples ................... SKIPPED
[INFO] Apache Hadoop MapReduce ............................ FAILURE [ 1.255 s]
[INFO] ------------------------------------------------------------------------
[INFO] BUILD FAILURE
[INFO] ------------------------------------------------------------------------
[INFO] Total time: 21:03 min
[INFO] Finished at: 2016-06-01T20:37:59+00:00
[INFO] Final Memory: 107M/2586M
[INFO] ------------------------------------------------------------------------
[WARNING] The requested profile "docs" could not be activated because it does not exist.
[WARNING] The requested profile "parallel-tests" could not be activated because it does not exist.
[ERROR] Failed to execute goal org.apache.maven.plugins:maven-surefire-plugin:2.17:test (default-test) on project hadoop-mapreduce-client-app: There are test failures.
[ERROR]
[ERROR] Please refer to /home/jenkins/jenkins-slave/workspace/Hadoop-Mapreduce-trunk-Java8/source/hadoop-mapreduce-project/hadoop-mapreduce-client/hadoop-mapreduce-client-app/target/surefire-reports for the individual test results.
[ERROR] -> [Help 1]
[ERROR] Failed to execute goal org.apache.hadoop:hadoop-maven-plugins:3.0.0-alpha1-SNAPSHOT:cmake-test (nttest) on project hadoop-mapreduce-client-nativetask: Test /home/jenkins/jenkins-slave/workspace/Hadoop-Mapreduce-trunk-Java8/source/hadoop-mapreduce-project/hadoop-mapreduce-client/hadoop-mapreduce-client-nativetask/target/native/test/nttest returned ERROR CODE 127 -> [Help 2]
[ERROR] Failed to execute goal org.apache.maven.plugins:maven-assembly-plugin:2.4:single (package-mapreduce) on project hadoop-mapreduce: Failed to create assembly: Error adding file 'org.apache.hadoop:hadoop-mapreduce-client-app:jar:3.0.0-alpha1-SNAPSHOT' to archive: /home/jenkins/jenkins-slave/workspace/Hadoop-Mapreduce-trunk-Java8/source/hadoop-mapreduce-project/hadoop-mapreduce-client/hadoop-mapreduce-client-app/target/classes isn't a file. -> [Help 2]
[ERROR]
[ERROR] To see the full stack trace of the errors, re-run Maven with the -e switch.
[ERROR] Re-run Maven using the -X switch to enable full debug logging.
[ERROR]
[ERROR] For more information about the errors and possible solutions, please read the following articles:
[ERROR] [Help 1] http://cwiki.apache.org/confluence/display/MAVEN/MojoFailureException
[ERROR] [Help 2] http://cwiki.apache.org/confluence/display/MAVEN/MojoExecutionException
[ERROR]
[ERROR] After correcting the problems, you can resume the build with the command
[ERROR] mvn <goals> -rf :hadoop-mapreduce-client-app
Build step 'Execute shell' marked build as failure
[FINDBUGS] Skipping publisher since build result is FAILURE
Archiving artifacts
Setting LATEST1_8_HOME=/home/jenkins/jenkins-slave/tools/hudson.model.JDK/latest1.8
Setting MAVEN_3_3_3_HOME=/home/jenkins/jenkins-slave/tools/hudson.tasks.Maven_MavenInstallation/maven-3.3.3
Recording test results
Setting LATEST1_8_HOME=/home/jenkins/jenkins-slave/tools/hudson.model.JDK/latest1.8
Setting MAVEN_3_3_3_HOME=/home/jenkins/jenkins-slave/tools/hudson.tasks.Maven_MavenInstallation/maven-3.3.3
Email was triggered for: Failure - Any
Sending email for trigger: Failure - Any
Setting LATEST1_8_HOME=/home/jenkins/jenkins-slave/tools/hudson.model.JDK/latest1.8
Setting MAVEN_3_3_3_HOME=/home/jenkins/jenkins-slave/tools/hudson.tasks.Maven_MavenInstallation/maven-3.3.3
Setting LATEST1_8_HOME=/home/jenkins/jenkins-slave/tools/hudson.model.JDK/latest1.8
Setting MAVEN_3_3_3_HOME=/home/jenkins/jenkins-slave/tools/hudson.tasks.Maven_MavenInstallation/maven-3.3.3
###################################################################################
############################## FAILED TESTS (if any) ##############################
1 tests failed.
FAILED: org.apache.hadoop.mapreduce.v2.app.TestRecovery.testCrashed
Error Message:
TaskAttempt state is not correct (timedout) expected:<FAILED> but was:<STARTING>
Stack Trace:
java.lang.AssertionError: TaskAttempt state is not correct (timedout) expected:<FAILED> but was:<STARTING>
at org.junit.Assert.fail(Assert.java:88)
at org.junit.Assert.failNotEquals(Assert.java:743)
at org.junit.Assert.assertEquals(Assert.java:118)
at org.apache.hadoop.mapreduce.v2.app.MRApp.waitForState(MRApp.java:382)
at org.apache.hadoop.mapreduce.v2.app.TestRecovery.testCrashed(TestRecovery.java:188)
Hadoop-Mapreduce-trunk-Java8 - Build # 1484 - Still Failing
Posted by Apache Jenkins Server <je...@builds.apache.org>.
See https://builds.apache.org/job/Hadoop-Mapreduce-trunk-Java8/1484/
###################################################################################
########################## LAST 60 LINES OF THE CONSOLE ###########################
[...truncated 20584 lines...]
[INFO] Executed tasks
[INFO]
[INFO] --- maven-assembly-plugin:2.4:single (package-mapreduce) @ hadoop-mapreduce ---
[WARNING] The following patterns were never triggered in this artifact inclusion filter:
o 'org.apache.hadoop:hadoop-yarn-server-tests'
[INFO] ------------------------------------------------------------------------
[INFO] Reactor Summary:
[INFO]
[INFO] Apache Hadoop MapReduce Client ..................... SUCCESS [ 5.495 s]
[INFO] Apache Hadoop MapReduce Core ....................... SUCCESS [02:56 min]
[INFO] Apache Hadoop MapReduce Common ..................... SUCCESS [01:11 min]
[INFO] Apache Hadoop MapReduce Shuffle .................... SUCCESS [ 20.336 s]
[INFO] Apache Hadoop MapReduce App ........................ SUCCESS [09:40 min]
[INFO] Apache Hadoop MapReduce HistoryServer .............. SUCCESS [06:46 min]
[INFO] Apache Hadoop MapReduce JobClient .................. FAILURE [ 01:55 h]
[INFO] Apache Hadoop MapReduce HistoryServer Plugins ...... SUCCESS [ 6.760 s]
[INFO] Apache Hadoop MapReduce NativeTask ................. FAILURE [07:49 min]
[INFO] Apache Hadoop MapReduce Examples ................... SKIPPED
[INFO] Apache Hadoop MapReduce ............................ FAILURE [ 0.930 s]
[INFO] ------------------------------------------------------------------------
[INFO] BUILD FAILURE
[INFO] ------------------------------------------------------------------------
[INFO] Total time: 02:24 h
[INFO] Finished at: 2016-06-01T16:42:03+00:00
[INFO] Final Memory: 109M/2332M
[INFO] ------------------------------------------------------------------------
[WARNING] The requested profile "docs" could not be activated because it does not exist.
[WARNING] The requested profile "parallel-tests" could not be activated because it does not exist.
[ERROR] Failed to execute goal org.apache.maven.plugins:maven-surefire-plugin:2.17:test (default-test) on project hadoop-mapreduce-client-jobclient: There are test failures.
[ERROR]
[ERROR] Please refer to /home/jenkins/jenkins-slave/workspace/Hadoop-Mapreduce-trunk-Java8/source/hadoop-mapreduce-project/hadoop-mapreduce-client/hadoop-mapreduce-client-jobclient/target/surefire-reports for the individual test results.
[ERROR] -> [Help 1]
[ERROR] Failed to execute goal org.apache.hadoop:hadoop-maven-plugins:3.0.0-alpha1-SNAPSHOT:cmake-test (nttest) on project hadoop-mapreduce-client-nativetask: Test /home/jenkins/jenkins-slave/workspace/Hadoop-Mapreduce-trunk-Java8/source/hadoop-mapreduce-project/hadoop-mapreduce-client/hadoop-mapreduce-client-nativetask/target/native/test/nttest returned ERROR CODE 127 -> [Help 2]
[ERROR] Failed to execute goal org.apache.maven.plugins:maven-assembly-plugin:2.4:single (package-mapreduce) on project hadoop-mapreduce: Failed to create assembly: Error adding file 'org.apache.hadoop:hadoop-mapreduce-client-jobclient:jar:3.0.0-alpha1-SNAPSHOT' to archive: /home/jenkins/jenkins-slave/workspace/Hadoop-Mapreduce-trunk-Java8/source/hadoop-mapreduce-project/hadoop-mapreduce-client/hadoop-mapreduce-client-jobclient/target/classes isn't a file. -> [Help 2]
[ERROR]
[ERROR] To see the full stack trace of the errors, re-run Maven with the -e switch.
[ERROR] Re-run Maven using the -X switch to enable full debug logging.
[ERROR]
[ERROR] For more information about the errors and possible solutions, please read the following articles:
[ERROR] [Help 1] http://cwiki.apache.org/confluence/display/MAVEN/MojoFailureException
[ERROR] [Help 2] http://cwiki.apache.org/confluence/display/MAVEN/MojoExecutionException
[ERROR]
[ERROR] After correcting the problems, you can resume the build with the command
[ERROR] mvn <goals> -rf :hadoop-mapreduce-client-jobclient
Build step 'Execute shell' marked build as failure
[FINDBUGS] Skipping publisher since build result is FAILURE
Archiving artifacts
Setting LATEST1_8_HOME=/home/jenkins/jenkins-slave/tools/hudson.model.JDK/latest1.8
Setting MAVEN_3_3_3_HOME=/home/jenkins/jenkins-slave/tools/hudson.tasks.Maven_MavenInstallation/maven-3.3.3
Recording test results
Setting LATEST1_8_HOME=/home/jenkins/jenkins-slave/tools/hudson.model.JDK/latest1.8
Setting MAVEN_3_3_3_HOME=/home/jenkins/jenkins-slave/tools/hudson.tasks.Maven_MavenInstallation/maven-3.3.3
Email was triggered for: Failure - Any
Sending email for trigger: Failure - Any
Setting LATEST1_8_HOME=/home/jenkins/jenkins-slave/tools/hudson.model.JDK/latest1.8
Setting MAVEN_3_3_3_HOME=/home/jenkins/jenkins-slave/tools/hudson.tasks.Maven_MavenInstallation/maven-3.3.3
Setting LATEST1_8_HOME=/home/jenkins/jenkins-slave/tools/hudson.model.JDK/latest1.8
Setting MAVEN_3_3_3_HOME=/home/jenkins/jenkins-slave/tools/hudson.tasks.Maven_MavenInstallation/maven-3.3.3
###################################################################################
############################## FAILED TESTS (if any) ##############################
3 tests failed.
FAILED: org.apache.hadoop.mapred.TestMRCJCFileOutputCommitter.testAbort
Error Message:
Output directory not empty expected:<0> but was:<4>
Stack Trace:
java.lang.AssertionError: Output directory not empty expected:<0> but was:<4>
at org.junit.Assert.fail(Assert.java:88)
at org.junit.Assert.failNotEquals(Assert.java:743)
at org.junit.Assert.assertEquals(Assert.java:118)
at org.junit.Assert.assertEquals(Assert.java:555)
at org.apache.hadoop.mapred.TestMRCJCFileOutputCommitter.testAbort(TestMRCJCFileOutputCommitter.java:153)
FAILED: org.apache.hadoop.mapred.TestMiniMRChildTask.testTaskEnv
Error Message:
The environment checker job failed.
Stack Trace:
java.lang.AssertionError: The environment checker job failed.
at org.junit.Assert.fail(Assert.java:88)
at org.junit.Assert.assertTrue(Assert.java:41)
at org.apache.hadoop.mapred.TestMiniMRChildTask.runTestTaskEnv(TestMiniMRChildTask.java:550)
at org.apache.hadoop.mapred.TestMiniMRChildTask.testTaskEnv(TestMiniMRChildTask.java:472)
FAILED: org.apache.hadoop.mapred.TestMiniMRChildTask.testTaskOldEnv
Error Message:
The environment checker job failed.
Stack Trace:
java.lang.AssertionError: The environment checker job failed.
at org.junit.Assert.fail(Assert.java:88)
at org.junit.Assert.assertTrue(Assert.java:41)
at org.apache.hadoop.mapred.TestMiniMRChildTask.runTestTaskEnv(TestMiniMRChildTask.java:550)
at org.apache.hadoop.mapred.TestMiniMRChildTask.testTaskOldEnv(TestMiniMRChildTask.java:496)
Hadoop-Mapreduce-trunk-Java8 - Build # 1483 - Still Failing
Posted by Apache Jenkins Server <je...@builds.apache.org>.
See https://builds.apache.org/job/Hadoop-Mapreduce-trunk-Java8/1483/
###################################################################################
########################## LAST 60 LINES OF THE CONSOLE ###########################
[...truncated 20583 lines...]
[WARNING] The following patterns were never triggered in this artifact exclusion filter:
o 'org.apache.hadoop:hadoop-common'
o 'org.apache.hadoop:hadoop-hdfs'
o 'jdiff:jdiff:jar'
[INFO] ------------------------------------------------------------------------
[INFO] Reactor Summary:
[INFO]
[INFO] Apache Hadoop MapReduce Client ..................... SUCCESS [ 4.915 s]
[INFO] Apache Hadoop MapReduce Core ....................... SUCCESS [02:31 min]
[INFO] Apache Hadoop MapReduce Common ..................... SUCCESS [01:02 min]
[INFO] Apache Hadoop MapReduce Shuffle .................... SUCCESS [ 15.321 s]
[INFO] Apache Hadoop MapReduce App ........................ SUCCESS [08:50 min]
[INFO] Apache Hadoop MapReduce HistoryServer .............. SUCCESS [05:57 min]
[INFO] Apache Hadoop MapReduce JobClient .................. FAILURE [ 01:50 h]
[INFO] Apache Hadoop MapReduce HistoryServer Plugins ...... SUCCESS [ 7.264 s]
[INFO] Apache Hadoop MapReduce NativeTask ................. FAILURE [07:49 min]
[INFO] Apache Hadoop MapReduce Examples ................... SKIPPED
[INFO] Apache Hadoop MapReduce ............................ FAILURE [ 1.310 s]
[INFO] ------------------------------------------------------------------------
[INFO] BUILD FAILURE
[INFO] ------------------------------------------------------------------------
[INFO] Total time: 02:16 h
[INFO] Finished at: 2016-06-01T07:32:51+00:00
[INFO] Final Memory: 104M/2121M
[INFO] ------------------------------------------------------------------------
[WARNING] The requested profile "docs" could not be activated because it does not exist.
[WARNING] The requested profile "parallel-tests" could not be activated because it does not exist.
[ERROR] Failed to execute goal org.apache.maven.plugins:maven-surefire-plugin:2.17:test (default-test) on project hadoop-mapreduce-client-jobclient: There are test failures.
[ERROR]
[ERROR] Please refer to /home/jenkins/jenkins-slave/workspace/Hadoop-Mapreduce-trunk-Java8/source/hadoop-mapreduce-project/hadoop-mapreduce-client/hadoop-mapreduce-client-jobclient/target/surefire-reports for the individual test results.
[ERROR] -> [Help 1]
[ERROR] Failed to execute goal org.apache.hadoop:hadoop-maven-plugins:3.0.0-alpha1-SNAPSHOT:cmake-test (nttest) on project hadoop-mapreduce-client-nativetask: Test /home/jenkins/jenkins-slave/workspace/Hadoop-Mapreduce-trunk-Java8/source/hadoop-mapreduce-project/hadoop-mapreduce-client/hadoop-mapreduce-client-nativetask/target/native/test/nttest returned ERROR CODE 127 -> [Help 2]
[ERROR] Failed to execute goal org.apache.maven.plugins:maven-assembly-plugin:2.4:single (package-mapreduce) on project hadoop-mapreduce: Failed to create assembly: Error adding file 'org.apache.hadoop:hadoop-mapreduce-client-jobclient:jar:3.0.0-alpha1-SNAPSHOT' to archive: /home/jenkins/jenkins-slave/workspace/Hadoop-Mapreduce-trunk-Java8/source/hadoop-mapreduce-project/hadoop-mapreduce-client/hadoop-mapreduce-client-jobclient/target/classes isn't a file. -> [Help 2]
[ERROR]
[ERROR] To see the full stack trace of the errors, re-run Maven with the -e switch.
[ERROR] Re-run Maven using the -X switch to enable full debug logging.
[ERROR]
[ERROR] For more information about the errors and possible solutions, please read the following articles:
[ERROR] [Help 1] http://cwiki.apache.org/confluence/display/MAVEN/MojoFailureException
[ERROR] [Help 2] http://cwiki.apache.org/confluence/display/MAVEN/MojoExecutionException
[ERROR]
[ERROR] After correcting the problems, you can resume the build with the command
[ERROR] mvn <goals> -rf :hadoop-mapreduce-client-jobclient
Build step 'Execute shell' marked build as failure
[FINDBUGS] Skipping publisher since build result is FAILURE
Archiving artifacts
Setting LATEST1_8_HOME=/home/jenkins/jenkins-slave/tools/hudson.model.JDK/latest1.8
Setting MAVEN_3_3_3_HOME=/home/jenkins/jenkins-slave/tools/hudson.tasks.Maven_MavenInstallation/maven-3.3.3
Recording test results
Setting LATEST1_8_HOME=/home/jenkins/jenkins-slave/tools/hudson.model.JDK/latest1.8
Setting MAVEN_3_3_3_HOME=/home/jenkins/jenkins-slave/tools/hudson.tasks.Maven_MavenInstallation/maven-3.3.3
Email was triggered for: Failure - Any
Sending email for trigger: Failure - Any
Setting LATEST1_8_HOME=/home/jenkins/jenkins-slave/tools/hudson.model.JDK/latest1.8
Setting MAVEN_3_3_3_HOME=/home/jenkins/jenkins-slave/tools/hudson.tasks.Maven_MavenInstallation/maven-3.3.3
Setting LATEST1_8_HOME=/home/jenkins/jenkins-slave/tools/hudson.model.JDK/latest1.8
Setting MAVEN_3_3_3_HOME=/home/jenkins/jenkins-slave/tools/hudson.tasks.Maven_MavenInstallation/maven-3.3.3
###################################################################################
############################## FAILED TESTS (if any) ##############################
2 tests failed.
FAILED: org.apache.hadoop.mapred.TestMiniMRChildTask.testTaskEnv
Error Message:
The environment checker job failed.
Stack Trace:
java.lang.AssertionError: The environment checker job failed.
at org.junit.Assert.fail(Assert.java:88)
at org.junit.Assert.assertTrue(Assert.java:41)
at org.apache.hadoop.mapred.TestMiniMRChildTask.runTestTaskEnv(TestMiniMRChildTask.java:550)
at org.apache.hadoop.mapred.TestMiniMRChildTask.testTaskEnv(TestMiniMRChildTask.java:472)
FAILED: org.apache.hadoop.mapred.TestMiniMRChildTask.testTaskOldEnv
Error Message:
The environment checker job failed.
Stack Trace:
java.lang.AssertionError: The environment checker job failed.
at org.junit.Assert.fail(Assert.java:88)
at org.junit.Assert.assertTrue(Assert.java:41)
at org.apache.hadoop.mapred.TestMiniMRChildTask.runTestTaskEnv(TestMiniMRChildTask.java:550)
at org.apache.hadoop.mapred.TestMiniMRChildTask.testTaskOldEnv(TestMiniMRChildTask.java:496)
Hadoop-Mapreduce-trunk-Java8 - Build # 1482 - Still Failing
Posted by Apache Jenkins Server <je...@builds.apache.org>.
See https://builds.apache.org/job/Hadoop-Mapreduce-trunk-Java8/1482/
###################################################################################
########################## LAST 60 LINES OF THE CONSOLE ###########################
[...truncated 4605 lines...]
main:
[INFO] Executed tasks
[INFO]
[INFO] --- maven-assembly-plugin:2.4:single (package-mapreduce) @ hadoop-mapreduce ---
[WARNING] The following patterns were never triggered in this artifact inclusion filter:
o 'org.apache.hadoop:hadoop-yarn-server-tests'
[INFO] ------------------------------------------------------------------------
[INFO] Reactor Summary:
[INFO]
[INFO] Apache Hadoop MapReduce Client ..................... SUCCESS [ 5.197 s]
[INFO] Apache Hadoop MapReduce Core ....................... FAILURE [01:37 min]
[INFO] Apache Hadoop MapReduce Common ..................... SKIPPED
[INFO] Apache Hadoop MapReduce Shuffle .................... SKIPPED
[INFO] Apache Hadoop MapReduce App ........................ SKIPPED
[INFO] Apache Hadoop MapReduce HistoryServer .............. SKIPPED
[INFO] Apache Hadoop MapReduce JobClient .................. SKIPPED
[INFO] Apache Hadoop MapReduce HistoryServer Plugins ...... SKIPPED
[INFO] Apache Hadoop MapReduce NativeTask ................. SKIPPED
[INFO] Apache Hadoop MapReduce Examples ................... SKIPPED
[INFO] Apache Hadoop MapReduce ............................ FAILURE [ 1.198 s]
[INFO] ------------------------------------------------------------------------
[INFO] BUILD FAILURE
[INFO] ------------------------------------------------------------------------
[INFO] Total time: 01:45 min
[INFO] Finished at: 2016-06-01T02:35:20+00:00
[INFO] Final Memory: 67M/1238M
[INFO] ------------------------------------------------------------------------
[WARNING] The requested profile "docs" could not be activated because it does not exist.
[WARNING] The requested profile "parallel-tests" could not be activated because it does not exist.
[ERROR] Failed to execute goal org.apache.maven.plugins:maven-surefire-plugin:2.17:test (default-test) on project hadoop-mapreduce-client-core: There are test failures.
[ERROR]
[ERROR] Please refer to /home/jenkins/jenkins-slave/workspace/Hadoop-Mapreduce-trunk-Java8/source/hadoop-mapreduce-project/hadoop-mapreduce-client/hadoop-mapreduce-client-core/target/surefire-reports for the individual test results.
[ERROR] -> [Help 1]
[ERROR] Failed to execute goal org.apache.maven.plugins:maven-assembly-plugin:2.4:single (package-mapreduce) on project hadoop-mapreduce: Failed to create assembly: Error adding file 'org.apache.hadoop:hadoop-mapreduce-client-core:jar:3.0.0-alpha1-SNAPSHOT' to archive: /home/jenkins/jenkins-slave/workspace/Hadoop-Mapreduce-trunk-Java8/source/hadoop-mapreduce-project/hadoop-mapreduce-client/hadoop-mapreduce-client-core/target/classes isn't a file. -> [Help 2]
[ERROR]
[ERROR] To see the full stack trace of the errors, re-run Maven with the -e switch.
[ERROR] Re-run Maven using the -X switch to enable full debug logging.
[ERROR]
[ERROR] For more information about the errors and possible solutions, please read the following articles:
[ERROR] [Help 1] http://cwiki.apache.org/confluence/display/MAVEN/MojoFailureException
[ERROR] [Help 2] http://cwiki.apache.org/confluence/display/MAVEN/MojoExecutionException
[ERROR]
[ERROR] After correcting the problems, you can resume the build with the command
[ERROR] mvn <goals> -rf :hadoop-mapreduce-client-core
Build step 'Execute shell' marked build as failure
[FINDBUGS] Skipping publisher since build result is FAILURE
Archiving artifacts
Setting LATEST1_8_HOME=/home/jenkins/jenkins-slave/tools/hudson.model.JDK/latest1.8
Setting MAVEN_3_3_3_HOME=/home/jenkins/jenkins-slave/tools/hudson.tasks.Maven_MavenInstallation/maven-3.3.3
Recording test results
Setting LATEST1_8_HOME=/home/jenkins/jenkins-slave/tools/hudson.model.JDK/latest1.8
Setting MAVEN_3_3_3_HOME=/home/jenkins/jenkins-slave/tools/hudson.tasks.Maven_MavenInstallation/maven-3.3.3
Email was triggered for: Failure - Any
Sending email for trigger: Failure - Any
Setting LATEST1_8_HOME=/home/jenkins/jenkins-slave/tools/hudson.model.JDK/latest1.8
Setting MAVEN_3_3_3_HOME=/home/jenkins/jenkins-slave/tools/hudson.tasks.Maven_MavenInstallation/maven-3.3.3
Setting LATEST1_8_HOME=/home/jenkins/jenkins-slave/tools/hudson.model.JDK/latest1.8
Setting MAVEN_3_3_3_HOME=/home/jenkins/jenkins-slave/tools/hudson.tasks.Maven_MavenInstallation/maven-3.3.3
###################################################################################
############################## FAILED TESTS (if any) ##############################
1 tests failed.
FAILED: org.apache.hadoop.mapreduce.tools.TestCLI.testGetJob
Error Message:
null
Stack Trace:
java.lang.AssertionError: null
at org.junit.Assert.fail(Assert.java:86)
at org.junit.Assert.assertTrue(Assert.java:41)
at org.junit.Assert.assertTrue(Assert.java:52)
at org.apache.hadoop.mapreduce.tools.TestCLI.testGetJob(TestCLI.java:181)
Hadoop-Mapreduce-trunk-Java8 - Build # 1481 - Still Failing
Posted by Apache Jenkins Server <je...@builds.apache.org>.
See https://builds.apache.org/job/Hadoop-Mapreduce-trunk-Java8/1481/
###################################################################################
########################## LAST 60 LINES OF THE CONSOLE ###########################
[...truncated 20588 lines...]
[WARNING] The following patterns were never triggered in this artifact exclusion filter:
o 'org.apache.hadoop:hadoop-common'
o 'org.apache.hadoop:hadoop-hdfs'
o 'jdiff:jdiff:jar'
[INFO] ------------------------------------------------------------------------
[INFO] Reactor Summary:
[INFO]
[INFO] Apache Hadoop MapReduce Client ..................... SUCCESS [ 7.872 s]
[INFO] Apache Hadoop MapReduce Core ....................... SUCCESS [02:56 min]
[INFO] Apache Hadoop MapReduce Common ..................... SUCCESS [01:08 min]
[INFO] Apache Hadoop MapReduce Shuffle .................... SUCCESS [ 17.328 s]
[INFO] Apache Hadoop MapReduce App ........................ SUCCESS [09:35 min]
[INFO] Apache Hadoop MapReduce HistoryServer .............. SUCCESS [06:35 min]
[INFO] Apache Hadoop MapReduce JobClient .................. FAILURE [ 01:45 h]
[INFO] Apache Hadoop MapReduce HistoryServer Plugins ...... SUCCESS [ 7.138 s]
[INFO] Apache Hadoop MapReduce NativeTask ................. FAILURE [07:47 min]
[INFO] Apache Hadoop MapReduce Examples ................... SKIPPED
[INFO] Apache Hadoop MapReduce ............................ FAILURE [ 1.238 s]
[INFO] ------------------------------------------------------------------------
[INFO] BUILD FAILURE
[INFO] ------------------------------------------------------------------------
[INFO] Total time: 02:13 h
[INFO] Finished at: 2016-06-01T02:30:55+00:00
[INFO] Final Memory: 113M/2626M
[INFO] ------------------------------------------------------------------------
[WARNING] The requested profile "docs" could not be activated because it does not exist.
[WARNING] The requested profile "parallel-tests" could not be activated because it does not exist.
[ERROR] Failed to execute goal org.apache.maven.plugins:maven-surefire-plugin:2.17:test (default-test) on project hadoop-mapreduce-client-jobclient: There are test failures.
[ERROR]
[ERROR] Please refer to /home/jenkins/jenkins-slave/workspace/Hadoop-Mapreduce-trunk-Java8/source/hadoop-mapreduce-project/hadoop-mapreduce-client/hadoop-mapreduce-client-jobclient/target/surefire-reports for the individual test results.
[ERROR] -> [Help 1]
[ERROR] Failed to execute goal org.apache.hadoop:hadoop-maven-plugins:3.0.0-alpha1-SNAPSHOT:cmake-test (nttest) on project hadoop-mapreduce-client-nativetask: Test /home/jenkins/jenkins-slave/workspace/Hadoop-Mapreduce-trunk-Java8/source/hadoop-mapreduce-project/hadoop-mapreduce-client/hadoop-mapreduce-client-nativetask/target/native/test/nttest returned ERROR CODE 127 -> [Help 2]
[ERROR] Failed to execute goal org.apache.maven.plugins:maven-assembly-plugin:2.4:single (package-mapreduce) on project hadoop-mapreduce: Failed to create assembly: Error adding file 'org.apache.hadoop:hadoop-mapreduce-client-jobclient:jar:3.0.0-alpha1-SNAPSHOT' to archive: /home/jenkins/jenkins-slave/workspace/Hadoop-Mapreduce-trunk-Java8/source/hadoop-mapreduce-project/hadoop-mapreduce-client/hadoop-mapreduce-client-jobclient/target/classes isn't a file. -> [Help 2]
[ERROR]
[ERROR] To see the full stack trace of the errors, re-run Maven with the -e switch.
[ERROR] Re-run Maven using the -X switch to enable full debug logging.
[ERROR]
[ERROR] For more information about the errors and possible solutions, please read the following articles:
[ERROR] [Help 1] http://cwiki.apache.org/confluence/display/MAVEN/MojoFailureException
[ERROR] [Help 2] http://cwiki.apache.org/confluence/display/MAVEN/MojoExecutionException
[ERROR]
[ERROR] After correcting the problems, you can resume the build with the command
[ERROR] mvn <goals> -rf :hadoop-mapreduce-client-jobclient
Build step 'Execute shell' marked build as failure
[FINDBUGS] Skipping publisher since build result is FAILURE
Archiving artifacts
Setting LATEST1_8_HOME=/home/jenkins/jenkins-slave/tools/hudson.model.JDK/latest1.8
Setting MAVEN_3_3_3_HOME=/home/jenkins/jenkins-slave/tools/hudson.tasks.Maven_MavenInstallation/maven-3.3.3
Recording test results
Setting LATEST1_8_HOME=/home/jenkins/jenkins-slave/tools/hudson.model.JDK/latest1.8
Setting MAVEN_3_3_3_HOME=/home/jenkins/jenkins-slave/tools/hudson.tasks.Maven_MavenInstallation/maven-3.3.3
Email was triggered for: Failure - Any
Sending email for trigger: Failure - Any
Setting LATEST1_8_HOME=/home/jenkins/jenkins-slave/tools/hudson.model.JDK/latest1.8
Setting MAVEN_3_3_3_HOME=/home/jenkins/jenkins-slave/tools/hudson.tasks.Maven_MavenInstallation/maven-3.3.3
Setting LATEST1_8_HOME=/home/jenkins/jenkins-slave/tools/hudson.model.JDK/latest1.8
Setting MAVEN_3_3_3_HOME=/home/jenkins/jenkins-slave/tools/hudson.tasks.Maven_MavenInstallation/maven-3.3.3
###################################################################################
############################## FAILED TESTS (if any) ##############################
3 tests failed.
FAILED: org.apache.hadoop.mapred.TestMRCJCFileOutputCommitter.testAbort
Error Message:
Output directory not empty expected:<0> but was:<4>
Stack Trace:
java.lang.AssertionError: Output directory not empty expected:<0> but was:<4>
at org.junit.Assert.fail(Assert.java:88)
at org.junit.Assert.failNotEquals(Assert.java:743)
at org.junit.Assert.assertEquals(Assert.java:118)
at org.junit.Assert.assertEquals(Assert.java:555)
at org.apache.hadoop.mapred.TestMRCJCFileOutputCommitter.testAbort(TestMRCJCFileOutputCommitter.java:153)
FAILED: org.apache.hadoop.mapred.TestMiniMRChildTask.testTaskEnv
Error Message:
The environment checker job failed.
Stack Trace:
java.lang.AssertionError: The environment checker job failed.
at org.junit.Assert.fail(Assert.java:88)
at org.junit.Assert.assertTrue(Assert.java:41)
at org.apache.hadoop.mapred.TestMiniMRChildTask.runTestTaskEnv(TestMiniMRChildTask.java:550)
at org.apache.hadoop.mapred.TestMiniMRChildTask.testTaskEnv(TestMiniMRChildTask.java:472)
FAILED: org.apache.hadoop.mapred.TestMiniMRChildTask.testTaskOldEnv
Error Message:
The environment checker job failed.
Stack Trace:
java.lang.AssertionError: The environment checker job failed.
at org.junit.Assert.fail(Assert.java:88)
at org.junit.Assert.assertTrue(Assert.java:41)
at org.apache.hadoop.mapred.TestMiniMRChildTask.runTestTaskEnv(TestMiniMRChildTask.java:550)
at org.apache.hadoop.mapred.TestMiniMRChildTask.testTaskOldEnv(TestMiniMRChildTask.java:496)
Hadoop-Mapreduce-trunk-Java8 - Build # 1480 - Still Failing
Posted by Apache Jenkins Server <je...@builds.apache.org>.
See https://builds.apache.org/job/Hadoop-Mapreduce-trunk-Java8/1480/
###################################################################################
########################## LAST 60 LINES OF THE CONSOLE ###########################
[...truncated 4098 lines...]
o 'org.apache.hadoop:hadoop-yarn-server-tests'
[WARNING] The following patterns were never triggered in this artifact exclusion filter:
o 'org.apache.hadoop:hadoop-common'
o 'org.apache.hadoop:hadoop-hdfs'
o 'jdiff:jdiff:jar'
[INFO] ------------------------------------------------------------------------
[INFO] Reactor Summary:
[INFO]
[INFO] Apache Hadoop MapReduce Client ..................... SUCCESS [ 5.028 s]
[INFO] Apache Hadoop MapReduce Core ....................... FAILURE [01:51 min]
[INFO] Apache Hadoop MapReduce Common ..................... SKIPPED
[INFO] Apache Hadoop MapReduce Shuffle .................... SKIPPED
[INFO] Apache Hadoop MapReduce App ........................ SKIPPED
[INFO] Apache Hadoop MapReduce HistoryServer .............. SKIPPED
[INFO] Apache Hadoop MapReduce JobClient .................. SKIPPED
[INFO] Apache Hadoop MapReduce HistoryServer Plugins ...... SKIPPED
[INFO] Apache Hadoop MapReduce NativeTask ................. SKIPPED
[INFO] Apache Hadoop MapReduce Examples ................... SKIPPED
[INFO] Apache Hadoop MapReduce ............................ FAILURE [ 1.418 s]
[INFO] ------------------------------------------------------------------------
[INFO] BUILD FAILURE
[INFO] ------------------------------------------------------------------------
[INFO] Total time: 01:59 min
[INFO] Finished at: 2016-05-31T17:18:24+00:00
[INFO] Final Memory: 78M/1366M
[INFO] ------------------------------------------------------------------------
[WARNING] The requested profile "docs" could not be activated because it does not exist.
[WARNING] The requested profile "parallel-tests" could not be activated because it does not exist.
[ERROR] Failed to execute goal org.apache.maven.plugins:maven-surefire-plugin:2.17:test (default-test) on project hadoop-mapreduce-client-core: There are test failures.
[ERROR]
[ERROR] Please refer to /home/jenkins/jenkins-slave/workspace/Hadoop-Mapreduce-trunk-Java8/source/hadoop-mapreduce-project/hadoop-mapreduce-client/hadoop-mapreduce-client-core/target/surefire-reports for the individual test results.
[ERROR] -> [Help 1]
[ERROR] Failed to execute goal org.apache.maven.plugins:maven-assembly-plugin:2.4:single (package-mapreduce) on project hadoop-mapreduce: Failed to create assembly: Error adding file 'org.apache.hadoop:hadoop-mapreduce-client-core:jar:3.0.0-alpha1-SNAPSHOT' to archive: /home/jenkins/jenkins-slave/workspace/Hadoop-Mapreduce-trunk-Java8/source/hadoop-mapreduce-project/hadoop-mapreduce-client/hadoop-mapreduce-client-core/target/classes isn't a file. -> [Help 2]
[ERROR]
[ERROR] To see the full stack trace of the errors, re-run Maven with the -e switch.
[ERROR] Re-run Maven using the -X switch to enable full debug logging.
[ERROR]
[ERROR] For more information about the errors and possible solutions, please read the following articles:
[ERROR] [Help 1] http://cwiki.apache.org/confluence/display/MAVEN/MojoFailureException
[ERROR] [Help 2] http://cwiki.apache.org/confluence/display/MAVEN/MojoExecutionException
[ERROR]
[ERROR] After correcting the problems, you can resume the build with the command
[ERROR] mvn <goals> -rf :hadoop-mapreduce-client-core
Build step 'Execute shell' marked build as failure
[FINDBUGS] Skipping publisher since build result is FAILURE
Archiving artifacts
Setting LATEST1_8_HOME=/home/jenkins/jenkins-slave/tools/hudson.model.JDK/latest1.8
Setting MAVEN_3_3_3_HOME=/home/jenkins/jenkins-slave/tools/hudson.tasks.Maven_MavenInstallation/maven-3.3.3
Recording test results
Setting LATEST1_8_HOME=/home/jenkins/jenkins-slave/tools/hudson.model.JDK/latest1.8
Setting MAVEN_3_3_3_HOME=/home/jenkins/jenkins-slave/tools/hudson.tasks.Maven_MavenInstallation/maven-3.3.3
Email was triggered for: Failure - Any
Sending email for trigger: Failure - Any
Setting LATEST1_8_HOME=/home/jenkins/jenkins-slave/tools/hudson.model.JDK/latest1.8
Setting MAVEN_3_3_3_HOME=/home/jenkins/jenkins-slave/tools/hudson.tasks.Maven_MavenInstallation/maven-3.3.3
Setting LATEST1_8_HOME=/home/jenkins/jenkins-slave/tools/hudson.model.JDK/latest1.8
Setting MAVEN_3_3_3_HOME=/home/jenkins/jenkins-slave/tools/hudson.tasks.Maven_MavenInstallation/maven-3.3.3
###################################################################################
############################## FAILED TESTS (if any) ##############################
1 tests failed.
FAILED: org.apache.hadoop.mapreduce.tools.TestCLI.testGetJob
Error Message:
null
Stack Trace:
java.lang.AssertionError: null
at org.junit.Assert.fail(Assert.java:86)
at org.junit.Assert.assertTrue(Assert.java:41)
at org.junit.Assert.assertTrue(Assert.java:52)
at org.apache.hadoop.mapreduce.tools.TestCLI.testGetJob(TestCLI.java:181)
Hadoop-Mapreduce-trunk-Java8 - Build # 1479 - Still Failing
Posted by Apache Jenkins Server <je...@builds.apache.org>.
See https://builds.apache.org/job/Hadoop-Mapreduce-trunk-Java8/1479/
###################################################################################
########################## LAST 60 LINES OF THE CONSOLE ###########################
[...truncated 20591 lines...]
[WARNING] The following patterns were never triggered in this artifact exclusion filter:
o 'org.apache.hadoop:hadoop-common'
o 'org.apache.hadoop:hadoop-hdfs'
o 'jdiff:jdiff:jar'
[INFO] ------------------------------------------------------------------------
[INFO] Reactor Summary:
[INFO]
[INFO] Apache Hadoop MapReduce Client ..................... SUCCESS [ 4.349 s]
[INFO] Apache Hadoop MapReduce Core ....................... SUCCESS [02:29 min]
[INFO] Apache Hadoop MapReduce Common ..................... SUCCESS [01:02 min]
[INFO] Apache Hadoop MapReduce Shuffle .................... SUCCESS [ 15.557 s]
[INFO] Apache Hadoop MapReduce App ........................ SUCCESS [08:45 min]
[INFO] Apache Hadoop MapReduce HistoryServer .............. SUCCESS [05:58 min]
[INFO] Apache Hadoop MapReduce JobClient .................. FAILURE [ 01:48 h]
[INFO] Apache Hadoop MapReduce HistoryServer Plugins ...... SUCCESS [ 6.882 s]
[INFO] Apache Hadoop MapReduce NativeTask ................. FAILURE [07:43 min]
[INFO] Apache Hadoop MapReduce Examples ................... SKIPPED
[INFO] Apache Hadoop MapReduce ............................ FAILURE [ 1.131 s]
[INFO] ------------------------------------------------------------------------
[INFO] BUILD FAILURE
[INFO] ------------------------------------------------------------------------
[INFO] Total time: 02:14 h
[INFO] Finished at: 2016-05-31T03:30:45+00:00
[INFO] Final Memory: 108M/2576M
[INFO] ------------------------------------------------------------------------
[WARNING] The requested profile "docs" could not be activated because it does not exist.
[WARNING] The requested profile "parallel-tests" could not be activated because it does not exist.
[ERROR] Failed to execute goal org.apache.maven.plugins:maven-surefire-plugin:2.17:test (default-test) on project hadoop-mapreduce-client-jobclient: There are test failures.
[ERROR]
[ERROR] Please refer to /home/jenkins/jenkins-slave/workspace/Hadoop-Mapreduce-trunk-Java8/source/hadoop-mapreduce-project/hadoop-mapreduce-client/hadoop-mapreduce-client-jobclient/target/surefire-reports for the individual test results.
[ERROR] -> [Help 1]
[ERROR] Failed to execute goal org.apache.hadoop:hadoop-maven-plugins:3.0.0-alpha1-SNAPSHOT:cmake-test (nttest) on project hadoop-mapreduce-client-nativetask: Test /home/jenkins/jenkins-slave/workspace/Hadoop-Mapreduce-trunk-Java8/source/hadoop-mapreduce-project/hadoop-mapreduce-client/hadoop-mapreduce-client-nativetask/target/native/test/nttest returned ERROR CODE 127 -> [Help 2]
[ERROR] Failed to execute goal org.apache.maven.plugins:maven-assembly-plugin:2.4:single (package-mapreduce) on project hadoop-mapreduce: Failed to create assembly: Error adding file 'org.apache.hadoop:hadoop-mapreduce-client-jobclient:jar:3.0.0-alpha1-SNAPSHOT' to archive: /home/jenkins/jenkins-slave/workspace/Hadoop-Mapreduce-trunk-Java8/source/hadoop-mapreduce-project/hadoop-mapreduce-client/hadoop-mapreduce-client-jobclient/target/classes isn't a file. -> [Help 2]
[ERROR]
[ERROR] To see the full stack trace of the errors, re-run Maven with the -e switch.
[ERROR] Re-run Maven using the -X switch to enable full debug logging.
[ERROR]
[ERROR] For more information about the errors and possible solutions, please read the following articles:
[ERROR] [Help 1] http://cwiki.apache.org/confluence/display/MAVEN/MojoFailureException
[ERROR] [Help 2] http://cwiki.apache.org/confluence/display/MAVEN/MojoExecutionException
[ERROR]
[ERROR] After correcting the problems, you can resume the build with the command
[ERROR] mvn <goals> -rf :hadoop-mapreduce-client-jobclient
Build step 'Execute shell' marked build as failure
[FINDBUGS] Skipping publisher since build result is FAILURE
Archiving artifacts
Setting LATEST1_8_HOME=/home/jenkins/jenkins-slave/tools/hudson.model.JDK/latest1.8
Setting MAVEN_3_3_3_HOME=/home/jenkins/jenkins-slave/tools/hudson.tasks.Maven_MavenInstallation/maven-3.3.3
Recording test results
Setting LATEST1_8_HOME=/home/jenkins/jenkins-slave/tools/hudson.model.JDK/latest1.8
Setting MAVEN_3_3_3_HOME=/home/jenkins/jenkins-slave/tools/hudson.tasks.Maven_MavenInstallation/maven-3.3.3
Email was triggered for: Failure - Any
Sending email for trigger: Failure - Any
Setting LATEST1_8_HOME=/home/jenkins/jenkins-slave/tools/hudson.model.JDK/latest1.8
Setting MAVEN_3_3_3_HOME=/home/jenkins/jenkins-slave/tools/hudson.tasks.Maven_MavenInstallation/maven-3.3.3
Setting LATEST1_8_HOME=/home/jenkins/jenkins-slave/tools/hudson.model.JDK/latest1.8
Setting MAVEN_3_3_3_HOME=/home/jenkins/jenkins-slave/tools/hudson.tasks.Maven_MavenInstallation/maven-3.3.3
###################################################################################
############################## FAILED TESTS (if any) ##############################
3 tests failed.
FAILED: org.apache.hadoop.mapred.TestMRCJCFileOutputCommitter.testAbort
Error Message:
Output directory not empty expected:<0> but was:<4>
Stack Trace:
java.lang.AssertionError: Output directory not empty expected:<0> but was:<4>
at org.junit.Assert.fail(Assert.java:88)
at org.junit.Assert.failNotEquals(Assert.java:743)
at org.junit.Assert.assertEquals(Assert.java:118)
at org.junit.Assert.assertEquals(Assert.java:555)
at org.apache.hadoop.mapred.TestMRCJCFileOutputCommitter.testAbort(TestMRCJCFileOutputCommitter.java:153)
FAILED: org.apache.hadoop.mapred.TestMiniMRChildTask.testTaskEnv
Error Message:
The environment checker job failed.
Stack Trace:
java.lang.AssertionError: The environment checker job failed.
at org.junit.Assert.fail(Assert.java:88)
at org.junit.Assert.assertTrue(Assert.java:41)
at org.apache.hadoop.mapred.TestMiniMRChildTask.runTestTaskEnv(TestMiniMRChildTask.java:550)
at org.apache.hadoop.mapred.TestMiniMRChildTask.testTaskEnv(TestMiniMRChildTask.java:472)
FAILED: org.apache.hadoop.mapred.TestMiniMRChildTask.testTaskOldEnv
Error Message:
The environment checker job failed.
Stack Trace:
java.lang.AssertionError: The environment checker job failed.
at org.junit.Assert.fail(Assert.java:88)
at org.junit.Assert.assertTrue(Assert.java:41)
at org.apache.hadoop.mapred.TestMiniMRChildTask.runTestTaskEnv(TestMiniMRChildTask.java:550)
at org.apache.hadoop.mapred.TestMiniMRChildTask.testTaskOldEnv(TestMiniMRChildTask.java:496)