You are viewing a plain text version of this content. The canonical link for it is here.
Posted to dev@uima.apache.org by Apache Jenkins Server <je...@builds.apache.org> on 2017/06/15 10:56:41 UTC
Build failed in Jenkins: UIMA-uimaFIT » Apache UIMA uimaFIT #294
See <https://builds.apache.org/job/UIMA-uimaFIT/org.apache.uima$uimafit/294/display/redirect>
------------------------------------------
[...truncated 9.50 KB...]
[INFO] --- maven-enforcer-plugin:1.3.1:enforce (enforce-versions) @ uimafit ---
[TASKS] Skipping reporter since build result is FAILURE[INFO]
[INFO] --- build-helper-maven-plugin:1.8:parse-version (parse-project-version) @ uimafit ---
[TASKS] Skipping reporter since build result is FAILURE[INFO]
[INFO] --- uima-build-helper-maven-plugin:7:parse-date-time (set buildYear and buildMonth) @ uimafit ---
[TASKS] Skipping reporter since build result is FAILURE[INFO]
[INFO] --- gmaven-plugin:1.5:execute (read-notice) @ uimafit ---
[TASKS] Skipping reporter since build result is FAILURE
[WARNING] Failed to getClass for org.apache.maven.plugin.javadoc.JavadocReport
[TASKS] Skipping reporter since build result is FAILURE[INFO]
[INFO] <<< maven-javadoc-plugin:2.10.3:javadoc (javadocs-distr) < generate-sources @ uimafit <<<
[INFO]
[INFO]
[INFO] --- maven-javadoc-plugin:2.10.3:javadoc (javadocs-distr) @ uimafit ---
[TASKS] Skipping reporter since build result is FAILURE
[JENKINS] Archiving javadoc
[INFO]
[INFO] --- maven-site-plugin:3.3:attach-descriptor (attach-descriptor) @ uimafit ---
[TASKS] Skipping reporter since build result is FAILURE[INFO]
[INFO] --- findbugs-maven-plugin:3.0.3:findbugs (default) @ uimafit ---
[FINDBUGS] Skipping reporter since build result is FAILURE
[TASKS] Skipping reporter since build result is FAILURE[INFO]
[INFO] --- maven-pmd-plugin:3.1:cpd (default) @ uimafit ---
[DRY] Skipping reporter since build result is FAILURE
[TASKS] Skipping reporter since build result is FAILURE[INFO]
[INFO] --- maven-pmd-plugin:3.1:pmd (default) @ uimafit ---
[PMD] Skipping reporter since build result is FAILURE
[TASKS] Skipping reporter since build result is FAILURE[INFO]
[INFO] --- maven-assembly-plugin:2.4:single (uima-distr) @ uimafit ---
[INFO] Reading assembly descriptor: src/main/assembly/bin.xml
[INFO] Building tar: <https://builds.apache.org/job/UIMA-uimaFIT/org.apache.uima$uimafit/ws/target/uimafit-2.4.0-SNAPSHOT-bin.tar.gz>
[INFO] Building zip: <https://builds.apache.org/job/UIMA-uimaFIT/org.apache.uima$uimafit/ws/target/uimafit-2.4.0-SNAPSHOT-bin.zip>
[TASKS] Skipping reporter since build result is FAILURE
[INFO]
[INFO] --- maven-antrun-plugin:1.7:run (generate checksums for binary artifacts) @ uimafit ---
[INFO] Executing tasks
main:
[INFO] Executed tasks
[TASKS] Skipping reporter since build result is FAILURE[INFO]
[INFO] --- maven-install-plugin:2.5.1:install (default-install) @ uimafit ---
[INFO] Installing <https://builds.apache.org/job/UIMA-uimaFIT/org.apache.uima$uimafit/ws/pom.xml> to /home/jenkins/jenkins-slave/maven-repositories/1/org/apache/uima/uimafit/2.4.0-SNAPSHOT/uimafit-2.4.0-SNAPSHOT.pom
[INFO] Installing <https://builds.apache.org/job/UIMA-uimaFIT/org.apache.uima$uimafit/ws/target/uimafit-2.4.0-SNAPSHOT-bin.tar.gz> to /home/jenkins/jenkins-slave/maven-repositories/1/org/apache/uima/uimafit/2.4.0-SNAPSHOT/uimafit-2.4.0-SNAPSHOT-bin.tar.gz
[INFO] Installing <https://builds.apache.org/job/UIMA-uimaFIT/org.apache.uima$uimafit/ws/target/uimafit-2.4.0-SNAPSHOT-bin.zip> to /home/jenkins/jenkins-slave/maven-repositories/1/org/apache/uima/uimafit/2.4.0-SNAPSHOT/uimafit-2.4.0-SNAPSHOT-bin.zip
[TASKS] Skipping reporter since build result is FAILURE[INFO]
[INFO] >>> maven-dependency-plugin:2.8:analyze (default-cli) > test-compile @ uimafit >>>
[INFO]
[INFO] --- maven-enforcer-plugin:1.3.1:enforce (enforce-versions) @ uimafit ---
[TASKS] Skipping reporter since build result is FAILURE[INFO]
[INFO] --- build-helper-maven-plugin:1.8:parse-version (parse-project-version) @ uimafit ---
[TASKS] Skipping reporter since build result is FAILURE[INFO]
[INFO] --- uima-build-helper-maven-plugin:7:parse-date-time (set buildYear and buildMonth) @ uimafit ---
[TASKS] Skipping reporter since build result is FAILURE[INFO]
[INFO] --- gmaven-plugin:1.5:execute (read-notice) @ uimafit ---
[TASKS] Skipping reporter since build result is FAILURE[INFO]
[INFO] --- maven-remote-resources-plugin:1.5:process (default) @ uimafit ---
[TASKS] Skipping reporter since build result is FAILURE[WARNING] Failed to getClass for org.apache.maven.plugin.dependency.analyze.AnalyzeMojo
[TASKS] Skipping reporter since build result is FAILURE[INFO]
[INFO] <<< maven-dependency-plugin:2.8:analyze (default-cli) < test-compile @ uimafit <<<
[INFO]
[INFO]
[INFO] --- maven-dependency-plugin:2.8:analyze (default-cli) @ uimafit ---
[INFO] Skipping pom project
[TASKS] Skipping reporter since build result is FAILURE
[INFO]
[INFO] ------------------------------------------------------------------------
[INFO] Building Apache UIMA uimaFIT 2.4.0-SNAPSHOT
[INFO] ------------------------------------------------------------------------
[INFO]
[INFO] >>> maven-javadoc-plugin:2.10.3:aggregate (default-cli) > generate-sources @ uimafit >>>
[INFO]
[INFO] >>>>>>>>>>>>>>>>>>>>>>>>>>>>>>>>>>>>>>>>>>>>>>>>>>>>>>>>>>>>>>>>>>>>>>>>
[INFO] Forking Apache UIMA uimaFIT - Parent 2.4.0-SNAPSHOT
[INFO] >>>>>>>>>>>>>>>>>>>>>>>>>>>>>>>>>>>>>>>>>>>>>>>>>>>>>>>>>>>>>>>>>>>>>>>>
[INFO]
[INFO] --- maven-enforcer-plugin:1.3.1:enforce (enforce-versions) @ uimafit-parent ---
[TASKS] Skipping reporter since build result is FAILURE[INFO]
[INFO] --- build-helper-maven-plugin:1.8:parse-version (parse-project-version) @ uimafit-parent ---
[TASKS] Skipping reporter since build result is FAILURE[INFO]
[INFO] --- uima-build-helper-maven-plugin:7:parse-date-time (set buildYear and buildMonth) @ uimafit-parent ---
[TASKS] Skipping reporter since build result is FAILURE[INFO]
[INFO] --- gmaven-plugin:1.5:execute (read-notice) @ uimafit-parent ---
[TASKS] Skipping reporter since build result is FAILURE[INFO]
[INFO] >>>>>>>>>>>>>>>>>>>>>>>>>>>>>>>>>>>>>>>>>>>>>>>>>>>>>>>>>>>>>>>>>>>>>>>>
[INFO] Forking Apache UIMA uimaFIT - Core 2.4.0-SNAPSHOT
[INFO] >>>>>>>>>>>>>>>>>>>>>>>>>>>>>>>>>>>>>>>>>>>>>>>>>>>>>>>>>>>>>>>>>>>>>>>>
[INFO]
[INFO] --- maven-enforcer-plugin:1.3.1:enforce (enforce-versions) @ uimafit-core ---
[TASKS] Skipping reporter since build result is FAILURE[INFO]
[INFO] --- build-helper-maven-plugin:1.8:parse-version (parse-project-version) @ uimafit-core ---
[TASKS] Skipping reporter since build result is FAILURE[INFO]
[INFO] --- uima-build-helper-maven-plugin:7:parse-date-time (set buildYear and buildMonth) @ uimafit-core ---
[TASKS] Skipping reporter since build result is FAILURE[INFO]
[INFO] --- gmaven-plugin:1.5:execute (read-notice) @ uimafit-core ---
[TASKS] Skipping reporter since build result is FAILURE[INFO]
[INFO] >>>>>>>>>>>>>>>>>>>>>>>>>>>>>>>>>>>>>>>>>>>>>>>>>>>>>>>>>>>>>>>>>>>>>>>>
[INFO] Forking Apache UIMA uimaFIT - Examples 2.4.0-SNAPSHOT
[INFO] >>>>>>>>>>>>>>>>>>>>>>>>>>>>>>>>>>>>>>>>>>>>>>>>>>>>>>>>>>>>>>>>>>>>>>>>
[INFO]
[INFO] --- maven-enforcer-plugin:1.3.1:enforce (enforce-versions) @ uimafit-examples ---
[TASKS] Skipping reporter since build result is FAILURE[INFO]
[INFO] --- build-helper-maven-plugin:1.8:parse-version (parse-project-version) @ uimafit-examples ---
[TASKS] Skipping reporter since build result is FAILURE[INFO]
[INFO] --- uima-build-helper-maven-plugin:7:parse-date-time (set buildYear and buildMonth) @ uimafit-examples ---
[TASKS] Skipping reporter since build result is FAILURE[INFO]
[INFO] --- gmaven-plugin:1.5:execute (read-notice) @ uimafit-examples ---
[TASKS] Skipping reporter since build result is FAILURE[INFO]
[INFO] >>>>>>>>>>>>>>>>>>>>>>>>>>>>>>>>>>>>>>>>>>>>>>>>>>>>>>>>>>>>>>>>>>>>>>>>
[INFO] Forking Apache UIMA uimaFIT - Spring integration 2.4.0-SNAPSHOT
[INFO] >>>>>>>>>>>>>>>>>>>>>>>>>>>>>>>>>>>>>>>>>>>>>>>>>>>>>>>>>>>>>>>>>>>>>>>>
[INFO]
[INFO] --- maven-enforcer-plugin:1.3.1:enforce (enforce-versions) @ uimafit-spring ---
[TASKS] Skipping reporter since build result is FAILURE[INFO]
[INFO] --- build-helper-maven-plugin:1.8:parse-version (parse-project-version) @ uimafit-spring ---
[TASKS] Skipping reporter since build result is FAILURE[INFO]
[INFO] --- uima-build-helper-maven-plugin:7:parse-date-time (set buildYear and buildMonth) @ uimafit-spring ---
[TASKS] Skipping reporter since build result is FAILURE[INFO]
[INFO] --- gmaven-plugin:1.5:execute (read-notice) @ uimafit-spring ---
[TASKS] Skipping reporter since build result is FAILURE[INFO]
[INFO] >>>>>>>>>>>>>>>>>>>>>>>>>>>>>>>>>>>>>>>>>>>>>>>>>>>>>>>>>>>>>>>>>>>>>>>>
[INFO] Forking Apache UIMA uimaFIT - Maven Plugin 2.4.0-SNAPSHOT
[INFO] >>>>>>>>>>>>>>>>>>>>>>>>>>>>>>>>>>>>>>>>>>>>>>>>>>>>>>>>>>>>>>>>>>>>>>>>
[INFO]
[INFO] --- maven-enforcer-plugin:1.3.1:enforce (enforce-versions) @ uimafit-maven-plugin ---
[TASKS] Skipping reporter since build result is FAILURE[INFO]
[INFO] --- build-helper-maven-plugin:1.8:parse-version (parse-project-version) @ uimafit-maven-plugin ---
[TASKS] Skipping reporter since build result is FAILURE[INFO]
[INFO] --- uima-build-helper-maven-plugin:7:parse-date-time (set buildYear and buildMonth) @ uimafit-maven-plugin ---
[TASKS] Skipping reporter since build result is FAILURE[INFO]
[INFO] --- gmaven-plugin:1.5:execute (read-notice) @ uimafit-maven-plugin ---
[TASKS] Skipping reporter since build result is FAILURE[INFO]
[INFO] --- maven-plugin-plugin:3.3:helpmojo (generate-helpmojo) @ uimafit-maven-plugin ---
[INFO] Using 'UTF-8' encoding to read mojo metadata.
[INFO] Applying mojo extractor for language: java-annotations
[WARNING] Deprecated @component for project field in org.apache.uima.fit.maven.GenerateDescriptorsMojo.: replace with @parameter name="${project}" @readonly
[WARNING] Deprecated @component for project field in org.apache.uima.fit.maven.EnhanceMojo.: replace with @parameter name="${project}" @readonly
[INFO] Mojo extractor for language: java-annotations found 3 mojo descriptors.
[TASKS] Skipping reporter since build result is FAILURE[INFO]
[INFO] >>>>>>>>>>>>>>>>>>>>>>>>>>>>>>>>>>>>>>>>>>>>>>>>>>>>>>>>>>>>>>>>>>>>>>>>
[INFO] Forking Apache UIMA uimaFIT - Legacy uimaFIT support 2.4.0-SNAPSHOT
[INFO] >>>>>>>>>>>>>>>>>>>>>>>>>>>>>>>>>>>>>>>>>>>>>>>>>>>>>>>>>>>>>>>>>>>>>>>>
[INFO]
[INFO] --- maven-enforcer-plugin:1.3.1:enforce (enforce-versions) @ uimafit-legacy-support ---
[TASKS] Skipping reporter since build result is FAILURE[INFO]
[INFO] --- build-helper-maven-plugin:1.8:parse-version (parse-project-version) @ uimafit-legacy-support ---
[TASKS] Skipping reporter since build result is FAILURE[INFO]
[INFO] --- uima-build-helper-maven-plugin:7:parse-date-time (set buildYear and buildMonth) @ uimafit-legacy-support ---
[TASKS] Skipping reporter since build result is FAILURE[INFO]
[INFO] --- gmaven-plugin:1.5:execute (read-notice) @ uimafit-legacy-support ---
[TASKS] Skipping reporter since build result is FAILURE[INFO]
[INFO] >>>>>>>>>>>>>>>>>>>>>>>>>>>>>>>>>>>>>>>>>>>>>>>>>>>>>>>>>>>>>>>>>>>>>>>>
[INFO] Forking Apache UIMA uimaFIT - Documentation 2.4.0-SNAPSHOT
[INFO] >>>>>>>>>>>>>>>>>>>>>>>>>>>>>>>>>>>>>>>>>>>>>>>>>>>>>>>>>>>>>>>>>>>>>>>>
[INFO]
[INFO] --- maven-enforcer-plugin:1.3.1:enforce (enforce-versions) @ uimafit-docbook ---
[TASKS] Skipping reporter since build result is FAILURE[INFO]
[INFO] --- build-helper-maven-plugin:1.8:parse-version (parse-project-version) @ uimafit-docbook ---
[TASKS] Skipping reporter since build result is FAILURE[INFO]
[INFO] --- uima-build-helper-maven-plugin:7:parse-date-time (set buildYear and buildMonth) @ uimafit-docbook ---
[TASKS] Skipping reporter since build result is FAILURE[INFO]
[INFO] --- gmaven-plugin:1.5:execute (read-notice) @ uimafit-docbook ---
[TASKS] Skipping reporter since build result is FAILURE[INFO]
[INFO] >>>>>>>>>>>>>>>>>>>>>>>>>>>>>>>>>>>>>>>>>>>>>>>>>>>>>>>>>>>>>>>>>>>>>>>>
[INFO] Forking Apache UIMA uimaFIT - Collection Processing Engine support 2.4.0-SNAPSHOT
[INFO] >>>>>>>>>>>>>>>>>>>>>>>>>>>>>>>>>>>>>>>>>>>>>>>>>>>>>>>>>>>>>>>>>>>>>>>>
[INFO]
[INFO] --- maven-enforcer-plugin:1.3.1:enforce (enforce-versions) @ uimafit-cpe ---
[TASKS] Skipping reporter since build result is FAILURE[INFO]
[INFO] --- build-helper-maven-plugin:1.8:parse-version (parse-project-version) @ uimafit-cpe ---
[TASKS] Skipping reporter since build result is FAILURE[INFO]
[INFO] --- uima-build-helper-maven-plugin:7:parse-date-time (set buildYear and buildMonth) @ uimafit-cpe ---
[TASKS] Skipping reporter since build result is FAILURE[INFO]
[INFO] --- gmaven-plugin:1.5:execute (read-notice) @ uimafit-cpe ---
[TASKS] Skipping reporter since build result is FAILURE
[INFO]
[INFO] >>>>>>>>>>>>>>>>>>>>>>>>>>>>>>>>>>>>>>>>>>>>>>>>>>>>>>>>>>>>>>>>>>>>>>>>
[INFO] Forking Apache UIMA uimaFIT 2.4.0-SNAPSHOT
[INFO] >>>>>>>>>>>>>>>>>>>>>>>>>>>>>>>>>>>>>>>>>>>>>>>>>>>>>>>>>>>>>>>>>>>>>>>>
[INFO]
[INFO] --- maven-enforcer-plugin:1.3.1:enforce (enforce-versions) @ uimafit ---
[TASKS] Skipping reporter since build result is FAILURE[INFO]
[INFO] --- build-helper-maven-plugin:1.8:parse-version (parse-project-version) @ uimafit ---
[TASKS] Skipping reporter since build result is FAILURE[INFO]
[INFO] --- uima-build-helper-maven-plugin:7:parse-date-time (set buildYear and buildMonth) @ uimafit ---
[TASKS] Skipping reporter since build result is FAILURE[INFO]
[INFO] --- gmaven-plugin:1.5:execute (read-notice) @ uimafit ---
[TASKS] Skipping reporter since build result is FAILURE[WARNING] Failed to getClass for org.apache.maven.plugin.javadoc.AggregatorJavadocReport
[TASKS] Skipping reporter since build result is FAILURE
[JENKINS] Archiving aggregated javadoc
[INFO]
[INFO] <<< maven-javadoc-plugin:2.10.3:aggregate (default-cli) < generate-sources @ uimafit <<<
[INFO]
[INFO]
[INFO] --- maven-javadoc-plugin:2.10.3:aggregate (default-cli) @ uimafit ---
[TASKS] Skipping reporter since build result is FAILURE
[JENKINS] Archiving aggregated javadoc
Jenkins build is back to normal : UIMA-uimaFIT » Apache UIMA uimaFIT #295
Posted by Apache Jenkins Server <je...@builds.apache.org>.
See <https://builds.apache.org/job/UIMA-uimaFIT/org.apache.uima$uimafit/295/display/redirect>