You are viewing a plain text version of this content. The canonical link for it is here.
Posted to dev@lucene.apache.org by Policeman Jenkins Server <je...@thetaphi.de> on 2017/02/27 13:28:06 UTC

[JENKINS] Lucene-Solr-6.x-MacOSX (64bit/jdk1.8.0) - Build # 724 - Still Unstable!

Build: https://jenkins.thetaphi.de/job/Lucene-Solr-6.x-MacOSX/724/
Java: 64bit/jdk1.8.0 -XX:+UseCompressedOops -XX:+UseParallelGC

2 tests failed.
FAILED:  org.apache.solr.cloud.TestCloudPivotFacet.test

Error Message:
pivot_z_s1,pivot_d1,pivot_tdt: count query failed: {main(rows=0&q=*:*&stats=true&stats.field={!key%3Dsk1+tag%3Dst1,st2}pivot_d&stats.field={!key%3Dsk2+tag%3Dst2,st3}pivot_tdt&stats.field={!key%3Dsk3+tag%3Dst3,st4}pivot_f&_test_distrib_min=true),extra(fq={!term+f%3Dpivot_z_s1}u)}: No live SolrServers available to handle this request:[http://127.0.0.1:49518/wbs/collection1, http://127.0.0.1:49501/wbs/collection1]

Stack Trace:
java.lang.RuntimeException: pivot_z_s1,pivot_d1,pivot_tdt: count query failed: {main(rows=0&q=*:*&stats=true&stats.field={!key%3Dsk1+tag%3Dst1,st2}pivot_d&stats.field={!key%3Dsk2+tag%3Dst2,st3}pivot_tdt&stats.field={!key%3Dsk3+tag%3Dst3,st4}pivot_f&_test_distrib_min=true),extra(fq={!term+f%3Dpivot_z_s1}u)}: No live SolrServers available to handle this request:[http://127.0.0.1:49518/wbs/collection1, http://127.0.0.1:49501/wbs/collection1]
	at __randomizedtesting.SeedInfo.seed([4EFC9AB8E5863CC0:C6A8A5624B7A5138]:0)
	at org.apache.solr.cloud.TestCloudPivotFacet.assertPivotCountsAreCorrect(TestCloudPivotFacet.java:322)
	at org.apache.solr.cloud.TestCloudPivotFacet.assertPivotCountsAreCorrect(TestCloudPivotFacet.java:287)
	at org.apache.solr.cloud.TestCloudPivotFacet.test(TestCloudPivotFacet.java:244)
	at sun.reflect.NativeMethodAccessorImpl.invoke0(Native Method)
	at sun.reflect.NativeMethodAccessorImpl.invoke(NativeMethodAccessorImpl.java:62)
	at sun.reflect.DelegatingMethodAccessorImpl.invoke(DelegatingMethodAccessorImpl.java:43)
	at java.lang.reflect.Method.invoke(Method.java:498)
	at com.carrotsearch.randomizedtesting.RandomizedRunner.invoke(RandomizedRunner.java:1713)
	at com.carrotsearch.randomizedtesting.RandomizedRunner$8.evaluate(RandomizedRunner.java:907)
	at com.carrotsearch.randomizedtesting.RandomizedRunner$9.evaluate(RandomizedRunner.java:943)
	at com.carrotsearch.randomizedtesting.RandomizedRunner$10.evaluate(RandomizedRunner.java:957)
	at org.apache.solr.BaseDistributedSearchTestCase$ShardsRepeatRule$ShardsFixedStatement.callStatement(BaseDistributedSearchTestCase.java:992)
	at org.apache.solr.BaseDistributedSearchTestCase$ShardsRepeatRule$ShardsStatement.evaluate(BaseDistributedSearchTestCase.java:967)
	at com.carrotsearch.randomizedtesting.rules.SystemPropertiesRestoreRule$1.evaluate(SystemPropertiesRestoreRule.java:57)
	at org.apache.lucene.util.TestRuleSetupTeardownChained$1.evaluate(TestRuleSetupTeardownChained.java:49)
	at org.apache.lucene.util.AbstractBeforeAfterRule$1.evaluate(AbstractBeforeAfterRule.java:45)
	at org.apache.lucene.util.TestRuleThreadAndTestName$1.evaluate(TestRuleThreadAndTestName.java:48)
	at org.apache.lucene.util.TestRuleIgnoreAfterMaxFailures$1.evaluate(TestRuleIgnoreAfterMaxFailures.java:64)
	at org.apache.lucene.util.TestRuleMarkFailure$1.evaluate(TestRuleMarkFailure.java:47)
	at com.carrotsearch.randomizedtesting.rules.StatementAdapter.evaluate(StatementAdapter.java:36)
	at com.carrotsearch.randomizedtesting.ThreadLeakControl$StatementRunner.run(ThreadLeakControl.java:368)
	at com.carrotsearch.randomizedtesting.ThreadLeakControl.forkTimeoutingTask(ThreadLeakControl.java:817)
	at com.carrotsearch.randomizedtesting.ThreadLeakControl$3.evaluate(ThreadLeakControl.java:468)
	at com.carrotsearch.randomizedtesting.RandomizedRunner.runSingleTest(RandomizedRunner.java:916)
	at com.carrotsearch.randomizedtesting.RandomizedRunner$5.evaluate(RandomizedRunner.java:802)
	at com.carrotsearch.randomizedtesting.RandomizedRunner$6.evaluate(RandomizedRunner.java:852)
	at com.carrotsearch.randomizedtesting.RandomizedRunner$7.evaluate(RandomizedRunner.java:863)
	at com.carrotsearch.randomizedtesting.rules.StatementAdapter.evaluate(StatementAdapter.java:36)
	at com.carrotsearch.randomizedtesting.rules.SystemPropertiesRestoreRule$1.evaluate(SystemPropertiesRestoreRule.java:57)
	at org.apache.lucene.util.AbstractBeforeAfterRule$1.evaluate(AbstractBeforeAfterRule.java:45)
	at com.carrotsearch.randomizedtesting.rules.StatementAdapter.evaluate(StatementAdapter.java:36)
	at org.apache.lucene.util.TestRuleStoreClassName$1.evaluate(TestRuleStoreClassName.java:41)
	at com.carrotsearch.randomizedtesting.rules.NoShadowingOrOverridesOnMethodsRule$1.evaluate(NoShadowingOrOverridesOnMethodsRule.java:40)
	at com.carrotsearch.randomizedtesting.rules.NoShadowingOrOverridesOnMethodsRule$1.evaluate(NoShadowingOrOverridesOnMethodsRule.java:40)
	at com.carrotsearch.randomizedtesting.rules.StatementAdapter.evaluate(StatementAdapter.java:36)
	at com.carrotsearch.randomizedtesting.rules.StatementAdapter.evaluate(StatementAdapter.java:36)
	at com.carrotsearch.randomizedtesting.rules.StatementAdapter.evaluate(StatementAdapter.java:36)
	at org.apache.lucene.util.TestRuleAssertionsRequired$1.evaluate(TestRuleAssertionsRequired.java:53)
	at org.apache.lucene.util.TestRuleMarkFailure$1.evaluate(TestRuleMarkFailure.java:47)
	at org.apache.lucene.util.TestRuleIgnoreAfterMaxFailures$1.evaluate(TestRuleIgnoreAfterMaxFailures.java:64)
	at org.apache.lucene.util.TestRuleIgnoreTestSuites$1.evaluate(TestRuleIgnoreTestSuites.java:54)
	at com.carrotsearch.randomizedtesting.rules.StatementAdapter.evaluate(StatementAdapter.java:36)
	at com.carrotsearch.randomizedtesting.ThreadLeakControl$StatementRunner.run(ThreadLeakControl.java:368)
	at java.lang.Thread.run(Thread.java:745)
Caused by: org.apache.solr.client.solrj.SolrServerException: No live SolrServers available to handle this request:[http://127.0.0.1:49518/wbs/collection1, http://127.0.0.1:49501/wbs/collection1]
	at org.apache.solr.client.solrj.impl.LBHttpSolrClient.request(LBHttpSolrClient.java:414)
	at org.apache.solr.client.solrj.impl.CloudSolrClient.sendRequest(CloudSolrClient.java:1361)
	at org.apache.solr.client.solrj.impl.CloudSolrClient.requestWithRetryOnStaleState(CloudSolrClient.java:1112)
	at org.apache.solr.client.solrj.impl.CloudSolrClient.request(CloudSolrClient.java:1042)
	at org.apache.solr.client.solrj.SolrRequest.process(SolrRequest.java:160)
	at org.apache.solr.client.solrj.SolrClient.query(SolrClient.java:942)
	at org.apache.solr.client.solrj.SolrClient.query(SolrClient.java:957)
	at org.apache.solr.cloud.TestCloudPivotFacet.assertPivotData(TestCloudPivotFacet.java:348)
	at org.apache.solr.cloud.TestCloudPivotFacet.assertPivotCountsAreCorrect(TestCloudPivotFacet.java:318)
	... 43 more
Caused by: org.apache.solr.client.solrj.impl.HttpSolrClient$RemoteSolrException: Error from server at http://127.0.0.1:49518/wbs/collection1: no servers hosting shard: shard2
	at org.apache.solr.client.solrj.impl.HttpSolrClient.executeMethod(HttpSolrClient.java:610)
	at org.apache.solr.client.solrj.impl.HttpSolrClient.request(HttpSolrClient.java:279)
	at org.apache.solr.client.solrj.impl.HttpSolrClient.request(HttpSolrClient.java:268)
	at org.apache.solr.client.solrj.impl.LBHttpSolrClient.doRequest(LBHttpSolrClient.java:435)
	at org.apache.solr.client.solrj.impl.LBHttpSolrClient.request(LBHttpSolrClient.java:387)
	... 51 more


FAILED:  org.apache.solr.cloud.TestRebalanceLeaders.test

Error Message:
timeout waiting for collection in cluster state: collection=testcollection

Stack Trace:
java.lang.RuntimeException: timeout waiting for collection in cluster state: collection=testcollection
	at __randomizedtesting.SeedInfo.seed([4EFC9AB8E5863CC0:C6A8A5624B7A5138]:0)
	at org.apache.solr.cloud.AbstractFullDistribZkTestBase.waitForCollection(AbstractFullDistribZkTestBase.java:346)
	at org.apache.solr.cloud.TestRebalanceLeaders.test(TestRebalanceLeaders.java:73)
	at sun.reflect.NativeMethodAccessorImpl.invoke0(Native Method)
	at sun.reflect.NativeMethodAccessorImpl.invoke(NativeMethodAccessorImpl.java:62)
	at sun.reflect.DelegatingMethodAccessorImpl.invoke(DelegatingMethodAccessorImpl.java:43)
	at java.lang.reflect.Method.invoke(Method.java:498)
	at com.carrotsearch.randomizedtesting.RandomizedRunner.invoke(RandomizedRunner.java:1713)
	at com.carrotsearch.randomizedtesting.RandomizedRunner$8.evaluate(RandomizedRunner.java:907)
	at com.carrotsearch.randomizedtesting.RandomizedRunner$9.evaluate(RandomizedRunner.java:943)
	at com.carrotsearch.randomizedtesting.RandomizedRunner$10.evaluate(RandomizedRunner.java:957)
	at org.apache.solr.BaseDistributedSearchTestCase$ShardsRepeatRule$ShardsFixedStatement.callStatement(BaseDistributedSearchTestCase.java:992)
	at org.apache.solr.BaseDistributedSearchTestCase$ShardsRepeatRule$ShardsStatement.evaluate(BaseDistributedSearchTestCase.java:967)
	at com.carrotsearch.randomizedtesting.rules.SystemPropertiesRestoreRule$1.evaluate(SystemPropertiesRestoreRule.java:57)
	at org.apache.lucene.util.TestRuleSetupTeardownChained$1.evaluate(TestRuleSetupTeardownChained.java:49)
	at org.apache.lucene.util.AbstractBeforeAfterRule$1.evaluate(AbstractBeforeAfterRule.java:45)
	at org.apache.lucene.util.TestRuleThreadAndTestName$1.evaluate(TestRuleThreadAndTestName.java:48)
	at org.apache.lucene.util.TestRuleIgnoreAfterMaxFailures$1.evaluate(TestRuleIgnoreAfterMaxFailures.java:64)
	at org.apache.lucene.util.TestRuleMarkFailure$1.evaluate(TestRuleMarkFailure.java:47)
	at com.carrotsearch.randomizedtesting.rules.StatementAdapter.evaluate(StatementAdapter.java:36)
	at com.carrotsearch.randomizedtesting.ThreadLeakControl$StatementRunner.run(ThreadLeakControl.java:368)
	at com.carrotsearch.randomizedtesting.ThreadLeakControl.forkTimeoutingTask(ThreadLeakControl.java:817)
	at com.carrotsearch.randomizedtesting.ThreadLeakControl$3.evaluate(ThreadLeakControl.java:468)
	at com.carrotsearch.randomizedtesting.RandomizedRunner.runSingleTest(RandomizedRunner.java:916)
	at com.carrotsearch.randomizedtesting.RandomizedRunner$5.evaluate(RandomizedRunner.java:802)
	at com.carrotsearch.randomizedtesting.RandomizedRunner$6.evaluate(RandomizedRunner.java:852)
	at com.carrotsearch.randomizedtesting.RandomizedRunner$7.evaluate(RandomizedRunner.java:863)
	at com.carrotsearch.randomizedtesting.rules.StatementAdapter.evaluate(StatementAdapter.java:36)
	at com.carrotsearch.randomizedtesting.rules.SystemPropertiesRestoreRule$1.evaluate(SystemPropertiesRestoreRule.java:57)
	at org.apache.lucene.util.AbstractBeforeAfterRule$1.evaluate(AbstractBeforeAfterRule.java:45)
	at com.carrotsearch.randomizedtesting.rules.StatementAdapter.evaluate(StatementAdapter.java:36)
	at org.apache.lucene.util.TestRuleStoreClassName$1.evaluate(TestRuleStoreClassName.java:41)
	at com.carrotsearch.randomizedtesting.rules.NoShadowingOrOverridesOnMethodsRule$1.evaluate(NoShadowingOrOverridesOnMethodsRule.java:40)
	at com.carrotsearch.randomizedtesting.rules.NoShadowingOrOverridesOnMethodsRule$1.evaluate(NoShadowingOrOverridesOnMethodsRule.java:40)
	at com.carrotsearch.randomizedtesting.rules.StatementAdapter.evaluate(StatementAdapter.java:36)
	at com.carrotsearch.randomizedtesting.rules.StatementAdapter.evaluate(StatementAdapter.java:36)
	at com.carrotsearch.randomizedtesting.rules.StatementAdapter.evaluate(StatementAdapter.java:36)
	at org.apache.lucene.util.TestRuleAssertionsRequired$1.evaluate(TestRuleAssertionsRequired.java:53)
	at org.apache.lucene.util.TestRuleMarkFailure$1.evaluate(TestRuleMarkFailure.java:47)
	at org.apache.lucene.util.TestRuleIgnoreAfterMaxFailures$1.evaluate(TestRuleIgnoreAfterMaxFailures.java:64)
	at org.apache.lucene.util.TestRuleIgnoreTestSuites$1.evaluate(TestRuleIgnoreTestSuites.java:54)
	at com.carrotsearch.randomizedtesting.rules.StatementAdapter.evaluate(StatementAdapter.java:36)
	at com.carrotsearch.randomizedtesting.ThreadLeakControl$StatementRunner.run(ThreadLeakControl.java:368)
	at java.lang.Thread.run(Thread.java:745)




Build Log:
[...truncated 11620 lines...]
   [junit4] Suite: org.apache.solr.cloud.TestRebalanceLeaders
   [junit4]   2> Creating dataDir: /Users/jenkins/workspace/Lucene-Solr-6.x-MacOSX/solr/build/solr-core/test/J1/temp/solr.cloud.TestRebalanceLeaders_4EFC9AB8E5863CC0-001/init-core-data-001
   [junit4]   2> 1186840 INFO  (SUITE-TestRebalanceLeaders-seed#[4EFC9AB8E5863CC0]-worker) [    ] o.a.s.SolrTestCaseJ4 Using TrieFields
   [junit4]   2> 1186848 INFO  (SUITE-TestRebalanceLeaders-seed#[4EFC9AB8E5863CC0]-worker) [    ] o.a.s.SolrTestCaseJ4 Randomized ssl (true) and clientAuth (false) via: @org.apache.solr.util.RandomizeSSL(reason=, value=NaN, ssl=NaN, clientAuth=NaN) w/ MAC_OS_X supressed clientAuth
   [junit4]   2> 1186848 INFO  (SUITE-TestRebalanceLeaders-seed#[4EFC9AB8E5863CC0]-worker) [    ] o.a.s.BaseDistributedSearchTestCase Setting hostContext system property: /ch/b
   [junit4]   2> 1186850 INFO  (TEST-TestRebalanceLeaders.test-seed#[4EFC9AB8E5863CC0]) [    ] o.a.s.c.ZkTestServer STARTING ZK TEST SERVER
   [junit4]   2> 1186851 INFO  (Thread-1617) [    ] o.a.s.c.ZkTestServer client port:0.0.0.0/0.0.0.0:0
   [junit4]   2> 1186851 INFO  (Thread-1617) [    ] o.a.s.c.ZkTestServer Starting server
   [junit4]   2> 1186959 INFO  (TEST-TestRebalanceLeaders.test-seed#[4EFC9AB8E5863CC0]) [    ] o.a.s.c.ZkTestServer start zk server on port:62364
   [junit4]   2> 1187006 INFO  (TEST-TestRebalanceLeaders.test-seed#[4EFC9AB8E5863CC0]) [    ] o.a.s.c.AbstractZkTestCase put /Users/jenkins/workspace/Lucene-Solr-6.x-MacOSX/solr/core/src/test-files/solr/collection1/conf/solrconfig-tlog.xml to /configs/conf1/solrconfig.xml
   [junit4]   2> 1187011 INFO  (TEST-TestRebalanceLeaders.test-seed#[4EFC9AB8E5863CC0]) [    ] o.a.s.c.AbstractZkTestCase put /Users/jenkins/workspace/Lucene-Solr-6.x-MacOSX/solr/core/src/test-files/solr/collection1/conf/schema15.xml to /configs/conf1/schema.xml
   [junit4]   2> 1187014 INFO  (TEST-TestRebalanceLeaders.test-seed#[4EFC9AB8E5863CC0]) [    ] o.a.s.c.AbstractZkTestCase put /Users/jenkins/workspace/Lucene-Solr-6.x-MacOSX/solr/core/src/test-files/solr/collection1/conf/solrconfig.snippet.randomindexconfig.xml to /configs/conf1/solrconfig.snippet.randomindexconfig.xml
   [junit4]   2> 1187017 INFO  (TEST-TestRebalanceLeaders.test-seed#[4EFC9AB8E5863CC0]) [    ] o.a.s.c.AbstractZkTestCase put /Users/jenkins/workspace/Lucene-Solr-6.x-MacOSX/solr/core/src/test-files/solr/collection1/conf/stopwords.txt to /configs/conf1/stopwords.txt
   [junit4]   2> 1187020 INFO  (TEST-TestRebalanceLeaders.test-seed#[4EFC9AB8E5863CC0]) [    ] o.a.s.c.AbstractZkTestCase put /Users/jenkins/workspace/Lucene-Solr-6.x-MacOSX/solr/core/src/test-files/solr/collection1/conf/protwords.txt to /configs/conf1/protwords.txt
   [junit4]   2> 1187024 INFO  (TEST-TestRebalanceLeaders.test-seed#[4EFC9AB8E5863CC0]) [    ] o.a.s.c.AbstractZkTestCase put /Users/jenkins/workspace/Lucene-Solr-6.x-MacOSX/solr/core/src/test-files/solr/collection1/conf/currency.xml to /configs/conf1/currency.xml
   [junit4]   2> 1187027 INFO  (TEST-TestRebalanceLeaders.test-seed#[4EFC9AB8E5863CC0]) [    ] o.a.s.c.AbstractZkTestCase put /Users/jenkins/workspace/Lucene-Solr-6.x-MacOSX/solr/core/src/test-files/solr/collection1/conf/enumsConfig.xml to /configs/conf1/enumsConfig.xml
   [junit4]   2> 1187030 INFO  (TEST-TestRebalanceLeaders.test-seed#[4EFC9AB8E5863CC0]) [    ] o.a.s.c.AbstractZkTestCase put /Users/jenkins/workspace/Lucene-Solr-6.x-MacOSX/solr/core/src/test-files/solr/collection1/conf/open-exchange-rates.json to /configs/conf1/open-exchange-rates.json
   [junit4]   2> 1187035 INFO  (TEST-TestRebalanceLeaders.test-seed#[4EFC9AB8E5863CC0]) [    ] o.a.s.c.AbstractZkTestCase put /Users/jenkins/workspace/Lucene-Solr-6.x-MacOSX/solr/core/src/test-files/solr/collection1/conf/mapping-ISOLatin1Accent.txt to /configs/conf1/mapping-ISOLatin1Accent.txt
   [junit4]   2> 1187038 INFO  (TEST-TestRebalanceLeaders.test-seed#[4EFC9AB8E5863CC0]) [    ] o.a.s.c.AbstractZkTestCase put /Users/jenkins/workspace/Lucene-Solr-6.x-MacOSX/solr/core/src/test-files/solr/collection1/conf/old_synonyms.txt to /configs/conf1/old_synonyms.txt
   [junit4]   2> 1187042 INFO  (TEST-TestRebalanceLeaders.test-seed#[4EFC9AB8E5863CC0]) [    ] o.a.s.c.AbstractZkTestCase put /Users/jenkins/workspace/Lucene-Solr-6.x-MacOSX/solr/core/src/test-files/solr/collection1/conf/synonyms.txt to /configs/conf1/synonyms.txt
   [junit4]   2> 1187646 INFO  (TEST-TestRebalanceLeaders.test-seed#[4EFC9AB8E5863CC0]) [    ] o.a.s.SolrTestCaseJ4 Writing core.properties file to /Users/jenkins/workspace/Lucene-Solr-6.x-MacOSX/solr/build/solr-core/test/J1/temp/solr.cloud.TestRebalanceLeaders_4EFC9AB8E5863CC0-001/control-001/cores/collection1
   [junit4]   2> 1187651 INFO  (TEST-TestRebalanceLeaders.test-seed#[4EFC9AB8E5863CC0]) [    ] o.e.j.s.Server jetty-9.3.14.v20161028
   [junit4]   2> 1187654 INFO  (TEST-TestRebalanceLeaders.test-seed#[4EFC9AB8E5863CC0]) [    ] o.e.j.s.h.ContextHandler Started o.e.j.s.ServletContextHandler@a0d69be{/ch/b,null,AVAILABLE}
   [junit4]   2> 1187655 INFO  (TEST-TestRebalanceLeaders.test-seed#[4EFC9AB8E5863CC0]) [    ] o.e.j.s.AbstractConnector Started ServerConnector@3547cebd{SSL,[ssl, http/1.1]}{127.0.0.1:62368}
   [junit4]   2> 1187655 INFO  (TEST-TestRebalanceLeaders.test-seed#[4EFC9AB8E5863CC0]) [    ] o.e.j.s.Server Started @1193099ms
   [junit4]   2> 1187655 INFO  (TEST-TestRebalanceLeaders.test-seed#[4EFC9AB8E5863CC0]) [    ] o.a.s.c.s.e.JettySolrRunner Jetty properties: {solr.data.dir=/Users/jenkins/workspace/Lucene-Solr-6.x-MacOSX/solr/build/solr-core/test/J1/temp/solr.cloud.TestRebalanceLeaders_4EFC9AB8E5863CC0-001/tempDir-001/control/data, hostContext=/ch/b, hostPort=62368, coreRootDirectory=/Users/jenkins/workspace/Lucene-Solr-6.x-MacOSX/solr/build/solr-core/test/J1/temp/solr.cloud.TestRebalanceLeaders_4EFC9AB8E5863CC0-001/control-001/cores}
   [junit4]   2> 1187655 ERROR (TEST-TestRebalanceLeaders.test-seed#[4EFC9AB8E5863CC0]) [    ] o.a.s.s.StartupLoggingUtils Missing Java Option solr.log.dir. Logging may be missing or incomplete.
   [junit4]   2> 1187656 INFO  (TEST-TestRebalanceLeaders.test-seed#[4EFC9AB8E5863CC0]) [    ] o.a.s.s.SolrDispatchFilter  ___      _       Welcome to Apache Solr? version 6.5.0
   [junit4]   2> 1187656 INFO  (TEST-TestRebalanceLeaders.test-seed#[4EFC9AB8E5863CC0]) [    ] o.a.s.s.SolrDispatchFilter / __| ___| |_ _   Starting in cloud mode on port null
   [junit4]   2> 1187656 INFO  (TEST-TestRebalanceLeaders.test-seed#[4EFC9AB8E5863CC0]) [    ] o.a.s.s.SolrDispatchFilter \__ \/ _ \ | '_|  Install dir: null
   [junit4]   2> 1187656 INFO  (TEST-TestRebalanceLeaders.test-seed#[4EFC9AB8E5863CC0]) [    ] o.a.s.s.SolrDispatchFilter |___/\___/_|_|    Start time: 2017-02-27T12:19:14.727Z
   [junit4]   2> 1187662 INFO  (TEST-TestRebalanceLeaders.test-seed#[4EFC9AB8E5863CC0]) [    ] o.a.s.s.SolrDispatchFilter Loading solr.xml from SolrHome (not found in ZooKeeper)
   [junit4]   2> 1187663 INFO  (TEST-TestRebalanceLeaders.test-seed#[4EFC9AB8E5863CC0]) [    ] o.a.s.c.SolrXmlConfig Loading container configuration from /Users/jenkins/workspace/Lucene-Solr-6.x-MacOSX/solr/build/solr-core/test/J1/temp/solr.cloud.TestRebalanceLeaders_4EFC9AB8E5863CC0-001/control-001/solr.xml
   [junit4]   2> 1187696 INFO  (TEST-TestRebalanceLeaders.test-seed#[4EFC9AB8E5863CC0]) [    ] o.a.s.u.UpdateShardHandler Creating UpdateShardHandler HTTP client with params: socketTimeout=340000&connTimeout=45000&retry=true
   [junit4]   2> 1187698 INFO  (TEST-TestRebalanceLeaders.test-seed#[4EFC9AB8E5863CC0]) [    ] o.a.s.c.ZkContainer Zookeeper client=127.0.0.1:62364/solr
   [junit4]   2> 1187788 INFO  (TEST-TestRebalanceLeaders.test-seed#[4EFC9AB8E5863CC0]) [n:127.0.0.1:62368_ch%2Fb    ] o.a.s.c.Overseer Overseer (id=null) closing
   [junit4]   2> 1187790 INFO  (TEST-TestRebalanceLeaders.test-seed#[4EFC9AB8E5863CC0]) [n:127.0.0.1:62368_ch%2Fb    ] o.a.s.c.OverseerElectionContext I am going to be the leader 127.0.0.1:62368_ch%2Fb
   [junit4]   2> 1187791 INFO  (TEST-TestRebalanceLeaders.test-seed#[4EFC9AB8E5863CC0]) [n:127.0.0.1:62368_ch%2Fb    ] o.a.s.c.Overseer Overseer (id=97530541108494341-127.0.0.1:62368_ch%2Fb-n_0000000000) starting
   [junit4]   2> 1187814 INFO  (TEST-TestRebalanceLeaders.test-seed#[4EFC9AB8E5863CC0]) [n:127.0.0.1:62368_ch%2Fb    ] o.a.s.c.ZkController Register node as live in ZooKeeper:/live_nodes/127.0.0.1:62368_ch%2Fb
   [junit4]   2> 1187817 INFO  (zkCallback-2101-thread-1-processing-n:127.0.0.1:62368_ch%2Fb) [n:127.0.0.1:62368_ch%2Fb    ] o.a.s.c.c.ZkStateReader Updated live nodes from ZooKeeper... (0) -> (1)
   [junit4]   2> 1187964 INFO  (TEST-TestRebalanceLeaders.test-seed#[4EFC9AB8E5863CC0]) [n:127.0.0.1:62368_ch%2Fb    ] o.a.s.c.CorePropertiesLocator Found 1 core definitions underneath /Users/jenkins/workspace/Lucene-Solr-6.x-MacOSX/solr/build/solr-core/test/J1/temp/solr.cloud.TestRebalanceLeaders_4EFC9AB8E5863CC0-001/control-001/cores
   [junit4]   2> 1187964 INFO  (TEST-TestRebalanceLeaders.test-seed#[4EFC9AB8E5863CC0]) [n:127.0.0.1:62368_ch%2Fb    ] o.a.s.c.CorePropertiesLocator Cores are: [collection1]
   [junit4]   2> 1187968 INFO  (OverseerStateUpdate-97530541108494341-127.0.0.1:62368_ch%2Fb-n_0000000000) [n:127.0.0.1:62368_ch%2Fb    ] o.a.s.c.o.ReplicaMutator Assigning new node to shard shard=shard1
   [junit4]   2> 1188992 WARN  (coreLoadExecutor-4074-thread-1-processing-n:127.0.0.1:62368_ch%2Fb) [n:127.0.0.1:62368_ch%2Fb c:control_collection   x:collection1] o.a.s.c.Config Beginning with Solr 5.5, <mergePolicy> is deprecated, use <mergePolicyFactory> instead.
   [junit4]   2> 1188993 INFO  (coreLoadExecutor-4074-thread-1-processing-n:127.0.0.1:62368_ch%2Fb) [n:127.0.0.1:62368_ch%2Fb c:control_collection   x:collection1] o.a.s.c.SolrConfig Using Lucene MatchVersion: 6.5.0
   [junit4]   2> 1189005 INFO  (coreLoadExecutor-4074-thread-1-processing-n:127.0.0.1:62368_ch%2Fb) [n:127.0.0.1:62368_ch%2Fb c:control_collection   x:collection1] o.a.s.s.IndexSchema [collection1] Schema name=test
   [junit4]   2> 1189079 WARN  (coreLoadExecutor-4074-thread-1-processing-n:127.0.0.1:62368_ch%2Fb) [n:127.0.0.1:62368_ch%2Fb c:control_collection   x:collection1] o.a.s.s.IndexSchema [collection1] default search field in schema is text. WARNING: Deprecated, please use 'df' on request instead.
   [junit4]   2> 1189082 INFO  (coreLoadExecutor-4074-thread-1-processing-n:127.0.0.1:62368_ch%2Fb) [n:127.0.0.1:62368_ch%2Fb c:control_collection   x:collection1] o.a.s.s.IndexSchema Loaded schema test/1.6 with uniqueid field id
   [junit4]   2> 1189112 INFO  (coreLoadExecutor-4074-thread-1-processing-n:127.0.0.1:62368_ch%2Fb) [n:127.0.0.1:62368_ch%2Fb c:control_collection   x:collection1] o.a.s.c.CoreContainer Creating SolrCore 'collection1' using configuration from collection control_collection
   [junit4]   2> 1189113 INFO  (coreLoadExecutor-4074-thread-1-processing-n:127.0.0.1:62368_ch%2Fb) [n:127.0.0.1:62368_ch%2Fb c:control_collection   x:collection1] o.a.s.c.SolrCore [[collection1] ] Opening new SolrCore at [/Users/jenkins/workspace/Lucene-Solr-6.x-MacOSX/solr/build/solr-core/test/J1/temp/solr.cloud.TestRebalanceLeaders_4EFC9AB8E5863CC0-001/control-001/cores/collection1], dataDir=[/Users/jenkins/workspace/Lucene-Solr-6.x-MacOSX/solr/build/solr-core/test/J1/temp/solr.cloud.TestRebalanceLeaders_4EFC9AB8E5863CC0-001/control-001/cores/collection1/data/]
   [junit4]   2> 1189113 INFO  (coreLoadExecutor-4074-thread-1-processing-n:127.0.0.1:62368_ch%2Fb) [n:127.0.0.1:62368_ch%2Fb c:control_collection   x:collection1] o.a.s.c.JmxMonitoredMap JMX monitoring is enabled. Adding Solr mbeans to JMX Server: com.sun.jmx.mbeanserver.JmxMBeanServer@103b52e4
   [junit4]   2> 1189114 INFO  (coreLoadExecutor-4074-thread-1-processing-n:127.0.0.1:62368_ch%2Fb) [n:127.0.0.1:62368_ch%2Fb c:control_collection   x:collection1] o.a.s.u.RandomMergePolicy RandomMergePolicy wrapping class org.apache.lucene.index.LogByteSizeMergePolicy: [LogByteSizeMergePolicy: minMergeSize=1677721, mergeFactor=47, maxMergeSize=2147483648, maxMergeSizeForForcedMerge=9223372036854775807, calibrateSizeByDeletes=false, maxMergeDocs=2147483647, maxCFSSegmentSizeMB=8.796093022207999E12, noCFSRatio=0.7786661977038518]
   [junit4]   2> 1189119 WARN  (coreLoadExecutor-4074-thread-1-processing-n:127.0.0.1:62368_ch%2Fb) [n:127.0.0.1:62368_ch%2Fb c:control_collection   x:collection1] o.a.s.c.RequestHandlers INVALID paramSet a in requestHandler {type = requestHandler,name = /dump,class = DumpRequestHandler,attributes = {initParams=a, name=/dump, class=DumpRequestHandler},args = {defaults={a=A,b=B}}}
   [junit4]   2> 1189223 INFO  (coreLoadExecutor-4074-thread-1-processing-n:127.0.0.1:62368_ch%2Fb) [n:127.0.0.1:62368_ch%2Fb c:control_collection   x:collection1] o.a.s.u.UpdateHandler Using UpdateLog implementation: org.apache.solr.update.UpdateLog
   [junit4]   2> 1189223 INFO  (coreLoadExecutor-4074-thread-1-processing-n:127.0.0.1:62368_ch%2Fb) [n:127.0.0.1:62368_ch%2Fb c:control_collection   x:collection1] o.a.s.u.UpdateLog Initializing UpdateLog: dataDir= defaultSyncLevel=FLUSH numRecordsToKeep=100 maxNumLogsToKeep=10 numVersionBuckets=65536
   [junit4]   2> 1189225 INFO  (coreLoadExecutor-4074-thread-1-processing-n:127.0.0.1:62368_ch%2Fb) [n:127.0.0.1:62368_ch%2Fb c:control_collection   x:collection1] o.a.s.u.CommitTracker Hard AutoCommit: disabled
   [junit4]   2> 1189225 INFO  (coreLoadExecutor-4074-thread-1-processing-n:127.0.0.1:62368_ch%2Fb) [n:127.0.0.1:62368_ch%2Fb c:control_collection   x:collection1] o.a.s.u.CommitTracker Soft AutoCommit: disabled
   [junit4]   2> 1189225 INFO  (coreLoadExecutor-4074-thread-1-processing-n:127.0.0.1:62368_ch%2Fb) [n:127.0.0.1:62368_ch%2Fb c:control_collection   x:collection1] o.a.s.u.RandomMergePolicy RandomMergePolicy wrapping class org.apache.lucene.index.TieredMergePolicy: [TieredMergePolicy: maxMergeAtOnce=19, maxMergeAtOnceExplicit=16, maxMergedSegmentMB=65.3115234375, floorSegmentMB=1.1455078125, forceMergeDeletesPctAllowed=13.442886366518048, segmentsPerTier=24.0, maxCFSSegmentSizeMB=8.796093022207999E12, noCFSRatio=0.0
   [junit4]   2> 1189231 INFO  (coreLoadExecutor-4074-thread-1-processing-n:127.0.0.1:62368_ch%2Fb) [n:127.0.0.1:62368_ch%2Fb c:control_collection   x:collection1] o.a.s.s.SolrIndexSearcher Opening [Searcher@4786ba73[collection1] main]
   [junit4]   2> 1189233 INFO  (coreLoadExecutor-4074-thread-1-processing-n:127.0.0.1:62368_ch%2Fb) [n:127.0.0.1:62368_ch%2Fb c:control_collection   x:collection1] o.a.s.r.ManagedResourceStorage Configured ZooKeeperStorageIO with znodeBase: /configs/conf1
   [junit4]   2> 1189234 INFO  (coreLoadExecutor-4074-thread-1-processing-n:127.0.0.1:62368_ch%2Fb) [n:127.0.0.1:62368_ch%2Fb c:control_collection   x:collection1] o.a.s.r.ManagedResourceStorage Loaded null at path _rest_managed.json using ZooKeeperStorageIO:path=/configs/conf1
   [junit4]   2> 1189234 INFO  (coreLoadExecutor-4074-thread-1-processing-n:127.0.0.1:62368_ch%2Fb) [n:127.0.0.1:62368_ch%2Fb c:control_collection   x:collection1] o.a.s.h.ReplicationHandler Commits will be reserved for  10000
   [junit4]   2> 1189236 INFO  (searcherExecutor-4075-thread-1-processing-n:127.0.0.1:62368_ch%2Fb x:collection1 c:control_collection) [n:127.0.0.1:62368_ch%2Fb c:control_collection   x:collection1] o.a.s.c.SolrCore [collection1] Registered new searcher Searcher@4786ba73[collection1] main{ExitableDirectoryReader(UninvertingDirectoryReader())}
   [junit4]   2> 1189236 INFO  (coreLoadExecutor-4074-thread-1-processing-n:127.0.0.1:62368_ch%2Fb) [n:127.0.0.1:62368_ch%2Fb c:control_collection   x:collection1] o.a.s.u.UpdateLog Could not find max version in index or recent updates, using new clock 1560488660232568832
   [junit4]   2> 1189248 INFO  (coreZkRegister-4067-thread-1-processing-n:127.0.0.1:62368_ch%2Fb x:collection1 c:control_collection) [n:127.0.0.1:62368_ch%2Fb c:control_collection s:shard1 r:core_node1 x:collection1] o.a.s.c.ShardLeaderElectionContext Enough replicas found to continue.
   [junit4]   2> 1189249 INFO  (coreZkRegister-4067-thread-1-processing-n:127.0.0.1:62368_ch%2Fb x:collection1 c:control_collection) [n:127.0.0.1:62368_ch%2Fb c:control_collection s:shard1 r:core_node1 x:collection1] o.a.s.c.ShardLeaderElectionContext I may be the new leader - try and sync
   [junit4]   2> 1189249 INFO  (coreZkRegister-4067-thread-1-processing-n:127.0.0.1:62368_ch%2Fb x:collection1 c:control_collection) [n:127.0.0.1:62368_ch%2Fb c:control_collection s:shard1 r:core_node1 x:collection1] o.a.s.c.SyncStrategy Sync replicas to https://127.0.0.1:62368/ch/b/collection1/
   [junit4]   2> 1189249 INFO  (coreZkRegister-4067-thread-1-processing-n:127.0.0.1:62368_ch%2Fb x:collection1 c:control_collection) [n:127.0.0.1:62368_ch%2Fb c:control_collection s:shard1 r:core_node1 x:collection1] o.a.s.c.SyncStrategy Sync Success - now sync replicas to me
   [junit4]   2> 1189249 INFO  (coreZkRegister-4067-thread-1-processing-n:127.0.0.1:62368_ch%2Fb x:collection1 c:control_collection) [n:127.0.0.1:62368_ch%2Fb c:control_collection s:shard1 r:core_node1 x:collection1] o.a.s.c.SyncStrategy https://127.0.0.1:62368/ch/b/collection1/ has no replicas
   [junit4]   2> 1189249 INFO  (coreZkRegister-4067-thread-1-processing-n:127.0.0.1:62368_ch%2Fb x:collection1 c:control_collection) [n:127.0.0.1:62368_ch%2Fb c:control_collection s:shard1 r:core_node1 x:collection1] o.a.s.c.ShardLeaderElectionContext Found all replicas participating in election, clear LIR
   [junit4]   2> 1189257 INFO  (coreZkRegister-4067-thread-1-processing-n:127.0.0.1:62368_ch%2Fb x:collection1 c:control_collection) [n:127.0.0.1:62368_ch%2Fb c:control_collection s:shard1 r:core_node1 x:collection1] o.a.s.c.ShardLeaderElectionContext I am the new leader: https://127.0.0.1:62368/ch/b/collection1/ shard1
   [junit4]   2> 1189390 INFO  (TEST-TestRebalanceLeaders.test-seed#[4EFC9AB8E5863CC0]) [    ] o.a.s.c.c.ZkStateReader Updated live nodes from ZooKeeper... (0) -> (1)
   [junit4]   2> 1189393 INFO  (TEST-TestRebalanceLeaders.test-seed#[4EFC9AB8E5863CC0]) [    ] o.a.s.c.s.i.ZkClientClusterStateProvider Cluster at 127.0.0.1:62364/solr ready
   [junit4]   2> 1189393 INFO  (TEST-TestRebalanceLeaders.test-seed#[4EFC9AB8E5863CC0]) [    ] o.a.s.c.ChaosMonkey monkey: init - expire sessions:false cause connection loss:false
   [junit4]   2> 1189393 INFO  (TEST-TestRebalanceLeaders.test-seed#[4EFC9AB8E5863CC0]) [    ] o.a.s.c.AbstractFullDistribZkTestBase Creating collection1 with stateFormat=2
   [junit4]   2> 1189422 INFO  (coreZkRegister-4067-thread-1-processing-n:127.0.0.1:62368_ch%2Fb x:collection1 c:control_collection) [n:127.0.0.1:62368_ch%2Fb c:control_collection s:shard1 r:core_node1 x:collection1] o.a.s.c.ZkController I am the leader, no recovery necessary
   [junit4]   2> 1189789 INFO  (TEST-TestRebalanceLeaders.test-seed#[4EFC9AB8E5863CC0]) [    ] o.a.s.SolrTestCaseJ4 Writing core.properties file to /Users/jenkins/workspace/Lucene-Solr-6.x-MacOSX/solr/build/solr-core/test/J1/temp/solr.cloud.TestRebalanceLeaders_4EFC9AB8E5863CC0-001/shard-1-001/cores/collection1
   [junit4]   2> 1189792 INFO  (TEST-TestRebalanceLeaders.test-seed#[4EFC9AB8E5863CC0]) [    ] o.a.s.c.AbstractFullDistribZkTestBase create jetty 1 in directory /Users/jenkins/workspace/Lucene-Solr-6.x-MacOSX/solr/build/solr-core/test/J1/temp/solr.cloud.TestRebalanceLeaders_4EFC9AB8E5863CC0-001/shard-1-001
   [junit4]   2> 1189796 INFO  (TEST-TestRebalanceLeaders.test-seed#[4EFC9AB8E5863CC0]) [    ] o.e.j.s.Server jetty-9.3.14.v20161028
   [junit4]   2> 1189799 INFO  (TEST-TestRebalanceLeaders.test-seed#[4EFC9AB8E5863CC0]) [    ] o.e.j.s.h.ContextHandler Started o.e.j.s.ServletContextHandler@31294aa7{/ch/b,null,AVAILABLE}
   [junit4]   2> 1189800 INFO  (TEST-TestRebalanceLeaders.test-seed#[4EFC9AB8E5863CC0]) [    ] o.e.j.s.AbstractConnector Started ServerConnector@13eaf826{SSL,[ssl, http/1.1]}{127.0.0.1:62374}
   [junit4]   2> 1189801 INFO  (TEST-TestRebalanceLeaders.test-seed#[4EFC9AB8E5863CC0]) [    ] o.e.j.s.Server Started @1195244ms
   [junit4]   2> 1189801 INFO  (TEST-TestRebalanceLeaders.test-seed#[4EFC9AB8E5863CC0]) [    ] o.a.s.c.s.e.JettySolrRunner Jetty properties: {solr.data.dir=/Users/jenkins/workspace/Lucene-Solr-6.x-MacOSX/solr/build/solr-core/test/J1/temp/solr.cloud.TestRebalanceLeaders_4EFC9AB8E5863CC0-001/tempDir-001/jetty1, solrconfig=solrconfig.xml, hostContext=/ch/b, hostPort=62374, coreRootDirectory=/Users/jenkins/workspace/Lucene-Solr-6.x-MacOSX/solr/build/solr-core/test/J1/temp/solr.cloud.TestRebalanceLeaders_4EFC9AB8E5863CC0-001/shard-1-001/cores}
   [junit4]   2> 1189801 ERROR (TEST-TestRebalanceLeaders.test-seed#[4EFC9AB8E5863CC0]) [    ] o.a.s.s.StartupLoggingUtils Missing Java Option solr.log.dir. Logging may be missing or incomplete.
   [junit4]   2> 1189802 INFO  (TEST-TestRebalanceLeaders.test-seed#[4EFC9AB8E5863CC0]) [    ] o.a.s.s.SolrDispatchFilter  ___      _       Welcome to Apache Solr? version 6.5.0
   [junit4]   2> 1189802 INFO  (TEST-TestRebalanceLeaders.test-seed#[4EFC9AB8E5863CC0]) [    ] o.a.s.s.SolrDispatchFilter / __| ___| |_ _   Starting in cloud mode on port null
   [junit4]   2> 1189802 INFO  (TEST-TestRebalanceLeaders.test-seed#[4EFC9AB8E5863CC0]) [    ] o.a.s.s.SolrDispatchFilter \__ \/ _ \ | '_|  Install dir: null
   [junit4]   2> 1189802 INFO  (TEST-TestRebalanceLeaders.test-seed#[4EFC9AB8E5863CC0]) [    ] o.a.s.s.SolrDispatchFilter |___/\___/_|_|    Start time: 2017-02-27T12:19:16.873Z
   [junit4]   2> 1189808 INFO  (TEST-TestRebalanceLeaders.test-seed#[4EFC9AB8E5863CC0]) [    ] o.a.s.s.SolrDispatchFilter Loading solr.xml from SolrHome (not found in ZooKeeper)
   [junit4]   2> 1189809 INFO  (TEST-TestRebalanceLeaders.test-seed#[4EFC9AB8E5863CC0]) [    ] o.a.s.c.SolrXmlConfig Loading container configuration from /Users/jenkins/workspace/Lucene-Solr-6.x-MacOSX/solr/build/solr-core/test/J1/temp/solr.cloud.TestRebalanceLeaders_4EFC9AB8E5863CC0-001/shard-1-001/solr.xml
   [junit4]   2> 1189870 INFO  (TEST-TestRebalanceLeaders.test-seed#[4EFC9AB8E5863CC0]) [    ] o.a.s.u.UpdateShardHandler Creating UpdateShardHandler HTTP client with params: socketTimeout=340000&connTimeout=45000&retry=true
   [junit4]   2> 1189876 INFO  (TEST-TestRebalanceLeaders.test-seed#[4EFC9AB8E5863CC0]) [    ] o.a.s.c.ZkContainer Zookeeper client=127.0.0.1:62364/solr
   [junit4]   2> 1189912 INFO  (TEST-TestRebalanceLeaders.test-seed#[4EFC9AB8E5863CC0]) [n:127.0.0.1:62374_ch%2Fb    ] o.a.s.c.c.ZkStateReader Updated live nodes from ZooKeeper... (0) -> (1)
   [junit4]   2> 1189919 INFO  (TEST-TestRebalanceLeaders.test-seed#[4EFC9AB8E5863CC0]) [n:127.0.0.1:62374_ch%2Fb    ] o.a.s.c.Overseer Overseer (id=null) closing
   [junit4]   2> 1189923 INFO  (TEST-TestRebalanceLeaders.test-seed#[4EFC9AB8E5863CC0]) [n:127.0.0.1:62374_ch%2Fb    ] o.a.s.c.ZkController Register node as live in ZooKeeper:/live_nodes/127.0.0.1:62374_ch%2Fb
   [junit4]   2> 1189931 INFO  (zkCallback-2101-thread-3-processing-n:127.0.0.1:62368_ch%2Fb) [n:127.0.0.1:62368_ch%2Fb    ] o.a.s.c.c.ZkStateReader Updated live nodes from ZooKeeper... (1) -> (2)
   [junit4]   2> 1189931 INFO  (zkCallback-2105-thread-1) [    ] o.a.s.c.c.ZkStateReader Updated live nodes from ZooKeeper... (1) -> (2)
   [junit4]   2> 1189932 INFO  (zkCallback-2111-thread-1-processing-n:127.0.0.1:62374_ch%2Fb) [n:127.0.0.1:62374_ch%2Fb    ] o.a.s.c.c.ZkStateReader Updated live nodes from ZooKeeper... (1) -> (2)
   [junit4]   2> 1190126 INFO  (TEST-TestRebalanceLeaders.test-seed#[4EFC9AB8E5863CC0]) [n:127.0.0.1:62374_ch%2Fb    ] o.a.s.c.CorePropertiesLocator Found 1 core definitions underneath /Users/jenkins/workspace/Lucene-Solr-6.x-MacOSX/solr/build/solr-core/test/J1/temp/solr.cloud.TestRebalanceLeaders_4EFC9AB8E5863CC0-001/shard-1-001/cores
   [junit4]   2> 1190127 INFO  (TEST-TestRebalanceLeaders.test-seed#[4EFC9AB8E5863CC0]) [n:127.0.0.1:62374_ch%2Fb    ] o.a.s.c.CorePropertiesLocator Cores are: [collection1]
   [junit4]   2> 1190132 INFO  (OverseerStateUpdate-97530541108494341-127.0.0.1:62368_ch%2Fb-n_0000000000) [n:127.0.0.1:62368_ch%2Fb    ] o.a.s.c.o.ReplicaMutator Assigning new node to shard shard=shard2
   [junit4]   2> 1190244 INFO  (zkCallback-2111-thread-1-processing-n:127.0.0.1:62374_ch%2Fb) [n:127.0.0.1:62374_ch%2Fb    ] o.a.s.c.c.ZkStateReader A cluster state change: [WatchedEvent state:SyncConnected type:NodeDataChanged path:/collections/collection1/state.json] for collection [collection1] has occurred - updating... (live nodes size: [2])
   [junit4]   2> 1191153 WARN  (coreLoadExecutor-4085-thread-1-processing-n:127.0.0.1:62374_ch%2Fb) [n:127.0.0.1:62374_ch%2Fb c:collection1   x:collection1] o.a.s.c.Config Beginning with Solr 5.5, <mergePolicy> is deprecated, use <mergePolicyFactory> instead.
   [junit4]   2> 1191153 INFO  (coreLoadExecutor-4085-thread-1-processing-n:127.0.0.1:62374_ch%2Fb) [n:127.0.0.1:62374_ch%2Fb c:collection1   x:collection1] o.a.s.c.SolrConfig Using Lucene MatchVersion: 6.5.0
   [junit4]   2> 1191167 INFO  (coreLoadExecutor-4085-thread-1-processing-n:127.0.0.1:62374_ch%2Fb) [n:127.0.0.1:62374_ch%2Fb c:collection1   x:collection1] o.a.s.s.IndexSchema [collection1] Schema name=test
   [junit4]   2> 1191247 WARN  (coreLoadExecutor-4085-thread-1-processing-n:127.0.0.1:62374_ch%2Fb) [n:127.0.0.1:62374_ch%2Fb c:collection1   x:collection1] o.a.s.s.IndexSchema [collection1] default search field in schema is text. WARNING: Deprecated, please use 'df' on request instead.
   [junit4]   2> 1191248 INFO  (coreLoadExecutor-4085-thread-1-processing-n:127.0.0.1:62374_ch%2Fb) [n:127.0.0.1:62374_ch%2Fb c:collection1   x:collection1] o.a.s.s.IndexSchema Loaded schema test/1.6 with uniqueid field id
   [junit4]   2> 1191287 INFO  (coreLoadExecutor-4085-thread-1-processing-n:127.0.0.1:62374_ch%2Fb) [n:127.0.0.1:62374_ch%2Fb c:collection1   x:collection1] o.a.s.c.CoreContainer Creating SolrCore 'collection1' using configuration from collection collection1
   [junit4]   2> 1191288 INFO  (coreLoadExecutor-4085-thread-1-processing-n:127.0.0.1:62374_ch%2Fb) [n:127.0.0.1:62374_ch%2Fb c:collection1   x:collection1] o.a.s.c.SolrCore [[collection1] ] Opening new SolrCore at [/Users/jenkins/workspace/Lucene-Solr-6.x-MacOSX/solr/build/solr-core/test/J1/temp/solr.cloud.TestRebalanceLeaders_4EFC9AB8E5863CC0-001/shard-1-001/cores/collection1], dataDir=[/Users/jenkins/workspace/Lucene-Solr-6.x-MacOSX/solr/build/solr-core/test/J1/temp/solr.cloud.TestRebalanceLeaders_4EFC9AB8E5863CC0-001/shard-1-001/cores/collection1/data/]
   [junit4]   2> 1191288 INFO  (coreLoadExecutor-4085-thread-1-processing-n:127.0.0.1:62374_ch%2Fb) [n:127.0.0.1:62374_ch%2Fb c:collection1   x:collection1] o.a.s.c.JmxMonitoredMap JMX monitoring is enabled. Adding Solr mbeans to JMX Server: com.sun.jmx.mbeanserver.JmxMBeanServer@103b52e4
   [junit4]   2> 1191289 INFO  (coreLoadExecutor-4085-thread-1-processing-n:127.0.0.1:62374_ch%2Fb) [n:127.0.0.1:62374_ch%2Fb c:collection1   x:collection1] o.a.s.u.RandomMergePolicy RandomMergePolicy wrapping class org.apache.lucene.index.LogByteSizeMergePolicy: [LogByteSizeMergePolicy: minMergeSize=1677721, mergeFactor=47, maxMergeSize=2147483648, maxMergeSizeForForcedMerge=9223372036854775807, calibrateSizeByDeletes=false, maxMergeDocs=2147483647, maxCFSSegmentSizeMB=8.796093022207999E12, noCFSRatio=0.7786661977038518]
   [junit4]   2> 1191298 WARN  (coreLoadExecutor-4085-thread-1-processing-n:127.0.0.1:62374_ch%2Fb) [n:127.0.0.1:62374_ch%2Fb c:collection1   x:collection1] o.a.s.c.RequestHandlers INVALID paramSet a in requestHandler {type = requestHandler,name = /dump,class = DumpRequestHandler,attributes = {initParams=a, name=/dump, class=DumpRequestHandler},args = {defaults={a=A,b=B}}}
   [junit4]   2> 1191372 INFO  (coreLoadExecutor-4085-thread-1-processing-n:127.0.0.1:62374_ch%2Fb) [n:127.0.0.1:62374_ch%2Fb c:collection1   x:collection1] o.a.s.u.UpdateHandler Using UpdateLog implementation: org.apache.solr.update.UpdateLog
   [junit4]   2> 1191372 INFO  (coreLoadExecutor-4085-thread-1-processing-n:127.0.0.1:62374_ch%2Fb) [n:127.0.0.1:62374_ch%2Fb c:collection1   x:collection1] o.a.s.u.UpdateLog Initializing UpdateLog: dataDir= defaultSyncLevel=FLUSH numRecordsToKeep=100 maxNumLogsToKeep=10 numVersionBuckets=65536
   [junit4]   2> 1191373 INFO  (coreLoadExecutor-4085-thread-1-processing-n:127.0.0.1:62374_ch%2Fb) [n:127.0.0.1:62374_ch%2Fb c:collection1   x:collection1] o.a.s.u.CommitTracker Hard AutoCommit: disabled
   [junit4]   2> 1191373 INFO  (coreLoadExecutor-4085-thread-1-processing-n:127.0.0.1:62374_ch%2Fb) [n:127.0.0.1:62374_ch%2Fb c:collection1   x:collection1] o.a.s.u.CommitTracker Soft AutoCommit: disabled
   [junit4]   2> 1191374 INFO  (coreLoadExecutor-4085-thread-1-processing-n:127.0.0.1:62374_ch%2Fb) [n:127.0.0.1:62374_ch%2Fb c:collection1   x:collection1] o.a.s.u.RandomMergePolicy RandomMergePolicy wrapping class org.apache.lucene.index.TieredMergePolicy: [TieredMergePolicy: maxMergeAtOnce=19, maxMergeAtOnceExplicit=16, maxMergedSegmentMB=65.3115234375, floorSegmentMB=1.1455078125, forceMergeDeletesPctAllowed=13.442886366518048, segmentsPerTier=24.0, maxCFSSegmentSizeMB=8.796093022207999E12, noCFSRatio=0.0
   [junit4]   2> 1191374 INFO  (coreLoadExecutor-4085-thread-1-processing-n:127.0.0.1:62374_ch%2Fb) [n:127.0.0.1:62374_ch%2Fb c:collection1   x:collection1] o.a.s.s.SolrIndexSearcher Opening [Searcher@744bdc[collection1] main]
   [junit4]   2> 1191376 INFO  (coreLoadExecutor-4085-thread-1-processing-n:127.0.0.1:62374_ch%2Fb) [n:127.0.0.1:62374_ch%2Fb c:collection1   x:collection1] o.a.s.r.ManagedResourceStorage Configured ZooKeeperStorageIO with znodeBase: /configs/conf1
   [junit4]   2> 1191377 INFO  (coreLoadExecutor-4085-thread-1-processing-n:127.0.0.1:62374_ch%2Fb) [n:127.0.0.1:62374_ch%2Fb c:collection1   x:collection1] o.a.s.r.ManagedResourceStorage Loaded null at path _rest_managed.json using ZooKeeperStorageIO:path=/configs/conf1
   [junit4]   2> 1191377 INFO  (coreLoadExecutor-4085-thread-1-processing-n:127.0.0.1:62374_ch%2Fb) [n:127.0.0.1:62374_ch%2Fb c:collection1   x:collection1] o.a.s.h.ReplicationHandler Commits will be reserved for  10000
   [junit4]   2> 1191379 INFO  (searcherExecutor-4086-thread-1-processing-n:127.0.0.1:62374_ch%2Fb x:collection1 c:collection1) [n:127.0.0.1:62374_ch%2Fb c:collection1   x:collection1] o.a.s.c.SolrCore [collection1] Registered new searcher Searcher@744bdc[collection1] main{ExitableDirectoryReader(UninvertingDirectoryReader())}
   [junit4]   2> 1191379 INFO  (coreLoadExecutor-4085-thread-1-processing-n:127.0.0.1:62374_ch%2Fb) [n:127.0.0.1:62374_ch%2Fb c:collection1   x:collection1] o.a.s.u.UpdateLog Could not find max version in index or recent updates, using new clock 1560488662479667200
   [junit4]   2> 1191392 INFO  (coreZkRegister-4080-thread-1-processing-n:127.0.0.1:62374_ch%2Fb x:collection1 c:collection1) [n:127.0.0.1:62374_ch%2Fb c:collection1 s:shard2 r:core_node1 x:collection1] o.a.s.c.ShardLeaderElectionContext Enough replicas found to continue.
   [junit4]   2> 1191392 INFO  (coreZkRegister-4080-thread-1-processing-n:127.0.0.1:62374_ch%2Fb x:collection1 c:collection1) [n:127.0.0.1:62374_ch%2Fb c:collection1 s:shard2 r:core_node1 x:collection1] o.a.s.c.ShardLeaderElectionContext I may be the new leader - try and sync
   [junit4]   2> 1191392 INFO  (coreZkRegister-4080-thread-1-processing-n:127.0.0.1:62374_ch%2Fb x:collection1 c:collection1) [n:127.0.0.1:62374_ch%2Fb c:collection1 s:shard2 r:core_node1 x:collection1] o.a.s.c.SyncStrategy Sync replicas to https://127.0.0.1:62374/ch/b/collection1/
   [junit4]   2> 1191392 INFO  (coreZkRegister-4080-thread-1-processing-n:127.0.0.1:62374_ch%2Fb x:collection1 c:collection1) [n:127.0.0.1:62374_ch%2Fb c:collection1 s:shard2 r:core_node1 x:collection1] o.a.s.c.SyncStrategy Sync Success - now sync replicas to me
   [junit4]   2> 1191392 INFO  (coreZkRegister-4080-thread-1-processing-n:127.0.0.1:62374_ch%2Fb x:collection1 c:collection1) [n:127.0.0.1:62374_ch%2Fb c:collection1 s:shard2 r:core_node1 x:collection1] o.a.s.c.SyncStrategy https://127.0.0.1:62374/ch/b/collection1/ has no replicas
   [junit4]   2> 1191392 INFO  (coreZkRegister-4080-thread-1-processing-n:127.0.0.1:62374_ch%2Fb x:collection1 c:collection1) [n:127.0.0.1:62374_ch%2Fb c:collection1 s:shard2 r:core_node1 x:collection1] o.a.s.c.ShardLeaderElectionContext Found all replicas participating in election, clear LIR
   [junit4]   2> 1191400 INFO  (coreZkRegister-4080-thread-1-processing-n:127.0.0.1:62374_ch%2Fb x:collection1 c:collection1) [n:127.0.0.1:62374_ch%2Fb c:collection1 s:shard2 r:core_node1 x:collection1] o.a.s.c.ShardLeaderElectionContext I am the new leader: https://127.0.0.1:62374/ch/b/collection1/ shard2
   [junit4]   2> 1191514 INFO  (zkCallback-2111-thread-1-processing-n:127.0.0.1:62374_ch%2Fb) [n:127.0.0.1:62374_ch%2Fb    ] o.a.s.c.c.ZkStateReader A cluster state change: [WatchedEvent state:SyncConnected type:NodeDataChanged path:/collections/collection1/state.json] for collection [collection1] has occurred - updating... (live nodes size: [2])
   [junit4]   2> 1191573 INFO  (coreZkRegister-4080-thread-1-processing-n:127.0.0.1:62374_ch%2Fb x:collection1 c:collection1) [n:127.0.0.1:62374_ch%2Fb c:collection1 s:shard2 r:core_node1 x:collection1] o.a.s.c.ZkController I am the leader, no recovery necessary
   [junit4]   2> 1191682 INFO  (zkCallback-2111-thread-1-processing-n:127.0.0.1:62374_ch%2Fb) [n:127.0.0.1:62374_ch%2Fb    ] o.a.s.c.c.ZkStateReader A cluster state change: [WatchedEvent state:SyncConnected type:NodeDataChanged path:/collections/collection1/state.json] for collection [collection1] has occurred - updating... (live nodes size: [2])
   [junit4]   2> 1191995 INFO  (TEST-TestRebalanceLeaders.test-seed#[4EFC9AB8E5863CC0]) [    ] o.a.s.SolrTestCaseJ4 Writing core.properties file to /Users/jenkins/workspace/Lucene-Solr-6.x-MacOSX/solr/build/solr-core/test/J1/temp/solr.cloud.TestRebalanceLeaders_4EFC9AB8E5863CC0-001/shard-2-001/cores/collection1
   [junit4]   2> 1191996 INFO  (TEST-TestRebalanceLeaders.test-seed#[4EFC9AB8E5863CC0]) [    ] o.a.s.c.AbstractFullDistribZkTestBase create jetty 2 in directory /Users/jenkins/workspace/Lucene-Solr-6.x-MacOSX/solr/build/solr-core/test/J1/temp/solr.cloud.TestRebalanceLeaders_4EFC9AB8E5863CC0-001/shard-2-001
   [junit4]   2> 1191998 INFO  (TEST-TestRebalanceLeaders.test-seed#[4EFC9AB8E5863CC0]) [    ] o.e.j.s.Server jetty-9.3.14.v20161028
   [junit4]   2> 1192001 INFO  (TEST-TestRebalanceLeaders.test-seed#[4EFC9AB8E5863CC0]) [    ] o.e.j.s.h.ContextHandler Started o.e.j.s.ServletContextHandler@3ab08e86{/ch/b,null,AVAILABLE}
   [junit4]   2> 1192003 INFO  (TEST-TestRebalanceLeaders.test-seed#[4EFC9AB8E5863CC0]) [    ] o.e.j.s.AbstractConnector Started ServerConnector@53aace4f{SSL,[ssl, http/1.1]}{127.0.0.1:62381}
   [junit4]   2> 1192003 INFO  (TEST-TestRebalanceLeaders.test-seed#[4EFC9AB8E5863CC0]) [    ] o.e.j.s.Server Started @1197446ms
   [junit4]   2> 1192003 INFO  (TEST-TestRebalanceLeaders.test-seed#[4EFC9AB8E5863CC0]) [    ] o.a.s.c.s.e.JettySolrRunner Jetty properties: {solr.data.dir=/Users/jenkins/workspace/Lucene-Solr-6.x-MacOSX/solr/build/solr-core/test/J1/temp/solr.cloud.TestRebalanceLeaders_4EFC9AB8E5863CC0-001/tempDir-001/jetty2, solrconfig=solrconfig.xml, hostContext=/ch/b, hostPort=62381, coreRootDirectory=/Users/jenkins/workspace/Lucene-Solr-6.x-MacOSX/solr/build/solr-core/test/J1/../../../../../../../../../Users/jenkins/workspace/Lucene-Solr-6.x-MacOSX/solr/build/solr-core/test/J1/temp/solr.cloud.TestRebalanceLeaders_4EFC9AB8E5863CC0-001/shard-2-001/cores}
   [junit4]   2> 1192004 ERROR (TEST-TestRebalanceLeaders.test-seed#[4EFC9AB8E5863CC0]) [    ] o.a.s.s.StartupLoggingUtils Missing Java Option solr.log.dir. Logging may be missing or incomplete.
   [junit4]   2> 1192004 INFO  (TEST-TestRebalanceLeaders.test-seed#[4EFC9AB8E5863CC0]) [    ] o.a.s.s.SolrDispatchFilter  ___      _       Welcome to Apache Solr? version 6.5.0
   [junit4]   2> 1192004 INFO  (TEST-TestRebalanceLeaders.test-seed#[4EFC9AB8E5863CC0]) [    ] o.a.s.s.SolrDispatchFilter / __| ___| |_ _   Starting in cloud mode on port null
   [junit4]   2> 1192004 INFO  (TEST-TestRebalanceLeaders.test-seed#[4EFC9AB8E5863CC0]) [    ] o.a.s.s.SolrDispatchFilter \__ \/ _ \ | '_|  Install dir: null
   [junit4]   2> 1192004 INFO  (TEST-TestRebalanceLeaders.test-seed#[4EFC9AB8E5863CC0]) [    ] o.a.s.s.SolrDispatchFilter |___/\___/_|_|    Start time: 2017-02-27T12:19:19.075Z
   [junit4]   2> 1192009 INFO  (TEST-TestRebalanceLeaders.test-seed#[4EFC9AB8E5863CC0]) [    ] o.a.s.s.SolrDispatchFilter Loading solr.xml from SolrHome (not found in ZooKeeper)
   [junit4]   2> 1192009 INFO  (TEST-TestRebalanceLeaders.test-seed#[4EFC9AB8E5863CC0]) [    ] o.a.s.c.SolrXmlConfig Loading container configuration from /Users/jenkins/workspace/Lucene-Solr-6.x-MacOSX/solr/build/solr-core/test/J1/temp/solr.cloud.TestRebalanceLeaders_4EFC9AB8E5863CC0-001/shard-2-001/solr.xml
   [junit4]   2> 1192019 INFO  (TEST-TestRebalanceLeaders.test-seed#[4EFC9AB8E5863CC0]) [    ] o.a.s.u.UpdateShardHandler Creating UpdateShardHandler HTTP client with params: socketTimeout=340000&connTimeout=45000&retry=true
   [junit4]   2> 1192020 INFO  (TEST-TestRebalanceLeaders.test-seed#[4EFC9AB8E5863CC0]) [    ] o.a.s.c.ZkContainer Zookeeper client=127.0.0.1:62364/solr
   [junit4]   2> 1192041 INFO  (TEST-TestRebalanceLeaders.test-seed#[4EFC9AB8E5863CC0]) [n:127.0.0.1:62381_ch%2Fb    ] o.a.s.c.c.ZkStateReader Updated live nodes from ZooKeeper... (0) -> (2)
   [junit4]   2> 1192046 INFO  (TEST-TestRebalanceLeaders.test-seed#[4EFC9AB8E5863CC0]) [n:127.0.0.1:62381_ch%2Fb    ] o.a.s.c.Overseer Overseer (id=null) closing
   [junit4]   2> 1192052 INFO  (TEST-TestRebalanceLeaders.test-seed#[4EFC9AB8E5863CC0]) [n:127.0.0.1:62381_ch%2Fb    ] o.a.s.c.ZkController Register node as live in ZooKeeper:/live_nodes/127.0.0.1:62381_ch%2Fb
   [junit4]   2> 1192055 INFO  (zkCallback-2105-thread-1) [    ] o.a.s.c.c.ZkStateReader Updated live nodes from ZooKeeper... (2) -> (3)
   [junit4]   2> 1192056 INFO  (zkCallback-2117-thread-1-processing-n:127.0.0.1:62381_ch%2Fb) [n:127.0.0.1:62381_ch%2Fb    ] o.a.s.c.c.ZkStateReader Updated live nodes from ZooKeeper... (2) -> (3)
   [junit4]   2> 1192055 INFO  (zkCallback-2111-thread-1-processing-n:127.0.0.1:62374_ch%2Fb) [n:127.0.0.1:62374_ch%2Fb    ] o.a.s.c.c.ZkStateReader Updated live nodes from ZooKeeper... (2) -> (3)
   [junit4]   2> 1192055 INFO  (zkCallback-2101-thread-1-processing-n:127.0.0.1:62368_ch%2Fb) [n:127.0.0.1:62368_ch%2Fb    ] o.a.s.c.c.ZkStateReader Updated live nodes from ZooKeeper... (2) -> (3)
   [junit4]   2> 1192166 INFO  (TEST-TestRebalanceLeaders.test-seed#[4EFC9AB8E5863CC0]) [n:127.0.0.1:62381_ch%2Fb    ] o.a.s.c.CorePropertiesLocator Found 1 core definitions underneath /Users/jenkins/workspace/Lucene-Solr-6.x-MacOSX/solr/build/solr-core/test/J1/../../../../../../../../../Users/jenkins/workspace/Lucene-Solr-6.x-MacOSX/solr/build/solr-core/test/J1/temp/solr.cloud.TestRebalanceLeaders_4EFC9AB8E5863CC0-001/shard-2-001/cores
   [junit4]   2> 1192166 INFO  (TEST-TestRebalanceLeaders.test-seed#[4EFC9AB8E5863CC0]) [n:127.0.0.1:62381_ch%2Fb    ] o.a.s.c.CorePropertiesLocator Cores are: [collection1]
   [junit4]   2> 1192170 INFO  (zkCallback-2111-thread-1-processing-n:127.0.0.1:62374_ch%2Fb) [n:127.0.0.1:62374_ch%2Fb    ] o.a.s.c.c.ZkStateReader A cluster state change: [WatchedEvent state:SyncConnected type:NodeDataChanged path:/collections/collection1/state.json] for collection [collection1] has occurred - updating... (live nodes size: [3])
   [junit4]   2> 1192176 INFO  (OverseerStateUpdate-97530541108494341-127.0.0.1:62368_ch%2Fb-n_0000000000) [n:127.0.0.1:62368_ch%2Fb    ] o.a.s.c.o.ReplicaMutator Assigning new node to shard shard=shard3
   [junit4]   2> 1192283 INFO  (zkCallback-2111-thread-1-processing-n:127.0.0.1:62374_ch%2Fb) [n:127.0.0.1:62374_ch%2Fb    ] o.a.s.c.c.ZkStateReader A cluster state change: [WatchedEvent state:SyncConnected type:NodeDataChanged path:/collections/collection1/state.json] for collection [collection1] has occurred - updating... (live nodes size: [3])
   [junit4]   2> 1192283 INFO  (zkCallback-2117-thread-1-processing-n:127.0.0.1:62381_ch%2Fb) [n:127.0.0.1:62381_ch%2Fb    ] o.a.s.c.c.ZkStateReader A cluster state change: [WatchedEvent state:SyncConnected type:NodeDataChanged path:/collections/collection1/state.json] for collection [collection1] has occurred - updating... (live nodes size: [3])
   [junit4]   2> 1193195 WARN  (coreLoadExecutor-4096-thread-1-processing-n:127.0.0.1:62381_ch%2Fb) [n:127.0.0.1:62381_ch%2Fb c:collection1   x:collection1] o.a.s.c.Config Beginning with Solr 5.5, <mergePolicy> is deprecated, use <mergePolicyFactory> instead.
   [junit4]   2> 1193196 INFO  (coreLoadExecutor-4096-thread-1-processing-n:127.0.0.1:62381_ch%2Fb) [n:127.0.0.1:62381_ch%2Fb c:collection1   x:collection1] o.a.s.c.SolrConfig Using Lucene MatchVersion: 6.5.0
   [junit4]   2> 1193210 INFO  (coreLoadExecutor-4096-thread-1-processing-n:127.0.0.1:62381_ch%2Fb) [n:127.0.0.1:62381_ch%2Fb c:collection1   x:collection1] o.a.s.s.IndexSchema [collection1] Schema name=test
   [junit4]   2> 1193290 WARN  (coreLoadExecutor-4096-thread-1-processing-n:127.0.0.1:62381_ch%2Fb) [n:127.0.0.1:62381_ch%2Fb c:collection1   x:collection1] o.a.s.s.IndexSchema [collection1] default search field in schema is text. WARNING: Deprecated, please use 'df' on request instead.
   [junit4]   2> 1193291 INFO  (coreLoadExecutor-4096-thread-1-processing-n:127.0.0.1:62381_ch%2Fb) [n:127.0.0.1:62381_ch%2Fb c:collection1   x:collection1] o.a.s.s.IndexSchema Loaded schema test/1.6 with uniqueid field id
   [junit4]   2> 1193328 INFO  (coreLoadExecutor-4096-thread-1-processing-n:127.0.0.1:62381_ch%2Fb) [n:127.0.0.1:62381_ch%2Fb c:collection1   x:collection1] o.a.s.c.CoreContainer Creating SolrCore 'collection1' using configuration from collection collection1
   [junit4]   2> 1193328 INFO  (coreLoadExecutor-4096-thread-1-processing-n:127.0.0.1:62381_ch%2Fb) [n:127.0.0.1:62381_ch%2Fb c:collection1   x:collection1] o.a.s.c.SolrCore [[collection1] ] Opening new SolrCore at [/Users/jenkins/workspace/Lucene-Solr-6.x-MacOSX/solr/build/solr-core/test/J1/temp/solr.cloud.TestRebalanceLeaders_4EFC9AB8E5863CC0-001/shard-2-001/cores/collection1], dataDir=[/Users/jenkins/workspace/Lucene-Solr-6.x-MacOSX/solr/build/solr-core/test/J1/../../../../../../../../../Users/jenkins/workspace/Lucene-Solr-6.x-MacOSX/solr/build/solr-core/test/J1/temp/solr.cloud.TestRebalanceLeaders_4EFC9AB8E5863CC0-001/shard-2-001/cores/collection1/data/]
   [junit4]   2> 1193328 INFO  (coreLoadExecutor-4096-thread-1-processing-n:127.0.0.1:62381_ch%2Fb) [n:127.0.0.1:62381_ch%2Fb c:collection1   x:collection1] o.a.s.c.JmxMonitoredMap JMX monitoring is enabled. Adding Solr mbeans to JMX Server: com.sun.jmx.mbeanserver.JmxMBeanServer@103b52e4
   [junit4]   2> 1193329 INFO  (coreLoadExecutor-4096-thread-1-processing-n:127.0.0.1:62381_ch%2Fb) [n:127.0.0.1:62381_ch%2Fb c:collection1   x:collection1] o.a.s.u.RandomMergePolicy RandomMergePolicy wrapping class org.apache.lucene.index.LogByteSizeMergePolicy: [LogByteSizeMergePolicy: minMergeSize=1677721, mergeFactor=47, maxMergeSize=2147483648, maxMergeSizeForForcedMerge=9223372036854775807, calibrateSizeByDeletes=false, maxMergeDocs=2147483647, maxCFSSegmentSizeMB=8.796093022207999E12, noCFSRatio=0.7786661977038518]
   [junit4]   2> 1193336 WARN  (coreLoadExecutor-4096-thread-1-processing-n:127.0.0.1:62381_ch%2Fb) [n:127.0.0.1:62381_ch%2Fb c:collection1   x:collection1] o.a.s.c.RequestHandlers INVALID paramSet a in requestHandler {type = requestHandler,name = /dump,class = DumpRequestHandler,attributes = {initParams=a, name=/dump, class=DumpRequestHandler},args = {defaults={a=A,b=B}}}
   [junit4]   2> 1193420 INFO  (coreLoadExecutor-4096-thread-1-processing-n:127.0.0.1:62381_ch%2Fb) [n:127.0.0.1:62381_ch%2Fb c:collection1   x:collection1] o.a.s.u.UpdateHandler Using UpdateLog implementation: org.apache.solr.update.UpdateLog
   [junit4]   2> 1193420 INFO  (coreLoadExecutor-4096-thread-1-processing-n:127.0.0.1:62381_ch%2Fb) [n:127.0.0.1:62381_ch%2Fb c:collection1   x:collection1] o.a.s.u.UpdateLog Initializing UpdateLog: dataDir= defaultSyncLevel=FLUSH numRecordsToKeep=100 maxNumLogsToKeep=10 numVersionBuckets=65536
   [junit4]   2> 1193421 INFO  (coreLoadExecutor-4096-thread-1-processing-n:127.0.0.1:62381_ch%2Fb) [n:127.0.0.1:62381_ch%2Fb c:collection1   x:collection1] o.a.s.u.CommitTracker Hard AutoCommit: disabled
   [junit4]   2> 1193421 INFO  (coreLoadExecutor-4096-thread-1-processing-n:127.0.0.1:62381_ch%2Fb) [n:127.0.0.1:62381_ch%2Fb c:collection1   x:collection1] o.a.s.u.CommitTracker Soft AutoCommit: disabled
   [junit4]   2> 1193422 INFO  (coreLoadExecutor-4096-thread-1-processing-n:127.0.0.1:62381_ch%2Fb) [n:127.0.0.1:62381_ch%2Fb c:collection1   x:collection1] o.a.s.u.RandomMergePolicy RandomMergePolicy wrapping class org.apache.lucene.index.TieredMergePolicy: [TieredMergePolicy: maxMergeAtOnce=19, maxMergeAtOnceExplicit=16, maxMergedSegmentMB=65.3115234375, floorSegmentMB=1.1455078125, forceMergeDeletesPctAllowed=13.442886366518048, segmentsPerTier=24.0, maxCFSSegmentSizeMB=8.796093022207999E12, noCFSRatio=0.0
   [junit4]   2> 1193428 INFO  (coreLoadExecutor-4096-thread-1-processing-n:127.0.0.1:62381_ch%2Fb) [n:127.0.0.1:62381_ch%2Fb c:collection1   x:collection1] o.a.s.s.SolrIndexSearcher Opening [Searcher@3943cf89[collection1] main]
   [junit4]   2> 1193431 INFO  (coreLoadExecutor-4096-thread-1-processing-n:127.0.0.1:62381_ch%2Fb) [n:127.0.0.1:62381_ch%2Fb c:collection1   x:collection1] o.a.s.r.ManagedResourceStorage Configured ZooKeeperStorageIO with znodeBase: /configs/conf1
   [junit4]   2> 1193431 INFO  (coreLoadExecutor-4096-thread-1-processing-n:127.0.0.1:62381_ch%2Fb) [n:127.0.0.1:62381_ch%2Fb c:collection1   x:collection1] o.a.s.r.ManagedResourceStorage Loaded null at path _rest_managed.json using ZooKeeperStorageIO:path=/configs/conf1
   [junit4]   2> 1193431 INFO  (coreLoadExecutor-4096-thread-1-processing-n:127.0.0.1:62381_ch%2Fb) [n:127.0.0.1:62381_ch%2Fb c:collection1   x:collection1] o.a.s.h.ReplicationHandler Commits will be reserved for  10000
   [junit4]   2> 1193432 INFO  (searcherExecutor-4097-thread-1-processing-n:127.0.0.1:62381_ch%2Fb x:collection1 c:collection1) [n:127.0.0.1:62381_ch%2Fb c:collection1   x:collection1] o.a.s.c.SolrCore [collection1] Registered new searcher Searcher@3943cf89[collection1] main{ExitableDirectoryReader(UninvertingDirectoryReader())}
   [junit4]   2> 1193434 INFO  (coreLoadExecutor-4096-thread-1-processing-n:127.0.0.1:62381_ch%2Fb) [n:127.0.0.1:62381_ch%2Fb c:collection1   x:collection1] o.a.s.u.UpdateLog Could not find max version in index or recent updates, using new clock 1560488664634490880
   [junit4]   2> 1193446 INFO  (coreZkRegister-4091-thread-1-processing-n:127.0.0.1:62381_ch%2Fb x:collection1 c:collection1) [n:127.0.0.1:62381_ch%2Fb c:collection1 s:shard3 r:core_node2 x:collection1] o.a.s.c.ShardLeaderElectionContext Enough replicas found to continue.
   [junit4]   2> 1193446 INFO  (coreZkRegister-4091-thread-1-processing-n:127.0.0.1:62381_ch%2Fb x:collection1 c:collection1) [n:127.0.0.1:62381_ch%2Fb c:collection1 s:shard3 r:core_node2 x:collection1] o.a.s.c.ShardLeaderElectionContext I may be the new leader - try and sync
   [junit4]   2> 1193446 INFO  (coreZkRegister-4091-thread-1-processing-n:127.0.0.1:62381_ch%2Fb x:collection1 c:collection1) [n:127.0.0.1:62381_ch%2Fb c:collection1 s:shard3 r:core_node2 x:collection1] o.a.s.c.SyncStrategy Sync replicas to https://127.0.0.1:62381/ch/b/collection1/
   [junit4]   2> 1193446 INFO  (coreZkRegister-4091-thread-1-processing-n:127.0.0.1:62381_ch%2Fb x:collection1 c:collection1) [n:127.0.0.1:62381_ch%2Fb c:collection1 s:shard3 r:core_node2 x:collection1] o.a.s.c.SyncStrategy Sync Success - now sync replicas to me
   [junit4]   2> 1193446 INFO  (coreZkRegister-4091-thread-1-processing-n:127.0.0.1:62381_ch%2Fb x:collection1 c:collection1) [n:127.0.0.1:62381_ch%2Fb c:collection1 s:shard3 r:core_node2 x:collection1] o.a.s.c.SyncStrategy https://127.0.0.1:62381/ch/b/collection1/ has no replicas
   [junit4]   2> 1193446 INFO  (coreZkRegister-4091-thread-1-processing-n:127.0.0.1:62381_ch%2Fb x:collection1 c:collection1) [n:127.0.0.1:62381_ch%2Fb c:collection1 s:shard3 r:core_node2 x:collection1] o.a.s.c.ShardLeaderElectionContext Found all replicas participating in election, clear LIR
   [junit4]   2> 1193453 INFO  (coreZkRegister-4091-thread-1-processing-n:127.0.0.1:62381_ch%2Fb x:collection1 c:collection1) [n:127.0.0.1:62381_ch%2Fb c:collection1 s:shard3 r:core_node2 x:collection1] o.a.s.c.ShardLeaderElectionContext I am the new leader: https://127.0.0.1:62381/ch/b/collection1/ shard3
   [junit4]   2> 1193567 INFO  (zkCallback-2111-thread-1-processing-n:127.0.0.1:62374_ch%2Fb) [n:127.0.0.1:62374_ch%2Fb    ] o.a.s.c.c.ZkStateReader A cluster state change: [WatchedEvent state:SyncConnected type:NodeDataChanged path:/collections/collection1/state.json] for collection [collection1] has occurred - updating... (live nodes size: [3])
   [junit4]   2> 1193567 INFO  (zkCallback-2117-thread-1-processing-n:127.0.0.1:62381_ch%2Fb) [n:127.0.0.1:62381_ch%2Fb    ] o.a.s.c.c.ZkStateReader A cluster state change: [WatchedEvent state:SyncConnected type:NodeDataChanged path:/collections/collection1/state.json] for collection [collection1] has occurred - updating... (live nodes size: [3])
   [junit4]   2> 1193610 INFO  (coreZkRegister-4091-thread-1-processing-n:127.0.0.1:62381_ch%2Fb x:collection1 c:collection1) [n:127.0.0.1:62381_ch%2Fb c:collection1 s:shard3 r:core_node2 x:collection1] o.a.s.c.ZkController I am the leader, no recovery necessary
   [junit4]   2> 1193720 INFO  (zkCallback-2111-thread-1-processing-n:127.0.0.1:62374_ch%2Fb) [n:127.0.0.1:62374_ch%2Fb    ] o.a.s.c.c.ZkStateReader A cluster state change: [WatchedEvent state:SyncConnected type:NodeDataChanged path:/collections/collection1/state.json] for collection [collection1] has occurred - updating... (live nodes size: [3])
   [junit4]   2> 1193720 INFO  (zkCallback-2117-thread-1-processing-n:127.0.0.1:62381_ch%2Fb) [n:127.0.0.1:62381_ch%2Fb    ] o.a.s.c.c.ZkStateReader A cluster state change: [WatchedEvent state:SyncConnected type:NodeDataChanged path:/collections/collection1/state.json] for collection [collection1] has occurred - updating... (live nodes size: [3])
   [junit4]   2> 1193909 INFO  (TEST-TestRebalanceLeaders.test-seed#[4EFC9AB8E5863CC0]) [    ] o.a.s.SolrTestCaseJ4 Writing core.properties file to /Users/jenkins/workspace/Lucene-Solr-6.x-MacOSX/solr/build/solr-core/test/J1/temp/solr.cloud.TestRebalanceLeaders_4EFC9AB8E5863CC0-001/shard-3-001/cores/collection1
   [junit4]   2> 1193912 INFO  (TEST-TestRebalanceLeaders.test-seed#[4EFC9AB8E5863CC0]) [    ] o.a.s.c.AbstractFullDistribZkTestBase create jetty 3 in directory /Users/jenkins/workspace/Lucene-Solr-6.x-MacOSX/solr/build/solr-core/test/J1/temp/solr.cloud.TestRebalanceLeaders_4EFC9AB8E5863CC0-001/shard-3-001
   [junit4]   2> 1193914 INFO  (TEST-TestRebalanceLeaders.test-seed#[4EFC9AB8E5863CC0]) [    ] o.e.j.s.Server jetty-9.3.14.v20161028
   [junit4]   2> 1193920 INFO  (TEST-TestRebalanceLeaders.test-seed#[4EFC9AB8E5863CC0]) [    ] o.e.j.s.h.ContextHandler Started o.e.j.s.ServletContextHandler@8f4cff6{/ch/b,null,AVAILABLE}
   [junit4]   2> 1193920 INFO  (TEST-TestRebalanceLeaders.test-seed#[4EFC9AB8E5863CC0]) [    ] o.e.j.s.AbstractConnector Started ServerConnector@718c7aaf{SSL,[ssl, http/1.1]}{127.0.0.1:62386}
   [junit4]   2> 1193920 INFO  (TEST-TestRebalanceLeaders.test-seed#[4EFC9AB8E5863CC0]) [    ] o.e.j.s.Server Started @1199364ms
   [junit4]   2> 1193921 INFO  (TEST-TestRebalanceLeaders.test-seed#[4EFC9AB8E5863CC0]) [    ] o.a.s.c.s.e.JettySolrRunner Jetty properties: {solr.data.dir=/Users/jenkins/workspace/Lucene-Solr-6.x-MacOSX/solr/build/solr-core/test/J1/temp/solr.cloud.TestRebalanceLeaders_4EFC9AB8E5863CC0-001/tempDir-001/jetty3, solrconfig=solrconfig.xml, hostContext=/ch/b, hostPort=62386, coreRootDirectory=/Users/jenkins/workspace/Lucene-Solr-6.x-MacOSX/solr/build/solr-core/test/J1/temp/solr.cloud.TestRebalanceLeaders_4EFC9AB8E5863CC0-001/shard-3-001/cores}
   [junit4]   2> 1193922 ERROR (TEST-TestRebalanceLeaders.test-seed#[4EFC9AB8E5863CC0]) [    ] o.a.s.s.StartupLoggingUtils Missing Java Option solr.log.dir. Logging may be missing or incomplete.
   [junit4]   2> 1193923 INFO  (TEST-TestRebalanceLeaders.test-seed#[4EFC9AB8E5863CC0]) [    ] o.a.s.s.SolrDispatchFilter  ___      _       Welcome to Apache Solr? version 6.5.0
   [junit4]   2> 1193923 INFO  (TEST-TestRebalanceLeaders.test-seed#[4EFC9AB8E5863CC0]) [    ] o.a.s.s.SolrDispatchFilter / __| ___| |_ _   Starting in cloud mode on port null
   [junit4]   2> 1193923 INFO  (TEST-TestRebalanceLeaders.test-seed#[4EFC9AB8E5863CC0]) [    ] o.a.s.s.SolrDispatchFilter \__ \/ _ \ | '_|  Install dir: null
   [junit4]   2> 1193923 INFO  (TEST-TestRebalanceLeaders.test-seed#[4EFC9AB8E5863CC0]) [    ] o.a.s.s.SolrDispatchFilter |___/\___/_|_|    Start time: 2017-02-27T12:19:20.994Z
   [junit4]   2> 1193928 INFO  (TEST-TestRebalanceLeaders.test-seed#[4EFC9AB8E5863CC0]) [    ] o.a.s.s.SolrDispatchFilter Loading solr.xml from SolrHome (not found in ZooKeeper)
   [junit4]   2> 1193928 INFO  (TEST-TestRebalanceLeaders.test-seed#[4EFC9AB8E5863CC0]) [    ] o.a.s.c.SolrXmlConfig Loading container configuration from /Users/jenkins/workspace/Lucene-Solr-6.x-MacOSX/solr/build/solr-core/test/J1/temp/solr.cloud.TestRebalanceLeaders_4EFC9AB8E5863CC0-001/shard-3-001/solr.xml
   [junit4]   2> 1193941 INFO  (TEST-TestRebalanceLeaders.test-seed#[4EFC9AB8E5863CC0]) [    ] o.a.s.u.UpdateShardHandler Creating UpdateShardHandler HTTP client with params: socketTimeout=340000&connTimeout=45000&retry=true
   [junit4]   2> 1193942 INFO  (TEST-TestRebalanceLeaders.test-seed#[4EFC9AB8E5863CC0]) [    ] o.a.s.c.ZkContainer Zookeeper client=127.0.0.1:62364/solr
   [junit4]   2> 1193962 INFO  (TEST-TestRebalanceLeaders.test-seed#[4EFC9AB8E5863CC0]) [n:127.0.0.1:62386_ch%2Fb    ] o.a.s.c.c.ZkStateReader Updated live nodes from ZooKeeper... (0) -> (3)
   [junit4]   2> 1193968 INFO  (TEST-TestRebalanceLeaders.test-seed#[4EFC9AB8E5863CC0]) [n:127.0.0.1:62386_ch%2Fb    ] o.a.s.c.Overseer Overseer (id=null) closing
   [junit4]   2> 1193973 INFO  (TEST-TestRebalanceLeaders.test-seed#[4EFC9AB8E5863CC0]) [n:127.0.0.1:62386_ch%2Fb    ] o.a.s.c.ZkController Register node as live in ZooKeeper:/live_nodes/127.0.0.1:62386_ch%2Fb
   [junit4]   2> 1193976 INFO  (zkCallback-2105-thread-1) [    ] o.a.s.c.c.ZkStateReader Updated live nodes from ZooKeeper... (3) -> (4)
   [junit4]   2> 1193977 INFO  (zkCallback-2123-thread-1-processing-n:127.0.0.1:62386_ch%2Fb) [n:127.0.0.1:62386_ch%2Fb    ] o.a.s.c.c.ZkStateReader Updated live nodes from ZooKeeper... (3) -> (4)
   [junit4]   2> 1193976 INFO  (zkCallback-2101-thread-3-processing-n:127.0.0.1:62368_ch%2Fb) [n:127.0.0.1:62368_ch%2Fb    ] o.a.s.c.c.ZkStateReader Updated live nodes from ZooKeeper... (3) -> (4)
   [junit4]   2> 1193976 INFO  (zkCallback-2117-thread-1-processing-n:127.0.0.1:62381_ch%2Fb) [n:127.0.0.1:62381_ch%2Fb    ] o.a.s.c.c.ZkStateReader Updated live nodes from ZooKeeper... (3) -> (4)
   [junit4]   2> 1193976 INFO  (zkCallback-2111-thread-1-processing-n:127.0.0.1:62374_ch%2Fb) [n:127.0.0.1:62374_ch%2Fb    ] o.a.s.c.c.ZkStateReader Updated live nodes from ZooKeeper... (3) -> (4)
   [junit4]   2> 1194087 INFO  (zkCallback-2111-thread-2-processing-n:127.0.0.1:62374_ch%2Fb) [n:127.0.0.1:62374_ch%2Fb    ] o.a.s.c.c.ZkStateReader A cluster state change: [WatchedEvent state:SyncConnected type:NodeDataChanged path:/collections/collection1/state.json] for collection [collection1] has occurred - updating... (live nodes size: [4])
   [junit4]   2> 1194087 INFO  (zkCallback-2117-thread-1-processing-n:127.0.0.1:62381_ch%2Fb) [n:127.0.0.1:62381_ch%2Fb    ] o.a.s.c.c.ZkStateReader A cluster state change: [WatchedEvent state:SyncConnected type:NodeDataChanged path:/collections/collection1/state.json] for collection [collection1] has occurred - updating... (live nodes size: [4])
   [junit4]   2> 1194143 INFO  (TEST-TestRebalanceLeaders.test-seed#[4EFC9AB8E5863CC0]) [n:127.0.0.1:62386_ch%2Fb    ] o.a.s.c.CorePropertiesLocator Found 1 core definitions underneath /Users/jenkins/workspace/Lucene-Solr-6.x-MacOSX/solr/build/solr-core/test/J1/temp/solr.cloud.TestRebalanceLeaders_4EFC9AB8E5863CC0-001/shard-3-001/cores
   [junit4]   2> 1194143 INFO  (TEST-TestRebalanceLeaders.test-seed#[4EFC9AB8E5863CC0]) [n:127.0.0.1:62386_ch%2Fb    ] o.a.s.c.CorePropertiesLocator Cores are: [collection1]
   [junit4]   2> 1194147 INFO  (OverseerStateUpdate-97530541108494341-127.0.0.1:62368_ch%2Fb-n_0000000000) [n:127.0.0.1:62368_ch%2Fb    ] o.a.s.c.o.ReplicaMutator Assigning new node to shard shard=shard4
   [junit4]   2> 1194264 INFO  (zkCallback-2123-thread-1-processing-n:127.0.0.1:62386_ch%2Fb) [n:127.0.0.1:62386_ch%2Fb    ] o.a.s.c.c.ZkStateReader A cluster state change: [WatchedEvent state:SyncConnected type:NodeDataChanged path:/collections/collection1/state.json] for collection [collection1] has occurred - updating... (live nodes size: [4])
   [junit4]   2> 1194264 INFO  (zkCallback-2111-thread-2-processing-n:127.0.0.1:62374_ch%2Fb) [n:127.0.0.1:62374_ch%2Fb    ] o.a.s.c.c.ZkStateReader A cluster state change: [WatchedEvent state:SyncConnected type:NodeDataChanged path:/collections/collection1/state.json] for collection [collection1] has occurred - updating... (live nodes size: [4])
   [junit4]   2> 1194264 INFO  (zkCallback-2117-thread-1-processing-n:127.0.0.1:62381_ch%2Fb) [n:127.0.0.1:62381_ch%2Fb    ] o.a.s.c.c.ZkStateReader A cluster state change: [WatchedEvent state:SyncConnected type:NodeDataChanged path:/collections/collection1/state.json] for collection [collection1] has occurred - updating... (live nodes size: [4])
   [junit4]   2> 1195166 WARN  (coreLoadExecutor-4107-thread-1-processing-n:127.0.0.1:62386_ch%2Fb) [n:127.0.0.1:62386_ch%2Fb c:collection1   x:collection1] o.a.s.c.Config Beginning with Solr 5.5, <mergePolicy> is deprecated, use <mergePolicyFactory> instead.
   [junit4]   2> 1195167 INFO  (coreLoadExecutor-4107-thread-1-processing-n:127.0.0.1:62386_ch%2Fb) [n:127.0.0.1:62386_ch%2Fb c:collection1   x:collection1] o.a.s.c.SolrConfig Using Lucene MatchVersion: 6.5.0
   [junit4]   2> 1195185 INFO  (coreLoadExecutor-4107-thread-1-processing-n:127.0.0.1:62386_ch%2Fb) [n:127.0.0.1:62386_ch%2Fb c:collection1   x:collection1] o.a.s.s.IndexSchema [collection1] Schema name=test
   [junit4]   2> 1195277 WARN  (coreLoadExecutor-4107-thread-1-processing-n:127.0.0.1:62386_ch%2Fb) [n:127.0.0.1:62386_ch%2Fb c:collection1   x:collection1] o.a.s.s.IndexSchema [collection1] default search field in schema is text. WARNING: Deprecated, please use 'df' on request instead.
   [junit4]   2> 1195278 INFO  (coreLoadExecutor-4107-thread-1-processing-n:127.0.0.1:62386_ch%2Fb) [n:127.0.0.1:62386_ch%2Fb c:collection1   x:collection1] o.a.s.s.IndexSchema Loaded schema test/1.6 with uniqueid field id
   [junit4]   2> 1195309 INFO  (coreLoadExecutor-4107-thread-1-processing-n:127.0.0.1:62386_ch%2Fb) [n:127.0.0.1:62386_ch%2Fb c:collection1   x:collection1] o.a.s.c.CoreContainer Creating SolrCore 'collection1' using configuration from collection collection1
   [junit4]   2> 1195310 INFO  (coreLoadExecutor-4107-thread-1-processing-n:127.0.0.1:62386_ch%2Fb) [n:127.0.0.1:62386_ch%2Fb c:collection1   x:collection1] o.a.s.c.SolrCore [[collection1] ] Opening new SolrCore at [/Users/jenkins/workspace/Lucene-Solr-6.x-MacOSX/solr/build/solr-core/test/J1/temp/solr.cloud.TestRebalanceLeaders_4EFC9AB8E5863CC0-001/shard-3-001/cores/collection1], dataDir=[/Users/jenkins/workspace/Lucene-Solr-6.x-MacOSX/solr/build/solr-core/test/J1/temp/solr.cloud.TestRebalanceLeaders_4EFC9AB8E5863CC0-001/shard-3-001/cores/collection1/data/]
   [junit4]   2> 1195310 INFO  (coreLoadExecutor-4107-thread-1-processing-n:127.0.0.1:62386_ch%2Fb) [n:127.0.0.1:62386_ch%2Fb c:collection1   x:collection1] o.a.s.c.JmxMonitoredMap JMX monitoring is enabled. Adding Solr mbeans to JMX Server: com.sun.jmx.mbeanserver.JmxMBeanServer@103b52e4
   [junit4]   2> 1195311 INFO  (coreLoadExecutor-4107-thread-1-processing-n:127.0.0.1:62386_ch%2Fb) [n:127.0.0.1:62386_ch%2Fb c:collection1   x:collection1] o.a.s.u.RandomMergePolicy RandomMergePolicy wrapping class org.apache.lucene.index.LogByteSizeMergePolicy: [LogByteSizeMergePolicy: minMergeSize=1677721, mergeFactor=47, maxMergeSize=2147483648, maxMergeSizeForForcedMerge=9223372036854775807, calibrateSizeByDeletes=false, maxMergeDocs=2147483647, maxCFSSegmentSizeMB=8.796093022207999E12, noCFSRatio=0.7786661977038518]
   [junit4]   2> 1195319 WARN  (coreLoadExecutor-4107-thread-1-processing-n:127.0.0.1:62386_ch%2Fb) [n:127.0.0.1:62386_ch%2Fb c:collection1   x:collection1] o.a.s.c.RequestHandlers INVALID paramSet a in requestHandler {type = requestHandler,name = /dump,class = DumpRequestHandler,attributes = {initParams=a, name=/dump, class=DumpRequestHandler},args = {defaults={a=A,b=B}}}
   [junit4]   2> 1195416 INFO  (coreLoadExecutor-4107-thread-1-processing-n:127.0.0.1:62386_ch%2Fb) [n:127.0.0.1:62386_ch%2Fb c:collection1   x:collection1] o.a.s.u.UpdateHandler Using UpdateLog implementation: org.apache.solr.update.UpdateLog
   [junit4]   2> 1195417 INFO  (coreLoadExecutor-4107-thread-1-processing-n:127.0.0.1:62386_ch%2Fb) [n:127.0.0.1:62386_ch%2Fb c:collection1   x:collection1] o.a.s.u.UpdateLog Initializing UpdateLog: dataDir= defaultSyncLevel=FLUSH numRecordsToKeep=100 maxNumLogsToKeep=10 numVersionBuckets=65536
   [junit4]   2> 1195418 INFO  (coreLoadExecutor-4107-thread-1-processing-n:127.0.0.1:62386_ch%2Fb) [n:127.0.0.1:62386_ch%2Fb c:collection1   x:collection1] o.a.s.u.CommitTracker Hard AutoCommit: disabled
   [junit4]   2> 1195418 INFO  (coreLoadExecutor-4107-thread-1-processing-n:127.0.0.1:62386_ch%2Fb) [n:127.0.0.1:62386_ch%2Fb c:collection1   x:collection1] o.a.s.u.CommitTracker Soft AutoCommit: disabled
   [junit4]   2> 1195418 INFO  (coreLoadExecutor-4107-thread-1-processing-n:127.0.0.1:62386_ch%2Fb) [n:127.0.0.1:62386_ch%2Fb c:collection1   x:collection1] o.a.s.u.RandomMergePolicy RandomMergePolicy wrapping class org.apache.lucene.index.TieredMergePolicy: [TieredMergePolicy: maxMergeAtOnce=19, maxMergeAtOnceExplicit=16, maxMergedSegmentMB=65.3115234375, floorSegmentMB=1.1455078125, forceMergeDeletesPctAllowed=13.442886366518048, segmentsPerTier=24.0, maxCFSSegmentSizeMB=8.796093022207999E12, noCFSRatio=0.0
   [junit4]   2> 1195419 INFO  (coreLoadExecutor-4107-thread-1-processing-n:127.0.0.1:62386_ch%2Fb) [n:127.0.0.1:62386_ch%2Fb c:collection1   x:collection1] o.a.s.s.SolrIndexSearcher Opening [Searcher@2d4f1493[collection1] main]
   [junit4]   2> 1195420 INFO  (coreLoadExecutor-4107-thread-1-processing-n:127.0.0.1:62386_ch%2Fb) [n:127.0.0.1:62386_ch%2Fb c:collection1   x:collection1] o.a.s.r.ManagedResourceStorage Configured ZooKeeperStorageIO with znodeBase: /configs/conf1
   [junit4]   2> 1195422 INFO  (coreLoadExecutor-4107-thread-1-processing-n:127.0.0.1:62386_ch%2Fb) [n:127.0.0.1:62386_ch%2Fb c:collection1   x:collection1] o.a.s.r.ManagedResourceStorage Loaded null at path _rest_managed.json using ZooKeeperStorageIO:path=/configs/conf1
   [junit4]   2> 1195422 INFO  (coreLoadExecutor-4107-thread-1-processing-n:127.0.0.1:62386_ch%2Fb) [n:127.0.0.1:62386_ch%2Fb c:collection1   x:collection1] o.a.s.h.ReplicationHandler Commits will be reserved for  10000
   [junit4]   2> 1195423 INFO  (searcherExecutor-4108-thread-1-processing-n:127.0.0.1:62386_ch%2Fb x:collection1 c:collection1) [n:127.0.0.1:62386_ch%2Fb c:collection1   x:collection1] o.a.s.c.SolrCore [collection1] Registered new searcher Searcher@2d4f1493[collection1] main{ExitableDirectoryReader(UninvertingDirectoryReader())}
   [junit4]   2> 1195424 INFO  (coreLoadExecutor-4107-thread-1-processing-n:127.0.0.1:62386_ch%2Fb) [n:127.0.0.1:62386_ch%2Fb c:collection1   x:collection1] o.a.s.u.UpdateLog Could not find max version in index or recent updates, using new clock 1560488666721157120
   [junit4]   2> 1195434 INFO  (coreZkRegister-4102-thread-1-processing-n:127.0.0.1:62386_ch%2Fb x:collection1 c:collection1) [n:127.0.0.1:62386_ch%2Fb c:collection1 s:shard4 r:core_node3 x:collection1] o.a.s.c.ShardLeaderElectionContext Enough replicas found to continue.
   [junit4]   2> 1195434 INFO  (coreZkRegister-4102-thread-1-processing-n:127.0.0.1:62386_ch%2Fb x:collection1 c:collection1) [n:127.0.0.1:62386_ch%2Fb c:collection1 s:shard4 r:core_node3 x:collection1] o.a.s.c.ShardLeaderElectionContext I may be the new leader - try and sync
   [junit4]   2> 1195434 INFO  (coreZkRegister-4102-thread-1-processing-n:127.0.0.1:62386_ch%2Fb x:collection1 c:collection1) [n:127.0.0.1:62386_ch%2Fb c:collection1 s:shard4 r:core_node3 x:collection1] o.a.s.c.SyncStrategy Sync replicas to https://127.0.0.1:62386/ch/b/collection1/
   [junit4]   2> 1195434 INFO  (coreZkRegister-4102-thread-1-processing-n:127.0.0.1:62386_ch%2Fb x:collection1 c:collection1) [n:127.0.0.1:62386_ch%2Fb c:collection1 s:shard4 r:core_node3 x:collection1] o.a.s.c.SyncStrategy Sync Success - now sync replicas to me
   [junit4]   2> 1195434 INFO  (coreZkRegister-4102-thread-1-processing-n:127.0.0.1:62386_ch%2Fb x:collection1 c:collection1) [n:127.0.0.1:62386_ch%2Fb c:collection1 s:shard4 r:core_node3 x:collection1] o.a.s.c.SyncStrategy https://127.0.0.1:62386/ch/b/collection1/ has no replicas
   [junit4]   2> 1195435 INFO  (coreZkRegister-4102-thread-1-processing-n:127.0.0.1:62386_ch%2Fb x:collection1 c:collection1) [n:127.0.0.1:62386_ch%2Fb c:collection1 s:shard4 r:core_node3 x:collection1] o.a.s.c.ShardLeaderElectionContext Found all replicas participating in election, clear LIR
   [junit4]   2> 1195441 INFO  (coreZkRegister-4102-thread-1-processing-n:127.0.0.1:62386_ch%2Fb x:collection1 c:collection1) [n:127.0.0.1:62386_ch%2Fb c:collection1 s:shard4 r:core_node3 x:collection1] o.a.s.c.ShardLeaderElectionContext I am the new leader: https://127.0.0.1:62386/ch/b/collection1/ shard4
   [junit4]   2> 1195551 INFO  (zkCallback-2123-thread-1-processing-n:127.0.0.1:62386_ch%2Fb) [n:127.0.0.1:62386_ch%2Fb    ] o.a.s.c.c.ZkStateReader A cluster state change: [WatchedEvent state:SyncConnected type:NodeDataChanged path:/collections/collection1/state.json] for collection [collection1] has occurred - updating... (live nodes size: [4])
   [junit4]   2> 1195551 INFO  (zkCallback-2111-thread-2-processing-n:127.0.0.1:62374_ch%2Fb) [n:127.0.0.1:62374_ch%2Fb    ] o.a.s.c.c.ZkStateReader A cluster state change: [WatchedEvent state:SyncConnected type:NodeDataChanged path:/collections/collection1/state.json] for collection [collection1] has occurred - updating... (live nodes size: [4])
   [junit4]   2> 1195551 INFO  (zkCallback-2117-thread-1-processing-n:127.0.0.1:62381_ch%2Fb) [n:127.0.0.1:62381_ch%2Fb    ] o.a.s.c.c.ZkStateReader A cluster state change: [WatchedEvent state:SyncConnected type:NodeDataChanged path:/collections/collection1/state.json] for collection [collection1] has occurred - updating... (live nodes size: [4])
   [junit4]   2> 1195593 INFO  (coreZkRegister-4102-thread-1-processing-n:127.0.0.1:62386_ch%2Fb x:collection1 c:collection1) [n:127.0.0.1:62386_ch%2Fb c:collection1 s:shard4 r:core_node3 x:collection1] o.a.s.c.ZkController I am the leader, no recovery necessary
   [junit4]   2> 1195702 INFO  (zkCallback-2123-thread-1-processing-n:127.0.0.1:62386_ch%2Fb) [n:127.0.0.1:62386_ch%2Fb    ] o.a.s.c.c.ZkStateReader A cluster state change: [WatchedEvent state:SyncConnected type:NodeDataChanged path:/collections/collection1/state.json] for collection [collection1] has occurred - updating... (live nodes size: [4])
   [junit4]   2> 1195703 INFO  (zkCallback-2117-thread-1-processing-n:127.0.0.1:62381_ch%2Fb) [n:127.0.0.1:62381_ch%2Fb    ] o.a.s.c.c.ZkStateReader A cluster state change: [WatchedEvent state:SyncConnected type:NodeDataChanged path:/collections/collection1/state.json] for collection [collection1] has occurred - updating... (live nodes size: [4])
   [junit4]   2> 1195702 INFO  (zkCallback-2111-thread-2-processing-n:127.0.0.1:62374_ch%2Fb) [n:127.0.0.1:62374_ch%2Fb    ] o.a.s.c.c.ZkStateReader A cluster state change: [WatchedEvent state:SyncConnected type:NodeDataChanged path:/collections/collection1/state.json] for collection [collection1] has occurred - updating... (live nodes size: [4])
   [junit4]   2> 1195899 INFO  (TEST-TestRebalanceLeaders.test-seed#[4EFC9AB8E5863CC0]) [    ] o.a.s.SolrTestCaseJ4 Writing core.properties file to /Users/jenkins/workspace/Lucene-Solr-6.x-MacOSX/solr/build/solr-core/test/J1/temp/solr.cloud.TestRebalanceLeaders_4EFC9AB8E5863CC0-001/shard-4-001/cores/collection1
   [junit4]   2> 1195901 INFO  (TEST-TestRebalanceLeaders.test-seed#[4EFC9AB8E5863CC0]) [    ] o.a.s.c.AbstractFullDistribZkTestBase create jetty 4 in directory /Users/jenkins/workspace/Lucene-Solr-6.x-MacOSX/solr/build/solr-core/test/J1/temp/solr.cloud.TestRebalanceLeaders_4EFC9AB8E5863CC0-001/shard-4-001
   [junit4]   2> 1195903 INFO  (TEST-TestRebalanceLeaders.test-seed#[4EFC9AB8E5863CC0]) [    ] o.e.j.s.Server jetty-9.3.14.v20161028
   [junit4]   2> 1195905 INFO  (TEST-TestRebalanceLeaders.test-seed#[4EFC9AB8E5863CC0]) [    ] o.e.j.s.h.ContextHandler Started o.e.j.s.ServletContextHandler@53fa1ade{/ch/b,null,AVAILABLE}
   [junit4]   2> 1195906 INFO  (TEST-TestRebalanceLeaders.test-seed#[4EFC9AB8E5863CC0]) [    ] o.e.j.s.AbstractConnector Started ServerConnector@a2d50ad{SSL,[ssl, http/1.1]}{127.0.0.1:62390}
   [junit4]   2> 1195906 INFO  (TEST-TestRebalanceLeaders.test-seed#[4EFC9AB8E5863CC0]) [    ] o.e.j.s.Server Started @1201350ms
   [junit4]   2> 1195906 INFO  (TEST-TestRebalanceLeaders.test-seed#[4EFC9AB8E5863CC0]) [    ] o.a.s.c.s.e.JettySolrRunner Jetty properties: {solr.data.dir=/Users/jenkins/workspace/Lucene-Solr-6.x-MacOSX/solr/build/solr-core/test/J1/temp/solr.cloud.TestRebalanceLeaders_4EFC9AB8E5863CC0-001/tempDir-001/jetty4, solrconfig=solrconfig.xml, hostContext=/ch/b, hostPort=62390, coreRootDirectory=/Users/jenkins/workspace/Lucene-Solr-6.x-MacOSX/solr/build/solr-core/test/J1/../../../../../../../../../Users/jenkins/workspace/Lucene-Solr-6.x-MacOSX/solr/build/solr-core/test/J1/temp/solr.cloud.TestRebalanceLeaders_4EFC9AB8E5863CC0-001/shard-4-001/cores}
   [junit4]   2> 1195907 ERROR (TEST-TestRebalanceLeaders.test-seed#[4EFC9AB8E5863CC0]) [    ] o.a.s.s.StartupLoggingUtils Missing Java Option solr.log.dir. Logging may be missing or incomplete.
   [junit4]   2> 1195908 INFO  (TEST-TestRebalanceLeaders.test-seed#[4EFC9AB8E5863CC0]) [    ] o.a.s.s.SolrDispatchFilter  ___      _       Welcome to Apache Solr? version 6.5.0
   [junit4]   2> 1195908 INFO  (TEST-TestRebalanceLeaders.test-seed#[4EFC9AB8E5863CC0]) [    ] o.a.s.s.SolrDispatchFilter / __| ___| |_ _   Starting in cloud mode on port null
   [junit4]   2> 1195908 INFO  (TEST-TestRebalanceLeaders.test-seed#[4EFC9AB8E5863CC0]) [    ] o.a.s.s.SolrDispatchFilter \__ \/ _ \ | '_|  Install dir: null
   [junit4]   2> 1195908 INFO  (TEST-TestRebalanceLeaders.test-seed#[4EFC9AB8E5863CC0]) [    ] o.a.s.s.SolrDispatchFilter |___/\___/_|_|    Start time: 2017-02-27T12:19:22.979Z
   [junit4]   2> 1195912 INFO  (TEST-TestRebalanceLeaders.test-seed#[4EFC9AB8E5863CC0]) [    ] o.a.s.s.SolrDispatchFilter Loading solr.xml from SolrHome (not found in ZooKeeper)
   [junit4]   2> 1195912 INFO  (TEST-TestRebalanceLeaders.test-seed#[4EFC9AB8E5863CC0]) [    ] o.a.s.c.SolrXmlConfig Loading container configuration from /Users/jenkins/workspace/Lucene-Solr-6.x-MacOSX/solr/build/solr-core/test/J1/temp/solr.cloud.TestRebalanceLeaders_4EFC9AB8E5863CC0-001/shard-4-001/solr.xml
   [junit4]   2> 1195930 INFO  (TEST-TestRebalanceLeaders.test-seed#[4EFC9AB8E5863CC0]) [    ] o.a.s.u.UpdateShardHandler Creating UpdateShardHandler HTTP client with params: socketTimeout=340000&connTimeout=45000&retry=true
   [junit4]   2> 1195931 INFO  (TEST-TestRebalanceLeaders.test-seed#[4EFC9AB8E5863CC0]) [    ] o.a.s.c.ZkContainer Zookeeper client=127.0.0.1:62364/solr
   [junit4]   2> 1195947 INFO  (TEST-TestRebalanceLeaders.test-seed#[4EFC9AB8E5863CC0]) [n:127.0.0.1:62390_ch%2Fb    ] o.a.s.c.c.ZkStateReader Updated live nodes from ZooKeeper... (0) -> (4)
   [junit4]   2> 1195955 INFO  (TEST-TestRebalanceLeaders.test-seed#[4EFC9AB8E5863CC0]) [n:127.0.0.1:62390_ch%2Fb    ] o.a.s.c.Overseer Overseer (id=null) closing
   [junit4]   2> 1195959 INFO  (TEST-TestRebalanceLeaders.test-seed#[4EFC9AB8E5863CC0]) [n:127.0.0.1:62390_ch%2Fb    ] o.a.s.c.ZkController Register node as live in ZooKeeper:/live_nodes/127.0.0.1:62390_ch%2Fb
   [junit4]   2> 1195962 INFO  (zkCallback-2123-thread-1-processing-n:127.0.0.1:62386_ch%2Fb) [n:127.0.0.1:62386_ch%2Fb    ] o.a.s.c.c.ZkStateReader Updated live nodes from ZooKeeper... (4) -> (5)
   [junit4]   2> 1195963 INFO  (zkCallback-2111-thread-2-processing-n:127.0.0.1:62374_ch%2Fb) [n:127.0.0.1:62374_ch%2Fb    ] o.a.s.c.c.ZkStateReader Updated live nodes from ZooKeeper... (4) -> (5)
   [junit4]   2> 1195965 INFO  (zkCallback-2129-thread-1-processing-n:127.0.0.1:62390_ch%2Fb) [n:127.0.0.1:62390_ch%2Fb    ] o.a.s.c.c.ZkStateReader Updated live nodes from ZooKeeper... (4) -> (5)
   [junit4]   2> 1195965 INFO  (zkCallback-2105-thread-1) [    ] o.a.s.c.c.ZkStateReader Updated live nodes from ZooKeeper... (4) -> (5)
   [junit4]   2> 1195966 INFO  (zkCallback-2117-thread-1-processing-n:127.0.0.1:62381_ch%2Fb) [n:127.0.0.1:62381_ch%2Fb    ] o.a.s.c.c.ZkStateReader Updated live nodes from ZooKeeper... (4) -> (5)
   [junit4]   2> 1195967 INFO  (zkCallback-2101-thread-2-processing-n:127.0.0.1:62368_ch%2Fb) [n:127.0.0.1:62368_ch%2Fb    ] o.a.s.c.c.ZkStateReader Updated live nodes from ZooKeeper... (4) -> (5)
   [junit4]   2> 1196080 INFO  (zkCallback-2123-thread-1-processing-n:127.0.0.1:62386_ch%2Fb) [n:127.0.0.1:62386_ch%2Fb    ] o.a.s.c.c.ZkStateReader A cluster state change: [WatchedEvent state:SyncConnected type:NodeDataChanged path:/collections/collection1/state.json] for collection [collection1] has occurred - updating... (live nodes size: [5])
   [junit4]   2> 1196080 INFO  (zkCallback-2111-thread-2-processing-n:127.0.0.1:62374_ch%2Fb) [n:127.0.0.1:62374_ch%2Fb    ] o.a.s.c.c.ZkStateReader A cluster state change: [WatchedEvent state:SyncConnected type:NodeDataChanged path:/collections/collection1/state.json] for collection [collection1] has occurred - updating... (live nodes size: [5])
   [junit4]   2> 1196080 INFO  (zkCallback-2117-thread-2-processing-n:127.0.0.1:62381_ch%2Fb) [n:127.0.0.1:62381_ch%2Fb    ] o.a.s.c.c.ZkStateReader A cluster state change: [WatchedEvent state:SyncConnected type:NodeDataChanged path:/collections/collection1/state.json] for collection [collection1] has occurred - updating... (live nodes size: [5])
   [junit4]   2> 1196157 INFO  (TEST-TestRebalanceLeaders.test-seed#[4EFC9AB8E5863CC0]) [n:127.0.0.1:62390_ch%2Fb    ] o.a.s.c.CorePropertiesLocator Found 1 core definitions underneath /Users/jenkins/workspace/Lucene-Solr-6.x-MacOSX/solr/build/solr-core/test/J1/../../../../../../../../../Users/jenkins/workspace/Lucene-Solr-6.x-MacOSX/solr/build/solr-core/test/J1/temp/solr.cloud.TestRebalanceLeaders_4EFC9AB8E5863CC0-001/shard-4-001/cores
   [junit4]   2> 1196157 INFO  (TEST-TestRebalanceLeaders.test-seed#[4EFC9AB8E5863CC0]) [n:127.0.0.1:62390_ch%2Fb    ] o.a.s.c.CorePropertiesLocator Cores are: [collection1]
   [junit4]   2> 1196161 INFO  (OverseerStateUpdate-97530541108494341-127.0.0.1:62368_ch%2Fb-n_0000000000) [n:127.0.0.1:62368_ch%2Fb    ] o.a.s.c.o.ReplicaMutator Assigning new node to shard shard=shard1
   [junit4]   2> 1196265 INFO  (zkCallback-2123-thread-1-processing-n:127.0.0.1:62386_ch%2Fb) [n:127.0.0.1:62386_ch%2Fb    ] o.a.s.c.c.ZkStateReader A cluster state change: [WatchedEvent state:SyncConnected type:NodeDataChanged path:/collections/collection1/state.json] for collection [collection1] has occurred - updating... (live nodes size: [5])
   [junit4]   2> 1196265 INFO  (zkCallback-2129-thread-2-processing-n:127.0.0.1:62390_ch%2Fb) [n:127.0.0.1:62390_ch%2Fb    ] o.a.s.c.c.ZkStateReader A cluster state change: [WatchedEvent state:SyncConnected type:NodeDataChanged path:/collections/collection1/state.json] for collection [collection1] has occurred - updating... (live nodes size: [5])
   [junit4]   2> 1196266 INFO  (zkCallback-2117-thread-2-processing-n:127.0.0.1:62381_ch%2Fb) [n:127.0.0.1:62381_ch%2Fb    ] o.a.s.c.c.ZkStateReader A cluster state change: [WatchedEvent state:SyncConnected type:NodeDataChanged path:/collections/collection1/state.json] for collection [collection1] has occurred - updating... (live nodes size: [5])
   [junit4]   2> 1196266 INFO  (zkCallback-2111-thread-2-processing-n:127.0.0.1:62374_ch%2Fb) [n:127.0.0.1:62374_ch%2Fb    ] o.a.s.c.c.ZkStateReader A cluster state change: [WatchedEvent state:SyncConnected type:NodeDataChanged path:/collections/collection1/state.json] for collection [collection1] has occurred - updating... (live nodes size: [5])
   [junit4]   2> 1197181 WARN  (coreLoadExecutor-4118-thread-1-processing-n:127.0.0.1:62390_ch%2Fb) [n:127.0.0.1:62390_ch%2Fb c:collection1   x:collection1] o.a.s.c.Config Beginning with Solr 5.5, <mergePolicy> is deprecated, use <mergePolicyFactory> instead.
   [junit4]   2> 1197181 INFO  (coreLoadExecutor-4118-thread-1-processing-n:127.0.0.1:62390_ch%2Fb) [n:127.0.0.1:62390_ch%2Fb c:collection1   x:collection1] o.a.s.c.SolrConfig Using Lucene MatchVersion: 6.5.0
   [junit4]   2> 1197194 INFO  (coreLoadExecutor-4118-thread-1-processing-n:127.0.0.1:62390_ch%2Fb) [n:127.0.0.1:62390_ch%2Fb c:collection1   x:collection1] o.a.s.s.IndexSchema [collection1] Schema name=test
   [junit4]   2> 1197277 WARN  (coreLoadExecutor-4118-thread-1-processing-n:127.0.0.1:62390_ch%2Fb) [n:127.0.0.1:62390_ch%2Fb c:collection1   x:collection1] o.a.s.s.IndexSchema [collection1] default search field in schema is text. WARNING: Deprecated, please use 'df' on request instead.
   [junit4]   2> 1197278 INFO  (coreLoadExecutor-4118-thread-1-processing-n:127.0.0.1:62390_ch%2Fb) [n:127.0.0.1:62390_ch%2Fb c:collecti

[...truncated too long message...]

tFacet.assertPivotCountsAreCorrect(TestCloudPivotFacet.java:318)
   [junit4]    > 	... 43 more
   [junit4]    > Caused by: org.apache.solr.client.solrj.impl.HttpSolrClient$RemoteSolrException: Error from server at http://127.0.0.1:49518/wbs/collection1: no servers hosting shard: shard2
   [junit4]    > 	at org.apache.solr.client.solrj.impl.HttpSolrClient.executeMethod(HttpSolrClient.java:610)
   [junit4]    > 	at org.apache.solr.client.solrj.impl.HttpSolrClient.request(HttpSolrClient.java:279)
   [junit4]    > 	at org.apache.solr.client.solrj.impl.HttpSolrClient.request(HttpSolrClient.java:268)
   [junit4]    > 	at org.apache.solr.client.solrj.impl.LBHttpSolrClient.doRequest(LBHttpSolrClient.java:435)
   [junit4]    > 	at org.apache.solr.client.solrj.impl.LBHttpSolrClient.request(LBHttpSolrClient.java:387)
   [junit4]    > 	... 51 more
   [junit4]   2> 2709059 INFO  (SUITE-TestCloudPivotFacet-seed#[4EFC9AB8E5863CC0]-worker) [    ] o.a.s.SolrTestCaseJ4 ###deleteCore
   [junit4]   2> NOTE: leaving temporary files on disk at: /Users/jenkins/workspace/Lucene-Solr-6.x-MacOSX/solr/build/solr-core/test/J0/temp/solr.cloud.TestCloudPivotFacet_4EFC9AB8E5863CC0-001
   [junit4]   2> NOTE: test params are: codec=Asserting(Lucene62): {pivot_dt1=PostingsFormat(name=Memory doPackFST= false), dense_pivot_i1=PostingsFormat(name=MockRandom), pivot_l1=PostingsFormat(name=Asserting), range_facet_l_dv=Lucene50(blocksize=128), multiDefault=PostingsFormat(name=Memory doPackFST= false), pivot_f1=PostingsFormat(name=Memory doPackFST= false), intDefault=PostingsFormat(name=Asserting), pivot_d1=PostingsFormat(name=Asserting), pivot_x_s=Lucene50(blocksize=128), pivot_b1=PostingsFormat(name=Memory doPackFST= false), pivot_dt=PostingsFormat(name=MockRandom), dense_pivot_ti1=Lucene50(blocksize=128), range_facet_l=PostingsFormat(name=Memory doPackFST= false), pivot_x_s1=PostingsFormat(name=Memory doPackFST= false), pivot_y_s=PostingsFormat(name=Memory doPackFST= false), pivot_z_s=PostingsFormat(name=MockRandom), dense_pivot_ti=PostingsFormat(name=Asserting), pivot_z_s1=PostingsFormat(name=Asserting), pivot_tl1=PostingsFormat(name=Memory doPackFST= false), id=Lucene50(blocksize=128), dense_pivot_x_s1=PostingsFormat(name=Memory doPackFST= false), timestamp=PostingsFormat(name=Memory doPackFST= false), dense_pivot_y_s=PostingsFormat(name=Asserting), pivot_td1=PostingsFormat(name=Memory doPackFST= false), pivot_tdt=Lucene50(blocksize=128), pivot_i1=PostingsFormat(name=MockRandom), pivot_tf1=PostingsFormat(name=Asserting), pivot_td=PostingsFormat(name=MockRandom), pivot_tf=Lucene50(blocksize=128), pivot_f=PostingsFormat(name=MockRandom), pivot_ti=PostingsFormat(name=Asserting), pivot_i=PostingsFormat(name=Memory doPackFST= false), pivot_tl=PostingsFormat(name=MockRandom), pivot_l=Lucene50(blocksize=128), pivot_y_s1=PostingsFormat(name=MockRandom), pivot_ti1=Lucene50(blocksize=128), range_facet_i_dv=PostingsFormat(name=Memory doPackFST= false), dense_pivot_i=PostingsFormat(name=Memory doPackFST= false), pivot_b=PostingsFormat(name=MockRandom), dense_pivot_y_s1=PostingsFormat(name=MockRandom), pivot_d=Lucene50(blocksize=128), pivot_tdt1=PostingsFormat(name=Memory doPackFST= false), dense_pivot_x_s=Lucene50(blocksize=128)}, docValues:{range_facet_l_dv=DocValuesFormat(name=Lucene54), _version_=DocValuesFormat(name=Lucene54), range_facet_i_dv=DocValuesFormat(name=Direct), intDvoDefault=DocValuesFormat(name=Lucene54), timestamp=DocValuesFormat(name=Direct)}, maxPointsInLeafNode=1599, maxMBSortInHeap=6.18952345845619, sim=RandomSimilarity(queryNorm=false,coord=yes): {}, locale=hr, timezone=Indian/Cocos
   [junit4]   2> NOTE: Mac OS X 10.11.6 x86_64/Oracle Corporation 1.8.0_121 (64-bit)/cpus=3,threads=1,free=151037368,total=501743616
   [junit4]   2> NOTE: All tests run in this JVM: [TestRandomDVFaceting, TestDocumentBuilder, TestBinaryField, SmileWriterTest, TestFilteredDocIdSet, TestFunctionQuery, TestPseudoReturnFields, TestSort, TestManagedStopFilterFactory, DistributedFacetPivotLargeTest, PeerSyncWithIndexFingerprintCachingTest, FacetPivotSmallTest, TestCoreContainer, ConfigSetsAPITest, SyncSliceTest, TestCloudRecovery, TestExactSharedStatsCache, SolrCLIZkUtilsTest, PrimitiveFieldTypeTest, TestSolrCloudWithKerberosAlt, HighlighterTest, HdfsUnloadDistributedZkTest, TermsComponentTest, SystemInfoHandlerTest, TestConfigSetsAPIExclusivity, TestLeaderInitiatedRecoveryThread, TestScoreJoinQPScore, SpatialFilterTest, HdfsRecoverLeaseTest, TestXmlQParserPlugin, TestFieldCacheSort, CleanupOldIndexTest, TestAnalyzedSuggestions, TestCharFilters, OverseerRolesTest, TestCSVResponseWriter, TestIntervalFaceting, TestFastLRUCache, TestRestoreCore, TestSolrDynamicMBean, TestRequestStatusCollectionAPI, TestSchemaManager, RecoveryAfterSoftCommitTest, SpatialRPTFieldTypeTest, TestSolrQueryParserResource, MoreLikeThisHandlerTest, DeleteNodeTest, TestManagedSchemaThreadSafety, ClassificationUpdateProcessorIntegrationTest, CheckHdfsIndexTest, RestartWhileUpdatingTest, TestLockTree, TestSolrCLIRunExample, RequiredFieldsTest, DocumentAnalysisRequestHandlerTest, TestStressLucene, CreateCollectionCleanupTest, TestInPlaceUpdatesStandalone, SoftAutoCommitTest, UniqFieldsUpdateProcessorFactoryTest, TestShardHandlerFactory, TestDynamicLoading, TestAuthorizationFramework, TestCustomDocTransformer, TimeZoneUtilsTest, VersionInfoTest, TestCloudDeleteByQuery, XmlUpdateRequestHandlerTest, TestDefaultStatsCache, TestTolerantUpdateProcessorRandomCloud, TestSegmentSorting, LeaderFailureAfterFreshStartTest, TestRandomRequestDistribution, SolrMetricManagerTest, OverseerTest, DistributedQueryComponentOptimizationTest, SolrSlf4jReporterTest, RecoveryZkTest, StatsReloadRaceTest, TestCollationField, TestHighlightDedupGrouping, TestGeoJSONResponseWriter, TestTrieFacet, TestCorePropertiesReload, LeaderInitiatedRecoveryOnShardRestartTest, TestAnalyzeInfixSuggestions, TestCollectionAPI, OutputWriterTest, DirectUpdateHandlerTest, TestElisionMultitermQuery, PreAnalyzedUpdateProcessorTest, TestReplicaProperties, ClusterStateUpdateTest, TestInfoStreamLogging, TestUpdate, DocValuesMissingTest, HighlighterMaxOffsetTest, BlockJoinFacetRandomTest, TestSolrCloudSnapshots, StatelessScriptUpdateProcessorFactoryTest, TestManagedResourceStorage, TestCryptoKeys, TestNumericTerms64, ZkNodePropsTest, UtilsToolTest, TestFileDictionaryLookup, TestHdfsUpdateLog, CollectionReloadTest, TestSerializedLuceneMatchVersion, LeaderElectionTest, TestGroupingSearch, SparseHLLTest, TestReplicationHandlerBackup, TestNRTOpen, V2ApiIntegrationTest, DistributedQueryElevationComponentTest, QueryResultKeyTest, RankQueryTest, TestJsonFacets, HardAutoCommitTest, TestSubQueryTransformer, TestStressVersions, CollectionTooManyReplicasTest, SuggesterFSTTest, DirectSolrConnectionTest, AnalysisAfterCoreReloadTest, TestNonDefinedSimilarityFactory, TestFastOutputStream, ReplicaListTransformerTest, TestPhraseSuggestions, TestConfigOverlay, DocumentBuilderTest, TriLevelCompositeIdRoutingTest, TestBinaryResponseWriter, ChangedSchemaMergeTest, XsltUpdateRequestHandlerTest, TestSolrQueryResponse, CursorMarkTest, TestHashPartitioner, QueryEqualityTest, ConnectionReuseTest, DeleteShardTest, TestUseDocValuesAsStored, BadComponentTest, TestSchemaSimilarityResource, SolrXmlInZkTest, SimplePostToolTest, TestWordDelimiterFilterFactory, SynonymTokenizerTest, JvmMetricsTest, TestSolrDeletionPolicy1, ExitableDirectoryReaderTest, TestDistribDocBasedVersion, ReplaceNodeTest, TestTolerantSearch, SecurityConfHandlerTest, TestOnReconnectListenerSupport, TestSQLHandlerNonCloud, TestFaceting, TestMaxScoreQueryParser, QueryElevationComponentTest, TestExtendedDismaxParser, BigEndianAscendingWordSerializerTest, DistribCursorPagingTest, TestPerFieldSimilarityWithDefaultOverride, TestReplicationHandler, SharedFSAutoReplicaFailoverUtilsTest, TestRawResponseWriter, TestPerFieldSimilarity, HdfsRestartWhileUpdatingTest, BasicDistributedZkTest, UnloadDistributedZkTest, BasicZkTest, FullSolrCloudDistribCmdsTest, ZkCLITest, AutoCommitTest, TestDistributedGrouping, TestRecovery, DistributedSpellCheckComponentTest, ZkControllerTest, TestRealTimeGet, TestStressReorder, TestReload, DistributedTermsComponentTest, SimpleFacetsTest, SolrCoreTest, SpellCheckComponentTest, PeerSyncTest, CurrencyFieldOpenExchangeTest, CurrencyFieldXmlFileTest, TestCoreDiscovery, SolrRequestParserTest, DocValuesTest, DocValuesMultiTest, SolrInfoMBeanTest, DisMaxRequestHandlerTest, StandardRequestHandlerTest, TestReversedWildcardFilterFactory, TestValueSourceCache, TermVectorComponentTest, FieldAnalysisRequestHandlerTest, IndexSchemaRuntimeFieldTest, SolrPluginUtilsTest, TestJmxIntegration, UpdateRequestProcessorFactoryTest, JSONWriterTest, PingRequestHandlerTest, HighlighterConfigTest, SOLR749Test, TestQuerySenderListener, AlternateDirectoryTest, TestSolrIndexConfig, CopyFieldTest, ResponseLogComponentTest, TestStressRecovery, PreAnalyzedFieldTest, PrimUtilsTest, TestSuggestSpellingConverter, DateFieldTest, DOMUtilTest, RAMDirectoryFactoryTest, ClusterStateTest, TestSolrJ, TestLRUCache, TestUtils, FileUtilsTest, CircularListTest, DistributedMLTComponentTest, TestRTGBase, CursorPagingTest, SolrTestCaseJ4Test, TestCrossCoreJoin, TestCursorMarkWithoutUniqueKey, TestDistributedMissingSort, TestSimpleTrackingShardHandler, AsyncCallRequestStatusResponseTest, BaseCdcrDistributedZkTest, CdcrBootstrapTest, ConcurrentDeleteAndCreateCollectionTest, ConnectionManagerTest, DeleteInactiveReplicaTest, DistribJoinFromCollectionTest, DistributedVersionInfoTest, LeaderElectionContextKeyTest, MigrateRouteKeyTest, MissingSegmentRecoveryTest, MultiThreadedOCPTest, OutOfBoxZkACLAndCredentialsProvidersTest, OverseerCollectionConfigSetProcessorTest, OverseerStatusTest, RemoteQueryErrorTest, RollingRestartTest, SharedFSAutoReplicaFailoverTest, TestAuthenticationFramework, TestCloudInspectUtil, TestCloudPivotFacet]
   [junit4] Completed [516/696 (2!)] on J0 in 62.45s, 1 test, 1 error <<< FAILURES!

[...truncated 63336 lines...]