You are viewing a plain text version of this content. The canonical link for it is here.
Posted to dev@qpid.apache.org by "Ganesh Murthy (Jira)" <ji...@apache.org> on 2020/05/27 13:49:00 UTC
[jira] [Assigned] (DISPATCH-1675) system_tests_stuck_deliveries
failure with AttributeError: 'DelayedSettlementTest' object has no
attribute 'proxy'",
[ https://issues.apache.org/jira/browse/DISPATCH-1675?page=com.atlassian.jira.plugin.system.issuetabpanels:all-tabpanel ]
Ganesh Murthy reassigned DISPATCH-1675:
---------------------------------------
Assignee: Ted Ross
> system_tests_stuck_deliveries failure with AttributeError: 'DelayedSettlementTest' object has no attribute 'proxy'",
> ---------------------------------------------------------------------------------------------------------------------
>
> Key: DISPATCH-1675
> URL: https://issues.apache.org/jira/browse/DISPATCH-1675
> Project: Qpid Dispatch
> Issue Type: Improvement
> Components: Tests
> Affects Versions: 1.12.0
> Reporter: Ganesh Murthy
> Assignee: Ted Ross
> Priority: Major
>
> {noformat}
> "64: Test command: /usr/bin/python \"/opt/qpid-dispatch-src/build/tests/run.py\" \"-m\" \"unittest\" \"-v\" \"system_tests_stuck_deliveries\"",
> "64: Test timeout computed to be: 600",
> "64: test_01_delayed_settlement_same_interior (system_tests_stuck_deliveries.RouterTest) ... ERROR",
> "64: test_02_delayed_settlement_different_edges_check_sender (system_tests_stuck_deliveries.RouterTest) ... ok",
> "64: test_03_delayed_settlement_different_edges_check_receiver (system_tests_stuck_deliveries.RouterTest) ... ok",
> "64: test_04_delayed_settlement_different_edges_check_interior (system_tests_stuck_deliveries.RouterTest) ... FAIL",
> "64: test_05_no_settlement_same_interior (system_tests_stuck_deliveries.RouterTest) ... ok",
> "64: test_06_no_settlement_different_edges_check_sender (system_tests_stuck_deliveries.RouterTest) ... ok",
> "64: test_07_no_settlement_different_edges_check_receiver (system_tests_stuck_deliveries.RouterTest) ... ok",
> "64: test_08_no_settlement_different_edges_check_interior (system_tests_stuck_deliveries.RouterTest) ... ok",
> "64: test_09_receiver_link_credit_test (system_tests_stuck_deliveries.RouterTest) ... ok",
> "64: test_10_sender_link_credit_test (system_tests_stuck_deliveries.RouterTest) ... ok",
> "64: ",
> "64: ======================================================================",
> "64: ERROR: test_01_delayed_settlement_same_interior (system_tests_stuck_deliveries.RouterTest)",
> "64: ----------------------------------------------------------------------",
> "64: Traceback (most recent call last):",
> "64: File \"/opt/qpid-dispatch-src/tests/system_tests_stuck_deliveries.py\", line 97, in test_01_delayed_settlement_same_interior",
> "64: test.run()",
> "64: File \"/opt/qpid-dispatch-src/tests/system_tests_stuck_deliveries.py\", line 264, in run",
> "64: Container(self).run()",
> "64: File \"/usr/lib64/python2.7/site-packages/proton/_reactor.py\", line 180, in run",
> "64: while self.process(): pass",
> "64: File \"/usr/lib64/python2.7/site-packages/proton/_reactor.py\", line 237, in process",
> "64: event.dispatch(handler)",
> "64: File \"/usr/lib64/python2.7/site-packages/proton/_events.py\", line 165, in dispatch",
> "64: self.dispatch(h, type)",
> "64: File \"/usr/lib64/python2.7/site-packages/proton/_events.py\", line 165, in dispatch",
> "64: self.dispatch(h, type)",
> "64: File \"/usr/lib64/python2.7/site-packages/proton/_events.py\", line 162, in dispatch",
> "64: _dispatch(handler, type.method, self)",
> "64: File \"/usr/lib64/python2.7/site-packages/proton/_events.py\", line 123, in _dispatch",
> "64: m(*args)",
> "64: File \"/usr/lib64/python2.7/site-packages/proton/_handlers.py\", line 260, in on_delivery",
> "64: self.on_message(event)",
> "64: File \"/usr/lib64/python2.7/site-packages/proton/_handlers.py\", line 286, in on_message",
> "64: _dispatch(self.delegate, 'on_message', event)",
> "64: File \"/usr/lib64/python2.7/site-packages/proton/_events.py\", line 123, in _dispatch",
> "64: m(*args)",
> "64: File \"/opt/qpid-dispatch-src/tests/system_tests_stuck_deliveries.py\", line 236, in on_message",
> "64: self.query_stats(len(self.stuck_list) * 2)",
> "64: File \"/opt/qpid-dispatch-src/tests/system_tests_stuck_deliveries.py\", line 257, in query_stats",
> "64: msg = self.proxy.query_router()",
> "64: AttributeError: 'DelayedSettlementTest' object has no attribute 'proxy'",
> "64: ",
> "64: ======================================================================",
> "64: FAIL: test_04_delayed_settlement_different_edges_check_interior (system_tests_stuck_deliveries.RouterTest)",
> "64: ----------------------------------------------------------------------",
> "64: Traceback (most recent call last):",
> "64: File \"/opt/qpid-dispatch-src/tests/system_tests_stuck_deliveries.py\", line 122, in test_04_delayed_settlement_different_edges_check_interior",
> "64: self.assertEqual(None, test.error)",
> "64: AssertionError: None != u'Timeout Expired - n_tx=10, n_rx=10, expected_stuck=8 last_stuck=28'",
> "64: ",
> "64: ----------------------------------------------------------------------",
> "64: Ran 10 tests in 157.230s",
> "64: ",
> "64: FAILED (failures=1, errors=1)", {noformat}
--
This message was sent by Atlassian Jira
(v8.3.4#803005)
---------------------------------------------------------------------
To unsubscribe, e-mail: dev-unsubscribe@qpid.apache.org
For additional commands, e-mail: dev-help@qpid.apache.org