You are viewing a plain text version of this content. The canonical link for it is here.
Posted to dev@hbase.apache.org by Apache Hudson Server <hu...@hudson.apache.org> on 2011/03/23 03:22:10 UTC
Build failed in Jenkins: hbase-0.90 #129
See <https://hudson.apache.org/hudson/job/hbase-0.90/129/>
------------------------------------------
[...truncated 202 lines...]
A src/test/java/org/apache/hadoop/hbase/util/TestMergeTable.java
A src/test/java/org/apache/hadoop/hbase/util/EnvironmentEdgeManagerTestHelper.java
A src/test/java/org/apache/hadoop/hbase/util/TestBase64.java
A src/test/java/org/apache/hadoop/hbase/util/TestEnvironmentEdgeManager.java
A src/test/java/org/apache/hadoop/hbase/util/TestBytes.java
A src/test/java/org/apache/hadoop/hbase/util/TestKeying.java
A src/test/java/org/apache/hadoop/hbase/util/SoftValueSortedMapTest.java
A src/test/java/org/apache/hadoop/hbase/util/TestFSUtils.java
A src/test/java/org/apache/hadoop/hbase/util/TestHBaseFsck.java
A src/test/java/org/apache/hadoop/hbase/util/TestIncrementingEnvironmentEdge.java
A src/test/java/org/apache/hadoop/hbase/util/TestMergeTool.java
A src/test/java/org/apache/hadoop/hbase/util/TestDefaultEnvironmentEdge.java
A src/test/java/org/apache/hadoop/hbase/client
A src/test/java/org/apache/hadoop/hbase/client/TestGetRowVersions.java
A src/test/java/org/apache/hadoop/hbase/client/TestMetaScanner.java
A src/test/java/org/apache/hadoop/hbase/client/TestScannerTimeout.java
A src/test/java/org/apache/hadoop/hbase/client/TestMultipleTimestamps.java
A src/test/java/org/apache/hadoop/hbase/client/TestTimestamp.java
A src/test/java/org/apache/hadoop/hbase/client/TestFromClientSide.java
A src/test/java/org/apache/hadoop/hbase/client/TestHCM.java
A src/test/java/org/apache/hadoop/hbase/client/TestMultiParallel.java
A src/test/java/org/apache/hadoop/hbase/client/TestShell.java
A src/test/java/org/apache/hadoop/hbase/client/TestAdmin.java
A src/test/java/org/apache/hadoop/hbase/client/TestHTablePool.java
A src/test/java/org/apache/hadoop/hbase/client/replication
A src/test/java/org/apache/hadoop/hbase/client/replication/TestReplicationAdmin.java
A src/test/java/org/apache/hadoop/hbase/client/TestTimestampsFilter.java
A src/test/java/org/apache/hadoop/hbase/client/TestResult.java
A src/test/java/org/apache/hadoop/hbase/TestHMsg.java
A src/test/java/data
A src/test/ruby
A src/test/ruby/test_helper.rb
A src/test/ruby/hbase
A src/test/ruby/hbase/hbase_test.rb
A src/test/ruby/hbase/table_test.rb
A src/test/ruby/hbase/admin_test.rb
A src/test/ruby/shell
A src/test/ruby/shell/commands_test.rb
A src/test/ruby/shell/formatter_test.rb
A src/test/ruby/shell/shell_test.rb
A src/test/ruby/tests_runner.rb
A src/test/resources
A src/test/resources/hbase-site.xml
A src/test/resources/org
A src/test/resources/org/apache
A src/test/resources/org/apache/hadoop
A src/test/resources/org/apache/hadoop/hbase
A src/test/resources/org/apache/hadoop/hbase/PerformanceEvaluation_Counter.properties
A src/test/resources/log4j.properties
A src/test/resources/mapred-queues.xml
A src/main
A src/main/java
A src/main/java/org
A src/main/java/org/apache
A src/main/java/org/apache/hadoop
A src/main/java/org/apache/hadoop/hbase
A src/main/java/org/apache/hadoop/hbase/PleaseHoldException.java
A src/main/java/org/apache/hadoop/hbase/YouAreDeadException.java
A src/main/java/org/apache/hadoop/hbase/RegionException.java
A src/main/java/org/apache/hadoop/hbase/HColumnDescriptor.java
A src/main/java/org/apache/hadoop/hbase/RemoteExceptionHandler.java
A src/main/java/org/apache/hadoop/hbase/NotAllMetaRegionsOnlineException.java
A src/main/java/org/apache/hadoop/hbase/MasterAddressTracker.java
A src/main/java/org/apache/hadoop/hbase/HServerLoad.java
A src/main/java/org/apache/hadoop/hbase/TableNotDisabledException.java
A src/main/java/org/apache/hadoop/hbase/VersionAnnotation.java
A src/main/java/org/apache/hadoop/hbase/thrift
A src/main/java/org/apache/hadoop/hbase/thrift/ThriftServer.java
A src/main/java/org/apache/hadoop/hbase/thrift/ThriftUtilities.java
A src/main/java/org/apache/hadoop/hbase/thrift/generated
A src/main/java/org/apache/hadoop/hbase/thrift/generated/Mutation.java
A src/main/java/org/apache/hadoop/hbase/thrift/generated/AlreadyExists.java
A src/main/java/org/apache/hadoop/hbase/thrift/generated/IOError.java
A src/main/java/org/apache/hadoop/hbase/thrift/generated/BatchMutation.java
A src/main/java/org/apache/hadoop/hbase/thrift/generated/Hbase.java
A src/main/java/org/apache/hadoop/hbase/thrift/generated/TCell.java
A src/main/java/org/apache/hadoop/hbase/thrift/generated/TRegionInfo.java
A src/main/java/org/apache/hadoop/hbase/thrift/generated/TRowResult.java
A src/main/java/org/apache/hadoop/hbase/thrift/generated/ColumnDescriptor.java
A src/main/java/org/apache/hadoop/hbase/thrift/generated/IllegalArgument.java
A src/main/java/org/apache/hadoop/hbase/UnknownRegionException.java
A src/main/java/org/apache/hadoop/hbase/zookeeper
A src/main/java/org/apache/hadoop/hbase/zookeeper/ClusterStatusTracker.java
A src/main/java/org/apache/hadoop/hbase/zookeeper/RootRegionTracker.java
A src/main/java/org/apache/hadoop/hbase/zookeeper/MetaNodeTracker.java
A src/main/java/org/apache/hadoop/hbase/zookeeper/ZKServerTool.java
A src/main/java/org/apache/hadoop/hbase/zookeeper/ZooKeeperListener.java
A src/main/java/org/apache/hadoop/hbase/zookeeper/ZKConfig.java
A src/main/java/org/apache/hadoop/hbase/zookeeper/HQuorumPeer.java
A src/main/java/org/apache/hadoop/hbase/zookeeper/ZKTableDisable.java
A src/main/java/org/apache/hadoop/hbase/zookeeper/ZooKeeperWatcher.java
A src/main/java/org/apache/hadoop/hbase/zookeeper/MiniZooKeeperCluster.java
A src/main/java/org/apache/hadoop/hbase/zookeeper/ZKUtil.java
A src/main/java/org/apache/hadoop/hbase/zookeeper/ZooKeeperNodeTracker.java
A src/main/java/org/apache/hadoop/hbase/zookeeper/RegionServerTracker.java
A src/main/java/org/apache/hadoop/hbase/zookeeper/ZKAssign.java
A src/main/java/org/apache/hadoop/hbase/zookeeper/ZooKeeperMainServerArg.java
A src/main/java/org/apache/hadoop/hbase/zookeeper/ZKTable.java
A src/main/java/org/apache/hadoop/hbase/ClockOutOfSyncException.java
A src/main/java/org/apache/hadoop/hbase/HConstants.java
A src/main/java/org/apache/hadoop/hbase/HRegionLocation.java
A src/main/java/org/apache/hadoop/hbase/ClusterStatus.java
A src/main/java/org/apache/hadoop/hbase/avro
A src/main/java/org/apache/hadoop/hbase/avro/hbase.genavro
A src/main/java/org/apache/hadoop/hbase/avro/AvroUtil.java
A src/main/java/org/apache/hadoop/hbase/avro/hbase.avpr
A src/main/java/org/apache/hadoop/hbase/avro/AvroServer.java
A src/main/java/org/apache/hadoop/hbase/avro/generated
A src/main/java/org/apache/hadoop/hbase/avro/generated/AColumnFamilyDescriptor.java
A src/main/java/org/apache/hadoop/hbase/avro/generated/AResultEntry.java
A src/main/java/org/apache/hadoop/hbase/avro/generated/TCell.java
A src/main/java/org/apache/hadoop/hbase/avro/generated/ADelete.java
A src/main/java/org/apache/hadoop/hbase/avro/generated/AServerLoad.java
A src/main/java/org/apache/hadoop/hbase/avro/generated/ACompressionAlgorithm.java
A src/main/java/org/apache/hadoop/hbase/avro/generated/APut.java
A src/main/java/org/apache/hadoop/hbase/avro/generated/ATimeRange.java
A src/main/java/org/apache/hadoop/hbase/avro/generated/AServerAddress.java
A src/main/java/org/apache/hadoop/hbase/avro/generated/AIllegalArgument.java
A src/main/java/org/apache/hadoop/hbase/avro/generated/AMasterNotRunning.java
A src/main/java/org/apache/hadoop/hbase/avro/generated/AResult.java
A src/main/java/org/apache/hadoop/hbase/avro/generated/AGet.java
A src/main/java/org/apache/hadoop/hbase/avro/generated/IOError.java
A src/main/java/org/apache/hadoop/hbase/avro/generated/AFamilyDescriptor.java
A src/main/java/org/apache/hadoop/hbase/avro/generated/AIOError.java
A src/main/java/org/apache/hadoop/hbase/avro/generated/AAlreadyExists.java
A src/main/java/org/apache/hadoop/hbase/avro/generated/HBase.java
A src/main/java/org/apache/hadoop/hbase/avro/generated/AServerInfo.java
A src/main/java/org/apache/hadoop/hbase/avro/generated/ARegionLoad.java
A src/main/java/org/apache/hadoop/hbase/avro/generated/AScan.java
A src/main/java/org/apache/hadoop/hbase/avro/generated/AClusterStatus.java
A src/main/java/org/apache/hadoop/hbase/avro/generated/ATableDescriptor.java
A src/main/java/org/apache/hadoop/hbase/avro/generated/ATableExists.java
A src/main/java/org/apache/hadoop/hbase/avro/generated/AColumnValue.java
A src/main/java/org/apache/hadoop/hbase/avro/generated/AColumn.java
A src/main/java/org/apache/hadoop/hbase/avro/package.html
A src/main/java/org/apache/hadoop/hbase/InvalidFamilyOperationException.java
A src/main/java/org/apache/hadoop/hbase/Stoppable.java
A src/main/java/org/apache/hadoop/hbase/regionserver
A src/main/java/org/apache/hadoop/hbase/regionserver/KeyValueScanner.java
A src/main/java/org/apache/hadoop/hbase/regionserver/SplitTransaction.java
A src/main/java/org/apache/hadoop/hbase/regionserver/PriorityCompactionQueue.java
A src/main/java/org/apache/hadoop/hbase/regionserver/GetClosestRowBeforeTracker.java
A src/main/java/org/apache/hadoop/hbase/regionserver/ColumnCount.java
A src/main/java/org/apache/hadoop/hbase/regionserver/LeaseException.java
A src/main/java/org/apache/hadoop/hbase/regionserver/ReadWriteConsistencyControl.java
A src/main/java/org/apache/hadoop/hbase/regionserver/ColumnTracker.java
A src/main/java/org/apache/hadoop/hbase/regionserver/MemStoreLAB.java
A src/main/java/org/apache/hadoop/hbase/regionserver/OnlineRegions.java
A src/main/java/org/apache/hadoop/hbase/regionserver/Leases.java
A src/main/java/org/apache/hadoop/hbase/regionserver/ScanQueryMatcher.java
A src/main/java/org/apache/hadoop/hbase/regionserver/WrongRegionException.java
A src/main/java/org/apache/hadoop/hbase/regionserver/InternalScan.java
A src/main/java/org/apache/hadoop/hbase/regionserver/HRegionServer.java
A src/main/java/org/apache/hadoop/hbase/regionserver/KeyValueHeap.java
A src/main/java/org/apache/hadoop/hbase/regionserver/KeyValueSkipListSet.java
A src/main/java/org/apache/hadoop/hbase/regionserver/StoreFlusher.java
A src/main/java/org/apache/hadoop/hbase/regionserver/InternalScanner.java
A src/main/java/org/apache/hadoop/hbase/regionserver/TimeRangeTracker.java
A src/main/java/org/apache/hadoop/hbase/regionserver/RegionServerStoppedException.java
A src/main/java/org/apache/hadoop/hbase/regionserver/HRegionServerCommandLine.java
A src/main/java/org/apache/hadoop/hbase/regionserver/RegionServerRunningException.java
A src/main/java/org/apache/hadoop/hbase/regionserver/ShutdownHook.java
A src/main/java/org/apache/hadoop/hbase/regionserver/handler
A src/main/java/org/apache/hadoop/hbase/regionserver/handler/OpenRegionHandler.java
A src/main/java/org/apache/hadoop/hbase/regionserver/handler/OpenRootHandler.java
A src/main/java/org/apache/hadoop/hbase/regionserver/handler/OpenMetaHandler.java
A src/main/java/org/apache/hadoop/hbase/regionserver/handler/CloseRegionHandler.java
A src/main/java/org/apache/hadoop/hbase/regionserver/handler/CloseRootHandler.java
A src/main/java/org/apache/hadoop/hbase/regionserver/handler/CloseMetaHandler.java
A src/main/java/org/apache/hadoop/hbase/regionserver/NoSuchColumnFamilyException.java
A src/main/java/org/apache/hadoop/hbase/regionserver/LeaseListener.java
A src/main/java/org/apache/hadoop/hbase/regionserver/LogRoller.java
A src/main/java/org/apache/hadoop/hbase/regionserver/wal
A src/main/java/org/apache/hadoop/hbase/regionserver/wal/HLogSplitter.java
A src/main/java/org/apache/hadoop/hbase/regionserver/wal/HLogKey.java
A src/main/java/org/apache/hadoop/hbase/regionserver/wal/SequenceFileLogWriter.java
A src/main/java/org/apache/hadoop/hbase/regionserver/wal/HLog.java
A src/main/java/org/apache/hadoop/hbase/regionserver/wal/WALEdit.java
A src/main/java/org/apache/hadoop/hbase/regionserver/wal/FailedLogCloseException.java
A src/main/java/org/apache/hadoop/hbase/regionserver/wal/WALObserver.java
A src/main/java/org/apache/hadoop/hbase/regionserver/wal/SequenceFileLogReader.java
A src/main/java/org/apache/hadoop/hbase/regionserver/wal/OrphanHLogAfterSplitException.java
A src/main/java/org/apache/hadoop/hbase/regionserver/DebugPrint.java
A src/main/java/org/apache/hadoop/hbase/regionserver/LruHashMap.java
A src/main/java/org/apache/hadoop/hbase/regionserver/CompactionRequestor.java
A src/main/java/org/apache/hadoop/hbase/regionserver/StoreFileScanner.java
A src/main/java/org/apache/hadoop/hbase/regionserver/StoreScanner.java
A src/main/java/org/apache/hadoop/hbase/regionserver/ChangedReadersObserver.java
A src/main/java/org/apache/hadoop/hbase/regionserver/ExplicitColumnTracker.java
A src/main/java/org/apache/hadoop/hbase/regionserver/RegionServerServices.java
A src/main/java/org/apache/hadoop/hbase/regionserver/DeleteTracker.java
ERROR: Failed to check out https://svn.apache.org/repos/asf/hbase/branches/0.90
org.tmatesoft.svn.core.SVNException: svn: CRLF expected at end of chunk: -1/-1
svn: REPORT request failed on '/repos/asf/!svn/vcc/default'
at org.tmatesoft.svn.core.internal.wc.SVNErrorManager.error(SVNErrorManager.java:106)
at org.tmatesoft.svn.core.internal.wc.SVNErrorManager.error(SVNErrorManager.java:90)
at org.tmatesoft.svn.core.internal.io.dav.http.HTTPConnection.request(HTTPConnection.java:629)
at org.tmatesoft.svn.core.internal.io.dav.http.HTTPConnection.request(HTTPConnection.java:275)
at org.tmatesoft.svn.core.internal.io.dav.http.HTTPConnection.request(HTTPConnection.java:263)
at org.tmatesoft.svn.core.internal.io.dav.DAVConnection.doReport(DAVConnection.java:266)
at org.tmatesoft.svn.core.internal.io.dav.DAVRepository.runReport(DAVRepository.java:1263)
at org.tmatesoft.svn.core.internal.io.dav.DAVRepository.update(DAVRepository.java:820)
at org.tmatesoft.svn.core.wc.SVNUpdateClient.update(SVNUpdateClient.java:564)
at org.tmatesoft.svn.core.wc.SVNUpdateClient.doCheckout(SVNUpdateClient.java:922)
at hudson.scm.subversion.CheckoutUpdater$1.perform(CheckoutUpdater.java:83)
at hudson.scm.subversion.WorkspaceUpdater$UpdateTask.delegateTo(WorkspaceUpdater.java:137)
at hudson.scm.SubversionSCM$CheckOutTask.perform(SubversionSCM.java:725)
at hudson.scm.SubversionSCM$CheckOutTask.invoke(SubversionSCM.java:706)
at hudson.scm.SubversionSCM$CheckOutTask.invoke(SubversionSCM.java:690)
at hudson.FilePath$FileCallableWrapper.call(FilePath.java:1940)
at hudson.remoting.UserRequest.perform(UserRequest.java:114)
at hudson.remoting.UserRequest.perform(UserRequest.java:48)
at hudson.remoting.Request$2.run(Request.java:270)
at java.util.concurrent.Executors$RunnableAdapter.call(Executors.java:471)
at java.util.concurrent.FutureTask$Sync.innerRun(FutureTask.java:334)
at java.util.concurrent.FutureTask.run(FutureTask.java:166)
at java.util.concurrent.ThreadPoolExecutor.runWorker(ThreadPoolExecutor.java:1110)
at java.util.concurrent.ThreadPoolExecutor$Worker.run(ThreadPoolExecutor.java:603)
at java.lang.Thread.run(Thread.java:636)
Caused by: java.io.IOException: CRLF expected at end of chunk: -1/-1
at org.tmatesoft.svn.core.internal.util.ChunkedInputStream.readCRLF(ChunkedInputStream.java:83)
at org.tmatesoft.svn.core.internal.util.ChunkedInputStream.nextChunk(ChunkedInputStream.java:90)
at org.tmatesoft.svn.core.internal.util.ChunkedInputStream.read(ChunkedInputStream.java:64)
at java.util.zip.InflaterInputStream.fill(InflaterInputStream.java:238)
at java.util.zip.InflaterInputStream.read(InflaterInputStream.java:158)
at java.util.zip.GZIPInputStream.read(GZIPInputStream.java:109)
at sun.nio.cs.StreamDecoder.readBytes(StreamDecoder.java:282)
at sun.nio.cs.StreamDecoder.implRead(StreamDecoder.java:324)
at sun.nio.cs.StreamDecoder.read(StreamDecoder.java:176)
at java.io.InputStreamReader.read(InputStreamReader.java:184)
at org.tmatesoft.svn.core.internal.io.dav.http.XMLReader.read(XMLReader.java:39)
at com.sun.org.apache.xerces.internal.impl.XMLEntityScanner.load(XMLEntityScanner.java:1719)
at com.sun.org.apache.xerces.internal.impl.XMLEntityScanner.skipChar(XMLEntityScanner.java:1393)
at com.sun.org.apache.xerces.internal.impl.XMLDocumentFragmentScannerImpl$FragmentContentDriver.next(XMLDocumentFragmentScannerImpl.java:2769)
at com.sun.org.apache.xerces.internal.impl.XMLDocumentScannerImpl.next(XMLDocumentScannerImpl.java:625)
at com.sun.org.apache.xerces.internal.impl.XMLNSDocumentScannerImpl.next(XMLNSDocumentScannerImpl.java:116)
at com.sun.org.apache.xerces.internal.impl.XMLDocumentFragmentScannerImpl.scanDocument(XMLDocumentFragmentScannerImpl.java:488)
at com.sun.org.apache.xerces.internal.parsers.XML11Configuration.parse(XML11Configuration.java:812)
at com.sun.org.apache.xerces.internal.parsers.XML11Configuration.parse(XML11Configuration.java:741)
at com.sun.org.apache.xerces.internal.parsers.XMLParser.parse(XMLParser.java:123)
at com.sun.org.apache.xerces.internal.parsers.AbstractSAXParser.parse(AbstractSAXParser.java:1208)
at com.sun.org.apache.xerces.internal.jaxp.SAXParserImpl$JAXPSAXParser.parse(SAXParserImpl.java:525)
at org.tmatesoft.svn.core.internal.io.dav.http.HTTPConnection.readData(HTTPConnection.java:739)
at org.tmatesoft.svn.core.internal.io.dav.http.HTTPConnection.readData(HTTPConnection.java:704)
at org.tmatesoft.svn.core.internal.io.dav.http.HTTPRequest.dispatch(HTTPRequest.java:216)
at org.tmatesoft.svn.core.internal.io.dav.http.HTTPConnection.request(HTTPConnection.java:351)
... 22 more
Archiving artifacts
Recording test results
Jenkins build is back to normal : hbase-0.90 #131
Posted by Apache Hudson Server <hu...@hudson.apache.org>.
See <https://hudson.apache.org/hudson/job/hbase-0.90/131/changes>
Build failed in Jenkins: hbase-0.90 #130
Posted by Apache Hudson Server <hu...@hudson.apache.org>.
See <https://hudson.apache.org/hudson/job/hbase-0.90/130/>
------------------------------------------
[...truncated 2813 lines...]
Tests run: 1, Failures: 0, Errors: 0, Skipped: 0, Time elapsed: 2.048 sec
Running org.apache.hadoop.hbase.client.TestFromClientSide
Tests run: 41, Failures: 0, Errors: 0, Skipped: 3, Time elapsed: 300.266 sec
Running org.apache.hadoop.hbase.replication.TestReplication
Tests run: 7, Failures: 0, Errors: 0, Skipped: 0, Time elapsed: 183.602 sec
Running org.apache.hadoop.hbase.regionserver.TestCompaction
Tests run: 9, Failures: 0, Errors: 0, Skipped: 0, Time elapsed: 152.423 sec
Running org.apache.hadoop.hbase.filter.TestSingleColumnValueFilter
Tests run: 2, Failures: 0, Errors: 0, Skipped: 0, Time elapsed: 0.033 sec
Running org.apache.hadoop.hbase.mapreduce.TestTimeRangeMapRed
Tests run: 1, Failures: 0, Errors: 0, Skipped: 0, Time elapsed: 32.158 sec
Running org.apache.hadoop.hbase.zookeeper.TestZooKeeperMainServerArg
Tests run: 1, Failures: 0, Errors: 0, Skipped: 0, Time elapsed: 0.025 sec
Running org.apache.hadoop.hbase.mapreduce.TestSimpleTotalOrderPartitioner
Tests run: 1, Failures: 0, Errors: 0, Skipped: 0, Time elapsed: 0.084 sec
Running org.apache.hadoop.hbase.master.TestClockSkewDetection
Tests run: 1, Failures: 0, Errors: 0, Skipped: 0, Time elapsed: 0.033 sec
Running org.apache.hadoop.hbase.mapreduce.TestHFileOutputFormat
Tests run: 5, Failures: 0, Errors: 0, Skipped: 0, Time elapsed: 173.773 sec
Running org.apache.hadoop.hbase.regionserver.TestFSErrorsExposed
Tests run: 3, Failures: 0, Errors: 0, Skipped: 0, Time elapsed: 33.898 sec
Running org.apache.hadoop.hbase.client.replication.TestReplicationAdmin
Tests run: 1, Failures: 0, Errors: 0, Skipped: 0, Time elapsed: 0.838 sec
Running org.apache.hadoop.hbase.regionserver.TestScanDeleteTracker
Tests run: 6, Failures: 0, Errors: 0, Skipped: 0, Time elapsed: 0.113 sec
Running org.apache.hadoop.hbase.client.TestMetaScanner
Tests run: 1, Failures: 0, Errors: 0, Skipped: 0, Time elapsed: 32.729 sec
Running org.apache.hadoop.hbase.metrics.TestMetricsMBeanBase
Tests run: 2, Failures: 0, Errors: 0, Skipped: 0, Time elapsed: 0.035 sec
Running org.apache.hadoop.hbase.TestRegionRebalancing
Tests run: 1, Failures: 0, Errors: 0, Skipped: 0, Time elapsed: 86.237 sec
Running org.apache.hadoop.hbase.filter.TestSingleColumnValueExcludeFilter
Tests run: 1, Failures: 0, Errors: 0, Skipped: 0, Time elapsed: 0.016 sec
Running org.apache.hadoop.hbase.filter.TestInclusiveStopFilter
Tests run: 2, Failures: 0, Errors: 0, Skipped: 0, Time elapsed: 0.016 sec
Running org.apache.hadoop.hbase.rest.TestTableResource
Tests run: 8, Failures: 0, Errors: 0, Skipped: 0, Time elapsed: 63.526 sec
Running org.apache.hadoop.hbase.TestHBaseTestingUtility
Tests run: 5, Failures: 0, Errors: 0, Skipped: 0, Time elapsed: 82.735 sec
Running org.apache.hadoop.hbase.mapreduce.TestLoadIncrementalHFiles
Tests run: 3, Failures: 0, Errors: 0, Skipped: 0, Time elapsed: 54.326 sec
Running org.apache.hadoop.hbase.rest.TestSchemaResource
Tests run: 2, Failures: 0, Errors: 0, Skipped: 0, Time elapsed: 52.476 sec
Running org.apache.hadoop.hbase.regionserver.wal.TestWALReplay
Tests run: 4, Failures: 0, Errors: 0, Skipped: 0, Time elapsed: 36.74 sec
Running org.apache.hadoop.hbase.regionserver.TestKeyValueScanFixture
Tests run: 1, Failures: 0, Errors: 0, Skipped: 0, Time elapsed: 0.015 sec
Running org.apache.hadoop.hbase.rest.model.TestTableListModel
Tests run: 3, Failures: 0, Errors: 0, Skipped: 0, Time elapsed: 0.126 sec
Running org.apache.hadoop.hbase.rest.model.TestColumnSchemaModel
Tests run: 2, Failures: 0, Errors: 0, Skipped: 0, Time elapsed: 0.03 sec
Running org.apache.hadoop.hbase.regionserver.TestStoreFile
Tests run: 7, Failures: 0, Errors: 0, Skipped: 0, Time elapsed: 43.443 sec
Running org.apache.hadoop.hbase.zookeeper.TestZooKeeperNodeTracker
Tests run: 2, Failures: 0, Errors: 0, Skipped: 0, Time elapsed: 0.457 sec
Running org.apache.hadoop.hbase.rest.model.TestScannerModel
Tests run: 3, Failures: 0, Errors: 0, Skipped: 0, Time elapsed: 0.126 sec
Running org.apache.hadoop.hbase.regionserver.wal.TestHLogMethods
Tests run: 3, Failures: 0, Errors: 0, Skipped: 0, Time elapsed: 0.5 sec
Running org.apache.hadoop.hbase.rest.TestVersionResource
Tests run: 7, Failures: 0, Errors: 0, Skipped: 0, Time elapsed: 23.479 sec
Running org.apache.hadoop.hbase.filter.TestFilter
Tests run: 18, Failures: 0, Errors: 0, Skipped: 0, Time elapsed: 3.176 sec
Running org.apache.hadoop.hbase.regionserver.TestWideScanner
Tests run: 1, Failures: 0, Errors: 0, Skipped: 0, Time elapsed: 24.944 sec
Running org.apache.hadoop.hbase.regionserver.TestSplitTransaction
Tests run: 5, Failures: 0, Errors: 0, Skipped: 0, Time elapsed: 2.981 sec
Running org.apache.hadoop.hbase.replication.regionserver.TestReplicationSink
Tests run: 5, Failures: 0, Errors: 0, Skipped: 0, Time elapsed: 33.186 sec
Running org.apache.hadoop.hbase.regionserver.TestGetClosestAtOrBefore
Tests run: 3, Failures: 0, Errors: 0, Skipped: 0, Time elapsed: 11.856 sec
Running org.apache.hadoop.hbase.regionserver.TestReadWriteConsistencyControl
Tests run: 1, Failures: 0, Errors: 0, Skipped: 0, Time elapsed: 10.021 sec
Running org.apache.hadoop.hbase.util.TestMergeTable
Tests run: 1, Failures: 0, Errors: 0, Skipped: 0, Time elapsed: 63.689 sec
Running org.apache.hadoop.hbase.rest.model.TestVersionModel
Tests run: 3, Failures: 0, Errors: 0, Skipped: 0, Time elapsed: 0.126 sec
Running org.apache.hadoop.hbase.rest.model.TestCellSetModel
Tests run: 3, Failures: 0, Errors: 0, Skipped: 0, Time elapsed: 0.137 sec
Running org.apache.hadoop.hbase.rest.client.TestRemoteTable
Tests run: 3, Failures: 0, Errors: 0, Skipped: 0, Time elapsed: 41.094 sec
Running org.apache.hadoop.hbase.rest.model.TestStorageClusterStatusModel
Tests run: 3, Failures: 0, Errors: 0, Skipped: 0, Time elapsed: 0.132 sec
Running org.apache.hadoop.hbase.avro.TestAvroServer
Tests run: 3, Failures: 0, Errors: 0, Skipped: 0, Time elapsed: 79.969 sec
Running org.apache.hadoop.hbase.TestFullLogReconstruction
Tests run: 1, Failures: 0, Errors: 0, Skipped: 0, Time elapsed: 102.957 sec
Running org.apache.hadoop.hbase.TestSerialization
Tests run: 19, Failures: 0, Errors: 0, Skipped: 0, Time elapsed: 0.059 sec
Running org.apache.hadoop.hbase.regionserver.TestKeyValueHeap
Tests run: 3, Failures: 0, Errors: 0, Skipped: 0, Time elapsed: 0.095 sec
Running org.apache.hadoop.hbase.regionserver.TestStoreScanner
Tests run: 14, Failures: 0, Errors: 0, Skipped: 0, Time elapsed: 0.033 sec
Running org.apache.hadoop.hbase.TestHMsg
Tests run: 2, Failures: 0, Errors: 0, Skipped: 0, Time elapsed: 0.021 sec
Running org.apache.hadoop.hbase.io.hfile.TestReseekTo
Tests run: 1, Failures: 0, Errors: 0, Skipped: 0, Time elapsed: 0.204 sec
Running org.apache.hadoop.hbase.regionserver.TestHRegionInfo
Tests run: 2, Failures: 0, Errors: 0, Skipped: 0, Time elapsed: 0.017 sec
Running org.apache.hadoop.hbase.util.TestIncrementingEnvironmentEdge
Tests run: 1, Failures: 0, Errors: 0, Skipped: 0, Time elapsed: 0.016 sec
Running org.apache.hadoop.hbase.util.TestKeying
Tests run: 1, Failures: 0, Errors: 0, Skipped: 0, Time elapsed: 0.016 sec
Running org.apache.hadoop.hbase.regionserver.TestScanner
Tests run: 6, Failures: 0, Errors: 0, Skipped: 0, Time elapsed: 70.946 sec
Running org.apache.hadoop.hbase.util.TestHBaseFsck
Tests run: 1, Failures: 0, Errors: 0, Skipped: 0, Time elapsed: 33.819 sec
Running org.apache.hadoop.hbase.master.TestRestartCluster
Tests run: 2, Failures: 0, Errors: 0, Skipped: 0, Time elapsed: 95.725 sec
Running org.apache.hadoop.hbase.client.TestShell
Tests run: 1, Failures: 0, Errors: 0, Skipped: 0, Time elapsed: 135.175 sec
Running org.apache.hadoop.hbase.rest.model.TestTableInfoModel
Tests run: 3, Failures: 0, Errors: 0, Skipped: 0, Time elapsed: 0.128 sec
Running org.apache.hadoop.hbase.TestInfoServers
Tests run: 1, Failures: 0, Errors: 0, Skipped: 0, Time elapsed: 36.434 sec
Running org.apache.hadoop.hbase.master.TestLogsCleaner
Tests run: 1, Failures: 0, Errors: 0, Skipped: 0, Time elapsed: 1.262 sec
Running org.apache.hadoop.hbase.regionserver.TestMasterAddressManager
Tests run: 1, Failures: 0, Errors: 0, Skipped: 0, Time elapsed: 0.371 sec
Running org.apache.hadoop.hbase.catalog.TestCatalogTrackerOnCluster
Tests run: 1, Failures: 0, Errors: 0, Skipped: 0, Time elapsed: 103.931 sec
Running org.apache.hadoop.hbase.regionserver.TestQueryMatcher
Tests run: 4, Failures: 0, Errors: 0, Skipped: 0, Time elapsed: 0.105 sec
Running org.apache.hadoop.hbase.zookeeper.TestZKTable
Tests run: 1, Failures: 0, Errors: 0, Skipped: 0, Time elapsed: 0.35 sec
Running org.apache.hadoop.hbase.client.TestAdmin
Tests run: 16, Failures: 0, Errors: 1, Skipped: 0, Time elapsed: 610.34 sec <<< FAILURE!
Running org.apache.hadoop.hbase.regionserver.TestPriorityCompactionQueue
Tests run: 1, Failures: 0, Errors: 0, Skipped: 0, Time elapsed: 1.075 sec
Running org.apache.hadoop.hbase.util.TestMergeTool
Tests run: 1, Failures: 0, Errors: 0, Skipped: 0, Time elapsed: 39.271 sec
Running org.apache.hadoop.hbase.TestAcidGuarantees
Tests run: 3, Failures: 0, Errors: 0, Skipped: 3, Time elapsed: 0.015 sec
Running org.apache.hadoop.hbase.util.TestBase64
Tests run: 1, Failures: 0, Errors: 0, Skipped: 0, Time elapsed: 0.017 sec
Running org.apache.hadoop.hbase.regionserver.TestMemStore
Tests run: 21, Failures: 0, Errors: 0, Skipped: 0, Time elapsed: 51.343 sec
Running org.apache.hadoop.hbase.rest.TestScannerResource
Tests run: 5, Failures: 0, Errors: 0, Skipped: 0, Time elapsed: 60.283 sec
Running org.apache.hadoop.hbase.io.hfile.TestLruBlockCache
Tests run: 7, Failures: 0, Errors: 0, Skipped: 0, Time elapsed: 1.054 sec
Running org.apache.hadoop.hbase.master.TestDeadServer
Tests run: 1, Failures: 0, Errors: 0, Skipped: 0, Time elapsed: 0.018 sec
Running org.apache.hadoop.hbase.rest.TestGzipFilter
Tests run: 2, Failures: 0, Errors: 0, Skipped: 0, Time elapsed: 25.36 sec
Running org.apache.hadoop.hbase.mapreduce.TestTableMapReduce
Tests run: 2, Failures: 0, Errors: 0, Skipped: 0, Time elapsed: 112.796 sec
Running org.apache.hadoop.hbase.TestKeyValue
Tests run: 9, Failures: 0, Errors: 0, Skipped: 0, Time elapsed: 0.024 sec
Running org.apache.hadoop.hbase.client.TestMultiParallel
Tests run: 10, Failures: 0, Errors: 0, Skipped: 0, Time elapsed: 75.726 sec
Running org.apache.hadoop.hbase.master.TestMaster
Tests run: 1, Failures: 0, Errors: 0, Skipped: 0, Time elapsed: 101.313 sec
Running org.apache.hadoop.hbase.master.TestRollingRestart
Tests run: 1, Failures: 0, Errors: 0, Skipped: 0, Time elapsed: 82.078 sec
Running org.apache.hadoop.hbase.client.TestResult
Tests run: 2, Failures: 0, Errors: 0, Skipped: 0, Time elapsed: 0.038 sec
Running org.apache.hadoop.hbase.client.TestHTablePool
Tests run: 5, Failures: 0, Errors: 0, Skipped: 0, Time elapsed: 44.573 sec
Running org.apache.hadoop.hbase.rest.model.TestTableSchemaModel
Tests run: 3, Failures: 0, Errors: 0, Skipped: 0, Time elapsed: 0.135 sec
Running org.apache.hadoop.hbase.util.TestByteBloomFilter
Tests run: 3, Failures: 0, Errors: 0, Skipped: 0, Time elapsed: 1.616 sec
Running org.apache.hadoop.hbase.filter.TestFilterList
Tests run: 4, Failures: 0, Errors: 0, Skipped: 0, Time elapsed: 0.039 sec
Running org.apache.hadoop.hbase.mapreduce.TestTableInputFormatScan
Tests run: 11, Failures: 0, Errors: 0, Skipped: 0, Time elapsed: 350.207 sec
Running org.apache.hadoop.hbase.regionserver.TestHRegion
Tests run: 54, Failures: 0, Errors: 0, Skipped: 0, Time elapsed: 39.188 sec
Running org.apache.hadoop.hbase.master.TestMasterFailover
Tests run: 3, Failures: 0, Errors: 0, Skipped: 0, Time elapsed: 78.165 sec
Running org.apache.hadoop.hbase.rest.model.TestTableRegionModel
Tests run: 4, Failures: 0, Errors: 0, Skipped: 0, Time elapsed: 0.032 sec
Running org.apache.hadoop.hbase.client.TestTimestampsFilter
Tests run: 2, Failures: 0, Errors: 0, Skipped: 0, Time elapsed: 43.178 sec
Running org.apache.hadoop.hbase.master.TestLoadBalancer
Tests run: 5, Failures: 0, Errors: 0, Skipped: 0, Time elapsed: 2.226 sec
Running org.apache.hadoop.hbase.util.TestRootPath
Tests run: 1, Failures: 0, Errors: 0, Skipped: 0, Time elapsed: 0.02 sec
Running org.apache.hadoop.hbase.client.TestScannerTimeout
Tests run: 2, Failures: 0, Errors: 0, Skipped: 0, Time elapsed: 52.564 sec
Running org.apache.hadoop.hbase.mapred.TestTableMapReduce
Tests run: 1, Failures: 0, Errors: 0, Skipped: 0, Time elapsed: 54.545 sec
Running org.apache.hadoop.hbase.regionserver.wal.TestWALObserver
Tests run: 1, Failures: 0, Errors: 0, Skipped: 0, Time elapsed: 0.424 sec
Running org.apache.hadoop.hbase.master.TestActiveMasterManager
Tests run: 2, Failures: 0, Errors: 0, Skipped: 0, Time elapsed: 0.505 sec
Running org.apache.hadoop.hbase.replication.regionserver.TestReplicationSourceManager
Tests run: 1, Failures: 0, Errors: 0, Skipped: 0, Time elapsed: 2.958 sec
Running org.apache.hadoop.hbase.util.TestBytes
Tests run: 10, Failures: 0, Errors: 0, Skipped: 0, Time elapsed: 0.022 sec
Running org.apache.hadoop.hbase.util.TestCompressionTest
Tests run: 1, Failures: 0, Errors: 0, Skipped: 0, Time elapsed: 0.029 sec
Running org.apache.hadoop.hbase.client.TestGetRowVersions
Tests run: 1, Failures: 0, Errors: 0, Skipped: 0, Time elapsed: 43.321 sec
Running org.apache.hadoop.hbase.filter.TestDependentColumnFilter
Tests run: 2, Failures: 0, Errors: 0, Skipped: 0, Time elapsed: 0.366 sec
Running org.apache.hadoop.hbase.rest.model.TestCellModel
Tests run: 3, Failures: 0, Errors: 0, Skipped: 0, Time elapsed: 0.126 sec
Running org.apache.hadoop.hbase.master.TestCatalogJanitor
Tests run: 2, Failures: 0, Errors: 0, Skipped: 0, Time elapsed: 0.521 sec
Running org.apache.hadoop.hbase.catalog.TestCatalogTracker
Tests run: 8, Failures: 0, Errors: 0, Skipped: 0, Time elapsed: 3.232 sec
Running org.apache.hadoop.hbase.replication.TestReplicationSource
Tests run: 1, Failures: 0, Errors: 0, Skipped: 0, Time elapsed: 4.851 sec
Running org.apache.hadoop.hbase.rest.TestRowResource
Tests run: 10, Failures: 0, Errors: 0, Skipped: 0, Time elapsed: 29.684 sec
Running org.apache.hadoop.hbase.io.hfile.TestHFile
Tests run: 7, Failures: 0, Errors: 0, Skipped: 0, Time elapsed: 0.372 sec
Running org.apache.hadoop.hbase.catalog.TestMetaReaderEditor
Tests run: 4, Failures: 0, Errors: 0, Skipped: 0, Time elapsed: 50.205 sec
Running org.apache.hadoop.hbase.mapreduce.TestImportTsv
Tests run: 7, Failures: 0, Errors: 0, Skipped: 0, Time elapsed: 31.679 sec
Running org.apache.hadoop.hbase.rest.client.TestRemoteAdmin
Tests run: 2, Failures: 0, Errors: 0, Skipped: 0, Time elapsed: 46.05 sec
Running org.apache.hadoop.hbase.regionserver.wal.TestHLog
Tests run: 8, Failures: 0, Errors: 0, Skipped: 0, Time elapsed: 86.793 sec
Running org.apache.hadoop.hbase.client.TestTimestamp
Tests run: 1, Failures: 0, Errors: 0, Skipped: 0, Time elapsed: 26.055 sec
Running org.apache.hadoop.hbase.TestScanMultipleVersions
Tests run: 1, Failures: 0, Errors: 0, Skipped: 0, Time elapsed: 20.655 sec
Running org.apache.hadoop.hbase.rest.model.TestStorageClusterVersionModel
Tests run: 2, Failures: 0, Errors: 0, Skipped: 0, Time elapsed: 0.03 sec
Running org.apache.hadoop.hbase.client.TestHCM
Tests run: 2, Failures: 0, Errors: 0, Skipped: 0, Time elapsed: 41.766 sec
Results :
Tests in error:
Tests run: 629, Failures: 0, Errors: 1, Skipped: 9
[INFO] ------------------------------------------------------------------------
[ERROR] BUILD FAILURE
[INFO] ------------------------------------------------------------------------
[INFO] There are test failures.
Please refer to <https://hudson.apache.org/hudson/job/hbase-0.90/ws/trunk/target/surefire-reports> for the individual test results.
[INFO] ------------------------------------------------------------------------
[INFO] For more information, run Maven with the -e switch
[INFO] ------------------------------------------------------------------------
[INFO] Total time: 97 minutes 41 seconds
[INFO] Finished at: Wed Mar 23 05:30:14 UTC 2011
[INFO] Final Memory: 87M/1165M
[INFO] ------------------------------------------------------------------------
[locks-and-latches] Releasing all the locks
[locks-and-latches] All the locks released
Archiving artifacts
Recording test results