You are viewing a plain text version of this content. The canonical link for it is here.
Posted to dev@kafka.apache.org by Apache Jenkins Server <je...@builds.apache.org> on 2017/05/31 23:34:24 UTC

Build failed in Jenkins: kafka-0.11.0-jdk7 #62

See <https://builds.apache.org/job/kafka-0.11.0-jdk7/62/display/redirect?page=changes>

Changes:

[wangguoz] MINOR: Improve streams config parameters

[wangguoz] KAFKA-5218; New Short serializer, deserializer, serde

------------------------------------------
[...truncated 905.87 KB...]
kafka.server.MultipleListenersWithDefaultJaasContextTest > testProduceConsume STARTED

kafka.server.MultipleListenersWithDefaultJaasContextTest > testProduceConsume PASSED

kafka.server.ThrottledResponseExpirationTest > testThrottledRequest STARTED

kafka.server.ThrottledResponseExpirationTest > testThrottledRequest PASSED

kafka.server.ThrottledResponseExpirationTest > testExpire STARTED

kafka.server.ThrottledResponseExpirationTest > testExpire PASSED

kafka.server.ReplicaManagerQuotasTest > shouldGetBothMessagesIfQuotasAllow STARTED

kafka.server.ReplicaManagerQuotasTest > shouldGetBothMessagesIfQuotasAllow PASSED

kafka.server.ReplicaManagerQuotasTest > shouldExcludeSubsequentThrottledPartitions STARTED

kafka.server.ReplicaManagerQuotasTest > shouldExcludeSubsequentThrottledPartitions PASSED

kafka.server.ReplicaManagerQuotasTest > shouldGetNoMessagesIfQuotasExceededOnSubsequentPartitions STARTED

kafka.server.ReplicaManagerQuotasTest > shouldGetNoMessagesIfQuotasExceededOnSubsequentPartitions PASSED

kafka.server.ReplicaManagerQuotasTest > shouldIncludeInSyncThrottledReplicas STARTED

kafka.server.ReplicaManagerQuotasTest > shouldIncludeInSyncThrottledReplicas PASSED

kafka.server.SaslApiVersionsRequestTest > testApiVersionsRequestWithUnsupportedVersion STARTED

kafka.server.SaslApiVersionsRequestTest > testApiVersionsRequestWithUnsupportedVersion PASSED

kafka.server.SaslApiVersionsRequestTest > testApiVersionsRequestBeforeSaslHandshakeRequest STARTED

kafka.server.SaslApiVersionsRequestTest > testApiVersionsRequestBeforeSaslHandshakeRequest PASSED

kafka.server.SaslApiVersionsRequestTest > testApiVersionsRequestAfterSaslHandshakeRequest STARTED

kafka.server.SaslApiVersionsRequestTest > testApiVersionsRequestAfterSaslHandshakeRequest PASSED

kafka.server.ControlledShutdownLeaderSelectorTest > testSelectLeader STARTED

kafka.server.ControlledShutdownLeaderSelectorTest > testSelectLeader PASSED

kafka.server.MetadataCacheTest > getTopicMetadataWithNonSupportedSecurityProtocol STARTED

kafka.server.MetadataCacheTest > getTopicMetadataWithNonSupportedSecurityProtocol PASSED

kafka.server.MetadataCacheTest > getTopicMetadataIsrNotAvailable STARTED

kafka.server.MetadataCacheTest > getTopicMetadataIsrNotAvailable PASSED

kafka.server.MetadataCacheTest > getTopicMetadata STARTED

kafka.server.MetadataCacheTest > getTopicMetadata PASSED

kafka.server.MetadataCacheTest > getTopicMetadataReplicaNotAvailable STARTED

kafka.server.MetadataCacheTest > getTopicMetadataReplicaNotAvailable PASSED

kafka.server.MetadataCacheTest > getTopicMetadataPartitionLeaderNotAvailable STARTED

kafka.server.MetadataCacheTest > getTopicMetadataPartitionLeaderNotAvailable PASSED

kafka.server.MetadataCacheTest > getAliveBrokersShouldNotBeMutatedByUpdateCache STARTED

kafka.server.MetadataCacheTest > getAliveBrokersShouldNotBeMutatedByUpdateCache PASSED

kafka.server.MetadataCacheTest > getTopicMetadataNonExistingTopics STARTED

kafka.server.MetadataCacheTest > getTopicMetadataNonExistingTopics PASSED

kafka.server.FetchRequestTest > testBrokerRespectsPartitionsOrderAndSizeLimits STARTED

kafka.server.FetchRequestTest > testBrokerRespectsPartitionsOrderAndSizeLimits PASSED

kafka.server.FetchRequestTest > testFetchRequestV2WithOversizedMessage STARTED

kafka.server.FetchRequestTest > testFetchRequestV2WithOversizedMessage PASSED

kafka.server.checkpoints.OffsetCheckpointFileTest > shouldReturnEmptyMapForEmptyFile STARTED

kafka.server.checkpoints.OffsetCheckpointFileTest > shouldReturnEmptyMapForEmptyFile PASSED

kafka.server.checkpoints.OffsetCheckpointFileTest > shouldThrowIfVersionIsNotRecognised STARTED

kafka.server.checkpoints.OffsetCheckpointFileTest > shouldThrowIfVersionIsNotRecognised PASSED

kafka.server.checkpoints.OffsetCheckpointFileTest > shouldPersistAndOverwriteAndReloadFile STARTED

kafka.server.checkpoints.OffsetCheckpointFileTest > shouldPersistAndOverwriteAndReloadFile PASSED

kafka.server.checkpoints.OffsetCheckpointFileTest > shouldHandleMultipleLines STARTED

kafka.server.checkpoints.OffsetCheckpointFileTest > shouldHandleMultipleLines PASSED

kafka.server.checkpoints.LeaderEpochCheckpointFileTest > shouldPersistAndOverwriteAndReloadFile STARTED

kafka.server.checkpoints.LeaderEpochCheckpointFileTest > shouldPersistAndOverwriteAndReloadFile PASSED

kafka.server.checkpoints.LeaderEpochCheckpointFileTest > shouldRetainValuesEvenIfCheckpointIsRecreated STARTED

kafka.server.checkpoints.LeaderEpochCheckpointFileTest > shouldRetainValuesEvenIfCheckpointIsRecreated PASSED

kafka.server.ReplicaFetchTest > testReplicaFetcherThread STARTED

kafka.server.ReplicaFetchTest > testReplicaFetcherThread PASSED

kafka.server.KafkaMetricReporterClusterIdTest > testClusterIdPresent STARTED

kafka.server.KafkaMetricReporterClusterIdTest > testClusterIdPresent PASSED

unit.kafka.admin.ResetConsumerGroupOffsetTest > testResetOffsetsShiftByHigherThanLatest STARTED
ERROR: Could not install GRADLE_3_4_RC_2_HOME
java.lang.NullPointerException

unit.kafka.admin.ResetConsumerGroupOffsetTest > testResetOffsetsShiftByHigherThanLatest PASSED

unit.kafka.admin.ResetConsumerGroupOffsetTest > testResetOffsetsShiftMinus STARTED

unit.kafka.admin.ResetConsumerGroupOffsetTest > testResetOffsetsShiftMinus PASSED

unit.kafka.admin.ResetConsumerGroupOffsetTest > testResetOffsetsToCurrentOffset STARTED

unit.kafka.admin.ResetConsumerGroupOffsetTest > testResetOffsetsToCurrentOffset PASSED

unit.kafka.admin.ResetConsumerGroupOffsetTest > testResetOffsetsToEarliestOnOneTopicAndPartition STARTED

unit.kafka.admin.ResetConsumerGroupOffsetTest > testResetOffsetsToEarliestOnOneTopicAndPartition PASSED

unit.kafka.admin.ResetConsumerGroupOffsetTest > testResetOffsetsByDurationToEarliest STARTED

unit.kafka.admin.ResetConsumerGroupOffsetTest > testResetOffsetsByDurationToEarliest PASSED

unit.kafka.admin.ResetConsumerGroupOffsetTest > testResetOffsetsToEarliestOnOneTopic STARTED

unit.kafka.admin.ResetConsumerGroupOffsetTest > testResetOffsetsToEarliestOnOneTopic PASSED

unit.kafka.admin.ResetConsumerGroupOffsetTest > testResetOffsetsNotExistingGroup STARTED

unit.kafka.admin.ResetConsumerGroupOffsetTest > testResetOffsetsNotExistingGroup PASSED

unit.kafka.admin.ResetConsumerGroupOffsetTest > testResetOffsetsToZonedDateTime STARTED

unit.kafka.admin.ResetConsumerGroupOffsetTest > testResetOffsetsToZonedDateTime PASSED

unit.kafka.admin.ResetConsumerGroupOffsetTest > testResetOffsetsToEarliest STARTED

unit.kafka.admin.ResetConsumerGroupOffsetTest > testResetOffsetsToEarliest PASSED

unit.kafka.admin.ResetConsumerGroupOffsetTest > testResetOffsetsExportImportPlan STARTED

unit.kafka.admin.ResetConsumerGroupOffsetTest > testResetOffsetsExportImportPlan PASSED

unit.kafka.admin.ResetConsumerGroupOffsetTest > testResetOffsetsToSpecificOffset STARTED

unit.kafka.admin.ResetConsumerGroupOffsetTest > testResetOffsetsToSpecificOffset PASSED

unit.kafka.admin.ResetConsumerGroupOffsetTest > testResetOffsetsShiftPlus STARTED

unit.kafka.admin.ResetConsumerGroupOffsetTest > testResetOffsetsShiftPlus PASSED

unit.kafka.admin.ResetConsumerGroupOffsetTest > testResetOffsetsToLatest STARTED

unit.kafka.admin.ResetConsumerGroupOffsetTest > testResetOffsetsToLatest PASSED

unit.kafka.admin.ResetConsumerGroupOffsetTest > testResetOffsetsNewConsumerExistingTopic STARTED

unit.kafka.admin.ResetConsumerGroupOffsetTest > testResetOffsetsNewConsumerExistingTopic PASSED

unit.kafka.admin.ResetConsumerGroupOffsetTest > testResetOffsetsShiftByLowerThanEarliest STARTED

unit.kafka.admin.ResetConsumerGroupOffsetTest > testResetOffsetsShiftByLowerThanEarliest PASSED

unit.kafka.admin.ResetConsumerGroupOffsetTest > testResetOffsetsByDuration STARTED

unit.kafka.admin.ResetConsumerGroupOffsetTest > testResetOffsetsByDuration PASSED

unit.kafka.admin.ResetConsumerGroupOffsetTest > testResetOffsetsToLocalDateTime STARTED

unit.kafka.admin.ResetConsumerGroupOffsetTest > testResetOffsetsToLocalDateTime PASSED

unit.kafka.admin.ResetConsumerGroupOffsetTest > testResetOffsetsToEarliestOnTopicsAndPartitions STARTED

unit.kafka.admin.ResetConsumerGroupOffsetTest > testResetOffsetsToEarliestOnTopicsAndPartitions PASSED

unit.kafka.admin.ResetConsumerGroupOffsetTest > testResetOffsetsToEarliestOnTopics STARTED

unit.kafka.admin.ResetConsumerGroupOffsetTest > testResetOffsetsToEarliestOnTopics PASSED

unit.kafka.server.KafkaApisTest > shouldRespondWithUnsupportedForMessageFormatOnHandleWriteTxnMarkersWhenMagicLowerThanRequired STARTED

unit.kafka.server.KafkaApisTest > shouldRespondWithUnsupportedForMessageFormatOnHandleWriteTxnMarkersWhenMagicLowerThanRequired PASSED

unit.kafka.server.KafkaApisTest > shouldThrowUnsupportedVersionExceptionOnHandleTxnOffsetCommitRequestWhenInterBrokerProtocolNotSupported STARTED

unit.kafka.server.KafkaApisTest > shouldThrowUnsupportedVersionExceptionOnHandleTxnOffsetCommitRequestWhenInterBrokerProtocolNotSupported PASSED

unit.kafka.server.KafkaApisTest > shouldThrowUnsupportedVersionExceptionOnHandleAddPartitionsToTxnRequestWhenInterBrokerProtocolNotSupported STARTED

unit.kafka.server.KafkaApisTest > shouldThrowUnsupportedVersionExceptionOnHandleAddPartitionsToTxnRequestWhenInterBrokerProtocolNotSupported PASSED

unit.kafka.server.KafkaApisTest > shouldAppendToLogOnWriteTxnMarkersWhenCorrectMagicVersion STARTED

unit.kafka.server.KafkaApisTest > shouldAppendToLogOnWriteTxnMarkersWhenCorrectMagicVersion PASSED

unit.kafka.server.KafkaApisTest > shouldThrowUnsupportedVersionExceptionOnHandleWriteTxnMarkersRequestWhenInterBrokerProtocolNotSupported STARTED

unit.kafka.server.KafkaApisTest > shouldThrowUnsupportedVersionExceptionOnHandleWriteTxnMarkersRequestWhenInterBrokerProtocolNotSupported PASSED

unit.kafka.server.KafkaApisTest > shouldThrowUnsupportedVersionExceptionOnHandleAddOffsetToTxnRequestWhenInterBrokerProtocolNotSupported STARTED

unit.kafka.server.KafkaApisTest > shouldThrowUnsupportedVersionExceptionOnHandleAddOffsetToTxnRequestWhenInterBrokerProtocolNotSupported PASSED

unit.kafka.server.KafkaApisTest > shouldRespondWithUnsupportedMessageFormatForBadPartitionAndNoErrorsForGoodPartition STARTED

unit.kafka.server.KafkaApisTest > shouldRespondWithUnsupportedMessageFormatForBadPartitionAndNoErrorsForGoodPartition PASSED

unit.kafka.server.KafkaApisTest > shouldThrowUnsupportedVersionExceptionOnHandleEndTxnRequestWhenInterBrokerProtocolNotSupported STARTED

unit.kafka.server.KafkaApisTest > shouldThrowUnsupportedVersionExceptionOnHandleEndTxnRequestWhenInterBrokerProtocolNotSupported PASSED

1406 tests completed, 1 failed, 5 skipped
:kafka-0.11.0-jdk7:core:test FAILED
:test_core_2_11 FAILED

FAILURE: Build failed with an exception.

* What went wrong:
Execution failed for task ':kafka-0.11.0-jdk7:core:test'.
> There were failing tests. See the report at: file://<https://builds.apache.org/job/kafka-0.11.0-jdk7/ws/core/build/reports/tests/test/index.html>

* Try:
Run with --stacktrace option to get the stack trace. Run with --info or --debug option to get more log output.

BUILD FAILED

Total time: 1 hrs 2 mins 42.347 secs
Build step 'Execute shell' marked build as failure
[FINDBUGS] Collecting findbugs analysis files...
Setting GRADLE_3_4_RC_2_HOME=/home/jenkins/jenkins-slave/tools/hudson.plugins.gradle.GradleInstallation/Gradle_3.4-rc-2
[FINDBUGS] Searching for all files in <https://builds.apache.org/job/kafka-0.11.0-jdk7/ws/> that match the pattern **/build/reports/findbugs/*.xml
[FINDBUGS] Parsing 1 file in <https://builds.apache.org/job/kafka-0.11.0-jdk7/ws/>
[FINDBUGS] Successfully parsed file <https://builds.apache.org/job/kafka-0.11.0-jdk7/ws/core/build/reports/findbugs/main.xml> with 0 unique warnings and 0 duplicates.
[FINDBUGS] Computing warning deltas based on reference build #61
Recording test results
Setting GRADLE_3_4_RC_2_HOME=/home/jenkins/jenkins-slave/tools/hudson.plugins.gradle.GradleInstallation/Gradle_3.4-rc-2
Setting GRADLE_3_4_RC_2_HOME=/home/jenkins/jenkins-slave/tools/hudson.plugins.gradle.GradleInstallation/Gradle_3.4-rc-2
Not sending mail to unregistered user wangguoz@gmail.com

Jenkins build is back to normal : kafka-0.11.0-jdk7 #63

Posted by Apache Jenkins Server <je...@builds.apache.org>.
See <https://builds.apache.org/job/kafka-0.11.0-jdk7/63/display/redirect?page=changes>