You are viewing a plain text version of this content. The canonical link for it is here.
Posted to builds@solr.apache.org by Apache Jenkins Server <je...@builds.apache.org> on 2024/01/13 15:55:00 UTC

[JENKINS] Solr » Solr-Check-9.x (Crave) - Build # 6196 - Still Failing!

Build: https://ci-builds.apache.org/job/Solr/job/Solr-Check-9.x%20(Crave)/6196/

No tests ran.

Build Log:
[...truncated 2739 lines...]
ERROR: The following test(s) have failed:
  - org.apache.solr.client.solrj.impl.CloudSolrClientTest.classMethod (:solr:solrj)
    Test output: /tmp/src/solr/solr/solrj/build/test-results/test/outputs/OUTPUT-org.apache.solr.client.solrj.impl.CloudSolrClientTest.txt
    Reproduce with: gradlew :solr:solrj:test --tests "org.apache.solr.client.solrj.impl.CloudSolrClientTest.classMethod" -Ptests.jvms=96 "-Ptests.jvmargs=-XX:TieredStopAtLevel=1 -XX:+UseParallelGC -XX:ActiveProcessorCount=1 -XX:ReservedCodeCacheSize=120m" -Ptests.seed=91D9A7D0BD59A062 -Ptests.file.encoding=ISO-8859-1

  - org.apache.solr.client.solrj.impl.CloudSolrClientTest.classMethod (:solr:solrj)
    Test output: /tmp/src/solr/solr/solrj/build/test-results/test/outputs/OUTPUT-org.apache.solr.client.solrj.impl.CloudSolrClientTest.txt
    Reproduce with: gradlew :solr:solrj:test --tests "org.apache.solr.client.solrj.impl.CloudSolrClientTest.classMethod" -Ptests.jvms=96 "-Ptests.jvmargs=-XX:TieredStopAtLevel=1 -XX:+UseParallelGC -XX:ActiveProcessorCount=1 -XX:ReservedCodeCacheSize=120m" -Ptests.seed=91D9A7D0BD59A062 -Ptests.file.encoding=ISO-8859-1

  - org.apache.solr.client.solrj.impl.CloudSolrClientTest.classMethod (:solr:solrj)
    Test output: /tmp/src/solr/solr/solrj/build/test-results/test/outputs/OUTPUT-org.apache.solr.client.solrj.impl.CloudSolrClientTest.txt
    Reproduce with: gradlew :solr:solrj:test --tests "org.apache.solr.client.solrj.impl.CloudSolrClientTest.classMethod" -Ptests.jvms=96 "-Ptests.jvmargs=-XX:TieredStopAtLevel=1 -XX:+UseParallelGC -XX:ActiveProcessorCount=1 -XX:ReservedCodeCacheSize=120m" -Ptests.seed=91D9A7D0BD59A062 -Ptests.file.encoding=ISO-8859-1

  - org.apache.solr.analytics.facet.QueryFacetTest.classMethod (:solr:modules:analytics)
    Test output: /tmp/src/solr/solr/modules/analytics/build/test-results/test/outputs/OUTPUT-org.apache.solr.analytics.facet.QueryFacetTest.txt
    Reproduce with: gradlew :solr:modules:analytics:test --tests "org.apache.solr.analytics.facet.QueryFacetTest.classMethod" -Ptests.jvms=96 "-Ptests.jvmargs=-XX:TieredStopAtLevel=1 -XX:+UseParallelGC -XX:ActiveProcessorCount=1 -XX:ReservedCodeCacheSize=120m" -Ptests.seed=91D9A7D0BD59A062 -Ptests.file.encoding=ISO-8859-1

  - org.apache.solr.analytics.facet.QueryFacetTest.classMethod (:solr:modules:analytics)
    Test output: /tmp/src/solr/solr/modules/analytics/build/test-results/test/outputs/OUTPUT-org.apache.solr.analytics.facet.QueryFacetTest.txt
    Reproduce with: gradlew :solr:modules:analytics:test --tests "org.apache.solr.analytics.facet.QueryFacetTest.classMethod" -Ptests.jvms=96 "-Ptests.jvmargs=-XX:TieredStopAtLevel=1 -XX:+UseParallelGC -XX:ActiveProcessorCount=1 -XX:ReservedCodeCacheSize=120m" -Ptests.seed=91D9A7D0BD59A062 -Ptests.file.encoding=ISO-8859-1

  - org.apache.solr.analytics.facet.QueryFacetTest.classMethod (:solr:modules:analytics)
    Test output: /tmp/src/solr/solr/modules/analytics/build/test-results/test/outputs/OUTPUT-org.apache.solr.analytics.facet.QueryFacetTest.txt
    Reproduce with: gradlew :solr:modules:analytics:test --tests "org.apache.solr.analytics.facet.QueryFacetTest.classMethod" -Ptests.jvms=96 "-Ptests.jvmargs=-XX:TieredStopAtLevel=1 -XX:+UseParallelGC -XX:ActiveProcessorCount=1 -XX:ReservedCodeCacheSize=120m" -Ptests.seed=91D9A7D0BD59A062 -Ptests.file.encoding=ISO-8859-1

WARNING: there were unreferenced files under license folder:
  - /tmp/src/solr/solr/licenses/bcutil-jdk18on-NOTICE.txt

FAILURE: Build completed with 2 failures.

1: Task failed with an exception.
-----------
* What went wrong:
Execution failed for task ':solr:modules:analytics:test'.
> There were failing tests. See the results at: file:///tmp/src/solr/solr/modules/analytics/build/test-results/test/

* Try:
> Run with --scan to get full insights.
==============================================================================

2: Task failed with an exception.
-----------
* What went wrong:
Execution failed for task ':solr:solrj:test'.
> There were failing tests. See the results at: file:///tmp/src/solr/solr/solrj/build/test-results/test/

* Try:
> Run with --scan to get full insights.
==============================================================================

BUILD FAILED in 4m 24s
642 actionable tasks: 640 executed, 2 up-to-date
[?12l[?25h
------------------------------------------------------------------------
Build Failed: returned 1

Total time: 4m55s
------------------------------------------------------------------------
+ status=1
+ ./crave pull '**/build/**/test/TEST-*.xml'
+ ./crave pull '**/*.events'
+ ./crave pull 'heapdumps/**'
Error: rsync: [sender] change_dir "/tmp/src/solr/heapdumps" failed: No such file or directory (2)
rsync error: some files/attrs were not transferred (see previous errors) (code 23) at main.c(1682) [Receiver=3.1.3]
rsync: [Receiver] write error: Broken pipe (32)

+ ./crave pull '**/hs_err_pid*'
+ exit 1
Build step 'Execute shell' marked build as failure
Archiving artifacts
Recording test results
ERROR: Step ‘Publish JUnit test result report’ failed: No test report files were found. Configuration error?
Email was triggered for: Failure - Any
Sending email for trigger: Failure - Any

[JENKINS] Solr » Solr-Check-9.x (Crave) - Build # 6197 - Still Failing!

Posted by Apache Jenkins Server <je...@builds.apache.org>.
Build: https://ci-builds.apache.org/job/Solr/job/Solr-Check-9.x%20(Crave)/6197/

No tests ran.

Build Log:
[...truncated 2785 lines...]
ERROR: The following test(s) have failed:
  - org.apache.solr.client.solrj.io.stream.StreamExpressionTest.classMethod (:solr:solrj-streaming)
    Test output: /tmp/src/solr/solr/solrj-streaming/build/test-results/test/outputs/OUTPUT-org.apache.solr.client.solrj.io.stream.StreamExpressionTest.txt
    Reproduce with: gradlew :solr:solrj-streaming:test --tests "org.apache.solr.client.solrj.io.stream.StreamExpressionTest.classMethod" -Ptests.jvms=96 "-Ptests.jvmargs=-XX:TieredStopAtLevel=1 -XX:+UseParallelGC -XX:ActiveProcessorCount=1 -XX:ReservedCodeCacheSize=120m" -Ptests.seed=2D30D0FB03A3B154 -Ptests.file.encoding=US-ASCII

  - org.apache.solr.client.solrj.io.stream.StreamExpressionTest.classMethod (:solr:solrj-streaming)
    Test output: /tmp/src/solr/solr/solrj-streaming/build/test-results/test/outputs/OUTPUT-org.apache.solr.client.solrj.io.stream.StreamExpressionTest.txt
    Reproduce with: gradlew :solr:solrj-streaming:test --tests "org.apache.solr.client.solrj.io.stream.StreamExpressionTest.classMethod" -Ptests.jvms=96 "-Ptests.jvmargs=-XX:TieredStopAtLevel=1 -XX:+UseParallelGC -XX:ActiveProcessorCount=1 -XX:ReservedCodeCacheSize=120m" -Ptests.seed=2D30D0FB03A3B154 -Ptests.file.encoding=US-ASCII

  - org.apache.solr.client.solrj.io.stream.StreamExpressionTest.classMethod (:solr:solrj-streaming)
    Test output: /tmp/src/solr/solr/solrj-streaming/build/test-results/test/outputs/OUTPUT-org.apache.solr.client.solrj.io.stream.StreamExpressionTest.txt
    Reproduce with: gradlew :solr:solrj-streaming:test --tests "org.apache.solr.client.solrj.io.stream.StreamExpressionTest.classMethod" -Ptests.jvms=96 "-Ptests.jvmargs=-XX:TieredStopAtLevel=1 -XX:+UseParallelGC -XX:ActiveProcessorCount=1 -XX:ReservedCodeCacheSize=120m" -Ptests.seed=2D30D0FB03A3B154 -Ptests.file.encoding=US-ASCII

  - org.apache.solr.analytics.facet.RangeFacetTest.classMethod (:solr:modules:analytics)
    Test output: /tmp/src/solr/solr/modules/analytics/build/test-results/test/outputs/OUTPUT-org.apache.solr.analytics.facet.RangeFacetTest.txt
    Reproduce with: gradlew :solr:modules:analytics:test --tests "org.apache.solr.analytics.facet.RangeFacetTest.classMethod" -Ptests.jvms=96 "-Ptests.jvmargs=-XX:TieredStopAtLevel=1 -XX:+UseParallelGC -XX:ActiveProcessorCount=1 -XX:ReservedCodeCacheSize=120m" -Ptests.seed=2D30D0FB03A3B154 -Ptests.file.encoding=US-ASCII

  - org.apache.solr.analytics.facet.RangeFacetTest.classMethod (:solr:modules:analytics)
    Test output: /tmp/src/solr/solr/modules/analytics/build/test-results/test/outputs/OUTPUT-org.apache.solr.analytics.facet.RangeFacetTest.txt
    Reproduce with: gradlew :solr:modules:analytics:test --tests "org.apache.solr.analytics.facet.RangeFacetTest.classMethod" -Ptests.jvms=96 "-Ptests.jvmargs=-XX:TieredStopAtLevel=1 -XX:+UseParallelGC -XX:ActiveProcessorCount=1 -XX:ReservedCodeCacheSize=120m" -Ptests.seed=2D30D0FB03A3B154 -Ptests.file.encoding=US-ASCII

  - org.apache.solr.analytics.facet.RangeFacetTest.classMethod (:solr:modules:analytics)
    Test output: /tmp/src/solr/solr/modules/analytics/build/test-results/test/outputs/OUTPUT-org.apache.solr.analytics.facet.RangeFacetTest.txt
    Reproduce with: gradlew :solr:modules:analytics:test --tests "org.apache.solr.analytics.facet.RangeFacetTest.classMethod" -Ptests.jvms=96 "-Ptests.jvmargs=-XX:TieredStopAtLevel=1 -XX:+UseParallelGC -XX:ActiveProcessorCount=1 -XX:ReservedCodeCacheSize=120m" -Ptests.seed=2D30D0FB03A3B154 -Ptests.file.encoding=US-ASCII

WARNING: there were unreferenced files under license folder:
  - /tmp/src/solr/solr/licenses/bcutil-jdk18on-NOTICE.txt

FAILURE: Build completed with 2 failures.

1: Task failed with an exception.
-----------
* What went wrong:
Execution failed for task ':solr:modules:analytics:test'.
> There were failing tests. See the results at: file:///tmp/src/solr/solr/modules/analytics/build/test-results/test/

* Try:
> Run with --scan to get full insights.
==============================================================================

2: Task failed with an exception.
-----------
* What went wrong:
Execution failed for task ':solr:solrj-streaming:test'.
> There were failing tests. See the results at: file:///tmp/src/solr/solr/solrj-streaming/build/test-results/test/

* Try:
> Run with --scan to get full insights.
==============================================================================

BUILD FAILED in 4m 30s
641 actionable tasks: 639 executed, 2 up-to-date
[?12l[?25h
------------------------------------------------------------------------
Build Failed: returned 1

Total time: 4m52.5s
------------------------------------------------------------------------
+ status=1
+ ./crave pull '**/build/**/test/TEST-*.xml'
+ ./crave pull '**/*.events'
+ ./crave pull 'heapdumps/**'
Error: rsync: [sender] change_dir "/tmp/src/solr/heapdumps" failed: No such file or directory (2)
rsync error: some files/attrs were not transferred (see previous errors) (code 23) at main.c(1682) [Receiver=3.1.3]
rsync: [Receiver] write error: Broken pipe (32)

+ ./crave pull '**/hs_err_pid*'
+ exit 1
Build step 'Execute shell' marked build as failure
Archiving artifacts
Recording test results
ERROR: Step ‘Publish JUnit test result report’ failed: No test report files were found. Configuration error?
Email was triggered for: Failure - Any
Sending email for trigger: Failure - Any