You are viewing a plain text version of this content. The canonical link for it is here.
Posted to ci@bigtop.apache.org by Apache Jenkins Server <je...@builds.apache.org> on 2019/07/24 17:46:48 UTC
Build failed in Jenkins: Bigtop-trunk-iTest #3377
See <https://builds.apache.org/job/Bigtop-trunk-iTest/3377/display/redirect?page=changes>
Changes:
[evansye] BIGTOP-3217. Added smoke tests for Livy (#534)
------------------------------------------
Started by an SCM change
Started by an SCM change
Started by an SCM change
[EnvInject] - Loading node environment variables.
Building remotely on H34 (ubuntu xenial) in workspace <https://builds.apache.org/job/Bigtop-trunk-iTest/ws/>
No credentials specified
Cloning the remote Git repository
Cloning repository https://git-wip-us.apache.org/repos/asf/bigtop.git
> git init <https://builds.apache.org/job/Bigtop-trunk-iTest/ws/> # timeout=10
Fetching upstream changes from https://git-wip-us.apache.org/repos/asf/bigtop.git
> git --version # timeout=10
> git fetch --tags --progress https://git-wip-us.apache.org/repos/asf/bigtop.git +refs/heads/*:refs/remotes/origin/*
> git config remote.origin.url https://git-wip-us.apache.org/repos/asf/bigtop.git # timeout=10
> git config --add remote.origin.fetch +refs/heads/*:refs/remotes/origin/* # timeout=10
> git config remote.origin.url https://git-wip-us.apache.org/repos/asf/bigtop.git # timeout=10
Fetching upstream changes from https://git-wip-us.apache.org/repos/asf/bigtop.git
> git fetch --tags --progress https://git-wip-us.apache.org/repos/asf/bigtop.git +refs/heads/*:refs/remotes/origin/*
> git rev-parse origin/master^{commit} # timeout=10
Checking out Revision 538778b57c262cd2df8588bfe748439ce36bf8fc (origin/master)
> git config core.sparsecheckout # timeout=10
> git checkout -f 538778b57c262cd2df8588bfe748439ce36bf8fc
Commit message: "BIGTOP-3217. Added smoke tests for Livy (#534)"
> git rev-list --no-walk e3c98f0d61c0785d4a0a1af5a16a7ab024b77c2b # timeout=10
[Bigtop-trunk-iTest] $ /bin/bash -xe /tmp/jenkins4910035707773057464.sh
+ export JAVA_HOME=/home/hudson/tools/java/latest
+ JAVA_HOME=/home/hudson/tools/java/latest
+ export PATH=/home/hudson/tools/java/latest/bin:/home/jenkins/tools/maven/apache-maven-3.0.4/bin:/home/jenkins/tools/java/latest1.8/bin:/usr/local/sbin:/usr/local/bin:/usr/sbin:/usr/bin:/sbin:/bin:/snap/bin
+ PATH=/home/hudson/tools/java/latest/bin:/home/jenkins/tools/maven/apache-maven-3.0.4/bin:/home/jenkins/tools/java/latest1.8/bin:/usr/local/sbin:/usr/local/bin:/usr/sbin:/usr/bin:/sbin:/bin:/snap/bin
+ env
BUILD_URL=https://builds.apache.org/job/Bigtop-trunk-iTest/3377/
XDG_SESSION_ID=1
POM_GROUPID=org.apache.bigtop.itest
HUDSON_SERVER_COOKIE=f4ebd1e6b0d976e8
SHELL=/bin/bash
SSH_CLIENT=195.201.213.130 52298 22
BUILD_TAG=jenkins-Bigtop-trunk-iTest-3377
POM_DISPLAYNAME=iTest: system and integration testing in the cloud
GIT_PREVIOUS_COMMIT=e3c98f0d61c0785d4a0a1af5a16a7ab024b77c2b
ROOT_BUILD_CAUSE=SCMTRIGGER
WORKSPACE=<https://builds.apache.org/job/Bigtop-trunk-iTest/ws/>
JOB_URL=https://builds.apache.org/job/Bigtop-trunk-iTest/
RUN_CHANGES_DISPLAY_URL=https://builds.apache.org/job/Bigtop-trunk-iTest/3377/display/redirect?page=changes
USER=jenkins
POM_ARTIFACTID=itest-common
GIT_AUTHOR_NAME=jenkins
GIT_COMMITTER_NAME=jenkins
MAVEN_OPTS=-Xmx4g -Xms4g
NLSPATH=/usr/dt/lib/nls/msg/%L/%N.cat
GIT_COMMIT=538778b57c262cd2df8588bfe748439ce36bf8fc
JENKINS_HOME=/x1/jenkins/jenkins-home
MAIL=/var/mail/jenkins
MAVEN_HOME=/home/jenkins/tools/maven/apache-maven-3.0.4
ROOT_BUILD_CAUSE_SCMTRIGGER=true
PATH=/home/hudson/tools/java/latest/bin:/home/jenkins/tools/maven/apache-maven-3.0.4/bin:/home/jenkins/tools/java/latest1.8/bin:/usr/local/sbin:/usr/local/bin:/usr/sbin:/usr/bin:/sbin:/bin:/snap/bin
BUILD_CAUSE_SCMTRIGGER=true
RUN_DISPLAY_URL=https://builds.apache.org/job/Bigtop-trunk-iTest/3377/display/redirect
GIT_COMMITTER_EMAIL=builds@apache.org
PWD=<https://builds.apache.org/job/Bigtop-trunk-iTest/ws/>
JAVA_HOME=/home/hudson/tools/java/latest
HUDSON_URL=https://builds.apache.org/
LANG=en_US
JOB_NAME=Bigtop-trunk-iTest
POM_VERSION=1.5.0-SNAPSHOT
XFILESEARCHPATH=/usr/dt/app-defaults/%L/Dt
BUILD_DISPLAY_NAME=#3377
BUILD_CAUSE=SCMTRIGGER,SCMTRIGGER,SCMTRIGGER
BUILD_ID=3377
JENKINS_URL=https://builds.apache.org/
WIN_LABEL=Windows
JOB_BASE_NAME=Bigtop-trunk-iTest
GIT_PREVIOUS_SUCCESSFUL_COMMIT=6a4f7ad8dfbdae739227a189c4d1834131b3867a
POM_PACKAGING=jar
HOME=/home/jenkins
SHLVL=2
M2_HOME=/home/jenkins/tools/maven/apache-maven-3.0.4
GIT_BRANCH=origin/master
EXECUTOR_NUMBER=0
JENKINS_SERVER_COOKIE=f4ebd1e6b0d976e8
GIT_URL=https://git-wip-us.apache.org/repos/asf/bigtop.git
NODE_LABELS=H34 ubuntu xenial
LOGNAME=jenkins
SSH_CONNECTION=195.201.213.130 52298 67.195.81.168 22
HUDSON_HOME=/x1/jenkins/jenkins-home
NODE_NAME=H34
NIX_LABEL=ubuntu
BUILD_NUMBER=3377
JOB_DISPLAY_URL=https://builds.apache.org/job/Bigtop-trunk-iTest/display/redirect
XDG_RUNTIME_DIR=/run/user/910
HUDSON_COOKIE=d14b7127-7cff-42f5-8c71-f76b3c494a08
GIT_AUTHOR_EMAIL=builds@apache.org
_=/usr/bin/env
Parsing POMs
Established TCP socket on 34158
maven3-agent.jar already up to date
maven3-interceptor.jar already up to date
maven3-interceptor-commons.jar already up to date
[bigtop-test-framework] $ /home/jenkins/tools/java/latest1.8/bin/java -Xmx4g -Xms4g -cp /home/jenkins/jenkins-slave/maven3-agent.jar:/home/jenkins/tools/maven/apache-maven-3.0.4/boot/plexus-classworlds-2.4.jar org.jvnet.hudson.maven3.agent.Maven3Main /home/jenkins/tools/maven/apache-maven-3.0.4 /home/jenkins/jenkins-slave/remoting.jar /home/jenkins/jenkins-slave/maven3-interceptor.jar /home/jenkins/jenkins-slave/maven3-interceptor-commons.jar 34158
<===[JENKINS REMOTING CAPACITY]===> channel started
Executing Maven: -B -f <https://builds.apache.org/job/Bigtop-trunk-iTest/ws/bigtop-test-framework/pom.xml> -Dmaven.repo.local=/home/jenkins/jenkins-slave/maven-repositories/0 clean deploy -DskipITs
[INFO] Scanning for projects...
Downloading: http://repo.maven.apache.org/maven2/org/apache/maven/wagon/wagon-ssh-external/2.6/wagon-ssh-external-2.6.pom
Downloaded: http://repo.maven.apache.org/maven2/org/apache/maven/wagon/wagon-ssh-external/2.6/wagon-ssh-external-2.6.pom (5 KB at 12.8 KB/sec)
Downloading: http://repo.maven.apache.org/maven2/org/apache/maven/wagon/wagon-ssh-common/2.6/wagon-ssh-common-2.6.pom
Downloaded: http://repo.maven.apache.org/maven2/org/apache/maven/wagon/wagon-ssh-common/2.6/wagon-ssh-common-2.6.pom (2 KB at 89.7 KB/sec)
Downloading: http://repo.maven.apache.org/maven2/org/apache/maven/wagon/wagon-ssh-external/2.6/wagon-ssh-external-2.6.jar
Downloading: http://repo.maven.apache.org/maven2/org/apache/maven/wagon/wagon-ssh-common/2.6/wagon-ssh-common-2.6.jar
Downloaded: http://repo.maven.apache.org/maven2/org/apache/maven/wagon/wagon-ssh-common/2.6/wagon-ssh-common-2.6.jar (25 KB at 774.8 KB/sec)
Downloaded: http://repo.maven.apache.org/maven2/org/apache/maven/wagon/wagon-ssh-external/2.6/wagon-ssh-external-2.6.jar (15 KB at 279.1 KB/sec)
[INFO]
[INFO] ------------------------------------------------------------------------
[INFO] Building iTest: system and integration testing in the cloud 1.5.0-SNAPSHOT
[INFO] ------------------------------------------------------------------------
Downloading: http://repo.maven.apache.org/maven2/org/apache/maven/plugins/maven-failsafe-plugin/2.12/maven-failsafe-plugin-2.12.pom
Downloaded: http://repo.maven.apache.org/maven2/org/apache/maven/plugins/maven-failsafe-plugin/2.12/maven-failsafe-plugin-2.12.pom (13 KB at 662.4 KB/sec)
Downloading: http://repo.maven.apache.org/maven2/org/apache/maven/surefire/surefire/2.12/surefire-2.12.pom
Downloaded: http://repo.maven.apache.org/maven2/org/apache/maven/surefire/surefire/2.12/surefire-2.12.pom (11 KB at 564.1 KB/sec)
Downloading: http://repo.maven.apache.org/maven2/org/apache/maven/plugins/maven-failsafe-plugin/2.12/maven-failsafe-plugin-2.12.jar
Downloaded: http://repo.maven.apache.org/maven2/org/apache/maven/plugins/maven-failsafe-plugin/2.12/maven-failsafe-plugin-2.12.jar (50 KB at 1226.2 KB/sec)
Downloading: http://repo.maven.apache.org/maven2/org/apache/maven/plugins/maven-surefire-plugin/2.7/maven-surefire-plugin-2.7.pom
Downloaded: http://repo.maven.apache.org/maven2/org/apache/maven/plugins/maven-surefire-plugin/2.7/maven-surefire-plugin-2.7.pom (10 KB at 277.8 KB/sec)
Downloading: http://repo.maven.apache.org/maven2/org/apache/maven/surefire/surefire/2.7/surefire-2.7.pom
Downloaded: http://repo.maven.apache.org/maven2/org/apache/maven/surefire/surefire/2.7/surefire-2.7.pom (9 KB at 524.2 KB/sec)
Downloading: http://repo.maven.apache.org/maven2/org/apache/maven/maven-parent/18/maven-parent-18.pom
Downloaded: http://repo.maven.apache.org/maven2/org/apache/maven/maven-parent/18/maven-parent-18.pom (24 KB at 1385.0 KB/sec)
Downloading: http://repo.maven.apache.org/maven2/org/apache/maven/plugins/maven-surefire-plugin/2.7/maven-surefire-plugin-2.7.jar
Downloaded: http://repo.maven.apache.org/maven2/org/apache/maven/plugins/maven-surefire-plugin/2.7/maven-surefire-plugin-2.7.jar (29 KB at 1479.5 KB/sec)
Downloading: http://repo.maven.apache.org/maven2/org/codehaus/groovy/groovy-all/2.4.10/groovy-all-2.4.10.pom
Downloaded: http://repo.maven.apache.org/maven2/org/codehaus/groovy/groovy-all/2.4.10/groovy-all-2.4.10.pom (21 KB at 1102.5 KB/sec)
Downloading: http://repo.maven.apache.org/maven2/org/apache/ant/ant-junit/1.8.2/ant-junit-1.8.2.pom
Downloaded: http://repo.maven.apache.org/maven2/org/apache/ant/ant-junit/1.8.2/ant-junit-1.8.2.pom (4 KB at 198.7 KB/sec)
Downloading: http://repo.maven.apache.org/maven2/org/codehaus/groovy/groovy-all/2.4.10/groovy-all-2.4.10.jar
Downloading: http://repo.maven.apache.org/maven2/logkit/logkit/1.0.1/logkit-1.0.1.jar
Downloading: http://repo.maven.apache.org/maven2/avalon-framework/avalon-framework/4.1.3/avalon-framework-4.1.3.jar
Downloading: http://repo.maven.apache.org/maven2/org/apache/ant/ant-junit/1.8.2/ant-junit-1.8.2.jar
Downloaded: http://repo.maven.apache.org/maven2/logkit/logkit/1.0.1/logkit-1.0.1.jar (71 KB at 2429.6 KB/sec)
Downloaded: http://repo.maven.apache.org/maven2/avalon-framework/avalon-framework/4.1.3/avalon-framework-4.1.3.jar (63 KB at 1523.6 KB/sec)
Downloaded: http://repo.maven.apache.org/maven2/org/apache/ant/ant-junit/1.8.2/ant-junit-1.8.2.jar (100 KB at 2170.1 KB/sec)
Downloaded: http://repo.maven.apache.org/maven2/org/codehaus/groovy/groovy-all/2.4.10/groovy-all-2.4.10.jar (6866 KB at 24346.9 KB/sec)
[INFO]
[INFO] --- maven-clean-plugin:3.1.0:clean (default-clean) @ itest-common ---
[INFO]
[INFO] --- maven-enforcer-plugin:1.4.1:enforce (enforce-maven-version) @ itest-common ---
[WARNING] Rule 0: org.apache.maven.plugins.enforcer.RequireMavenVersion failed with message:
Detected Maven Version: 3.0.4 is not in the allowed range 3.0.5.
[INFO] ------------------------------------------------------------------------
[INFO] BUILD FAILURE
[INFO] ------------------------------------------------------------------------
[INFO] Total time: 14.529s
[INFO] Finished at: Wed Jul 24 17:46:44 UTC 2019
[INFO] Final Memory: 35M/3925M
[INFO] ------------------------------------------------------------------------
Waiting for Jenkins to finish collecting data
[ERROR] Failed to execute goal org.apache.maven.plugins:maven-enforcer-plugin:1.4.1:enforce (enforce-maven-version) on project itest-common: Some Enforcer rules have failed. Look above for specific messages explaining why the rule failed. -> [Help 1]
[ERROR]
[ERROR] To see the full stack trace of the errors, re-run Maven with the -e switch.
[ERROR] Re-run Maven using the -X switch to enable full debug logging.
[ERROR]
[ERROR] For more information about the errors and possible solutions, please read the following articles:
[ERROR] [Help 1] http://cwiki.apache.org/confluence/display/MAVEN/MojoExecutionException
[JENKINS] Archiving <https://builds.apache.org/job/Bigtop-trunk-iTest/ws/bigtop-test-framework/pom.xml> to org.apache.bigtop.itest/itest-common/1.5.0-SNAPSHOT/itest-common-1.5.0-SNAPSHOT.pom
Sending e-mails to: ci@bigtop.apache.org
channel stopped
Build failed in Jenkins: Bigtop-trunk-iTest #3378
Posted by Apache Jenkins Server <je...@builds.apache.org>.
See <https://builds.apache.org/job/Bigtop-trunk-iTest/3378/display/redirect?page=changes>
Changes:
[evansye] BIGTOP-3168: Kafka smoke tests implementation (#537)
------------------------------------------
Started by an SCM change
Started by an SCM change
Started by an SCM change
[EnvInject] - Loading node environment variables.
Building remotely on H38 (ubuntu xenial) in workspace <https://builds.apache.org/job/Bigtop-trunk-iTest/ws/>
No credentials specified
Cloning the remote Git repository
Cloning repository https://git-wip-us.apache.org/repos/asf/bigtop.git
> git init <https://builds.apache.org/job/Bigtop-trunk-iTest/ws/> # timeout=10
Fetching upstream changes from https://git-wip-us.apache.org/repos/asf/bigtop.git
> git --version # timeout=10
> git fetch --tags --progress https://git-wip-us.apache.org/repos/asf/bigtop.git +refs/heads/*:refs/remotes/origin/*
> git config remote.origin.url https://git-wip-us.apache.org/repos/asf/bigtop.git # timeout=10
> git config --add remote.origin.fetch +refs/heads/*:refs/remotes/origin/* # timeout=10
> git config remote.origin.url https://git-wip-us.apache.org/repos/asf/bigtop.git # timeout=10
Fetching upstream changes from https://git-wip-us.apache.org/repos/asf/bigtop.git
> git fetch --tags --progress https://git-wip-us.apache.org/repos/asf/bigtop.git +refs/heads/*:refs/remotes/origin/*
> git rev-parse origin/master^{commit} # timeout=10
Checking out Revision 8aca335bab0955273b38069457ee8162ef5aaa26 (origin/master)
> git config core.sparsecheckout # timeout=10
> git checkout -f 8aca335bab0955273b38069457ee8162ef5aaa26
Commit message: "BIGTOP-3168: Kafka smoke tests implementation (#537)"
> git rev-list --no-walk 538778b57c262cd2df8588bfe748439ce36bf8fc # timeout=10
[Bigtop-trunk-iTest] $ /bin/bash -xe /tmp/jenkins5435572638404996354.sh
+ export JAVA_HOME=/home/hudson/tools/java/latest
+ JAVA_HOME=/home/hudson/tools/java/latest
+ export PATH=/home/hudson/tools/java/latest/bin:/home/jenkins/tools/maven/apache-maven-3.0.4/bin:/home/jenkins/tools/java/latest1.8/bin:/usr/local/sbin:/usr/local/bin:/usr/sbin:/usr/bin:/sbin:/bin:/snap/bin
+ PATH=/home/hudson/tools/java/latest/bin:/home/jenkins/tools/maven/apache-maven-3.0.4/bin:/home/jenkins/tools/java/latest1.8/bin:/usr/local/sbin:/usr/local/bin:/usr/sbin:/usr/bin:/sbin:/bin:/snap/bin
+ env
BUILD_URL=https://builds.apache.org/job/Bigtop-trunk-iTest/3378/
XDG_SESSION_ID=73
POM_GROUPID=org.apache.bigtop.itest
HUDSON_SERVER_COOKIE=f4ebd1e6b0d976e8
SHELL=/bin/bash
SSH_CLIENT=195.201.213.130 50052 22
BUILD_TAG=jenkins-Bigtop-trunk-iTest-3378
POM_DISPLAYNAME=iTest: system and integration testing in the cloud
GIT_PREVIOUS_COMMIT=538778b57c262cd2df8588bfe748439ce36bf8fc
ROOT_BUILD_CAUSE=SCMTRIGGER
WORKSPACE=<https://builds.apache.org/job/Bigtop-trunk-iTest/ws/>
JOB_URL=https://builds.apache.org/job/Bigtop-trunk-iTest/
RUN_CHANGES_DISPLAY_URL=https://builds.apache.org/job/Bigtop-trunk-iTest/3378/display/redirect?page=changes
USER=jenkins
POM_ARTIFACTID=itest-common
GIT_AUTHOR_NAME=jenkins
GIT_COMMITTER_NAME=jenkins
MAVEN_OPTS=-Xmx4g -Xms4g
NLSPATH=/usr/dt/lib/nls/msg/%L/%N.cat
GIT_COMMIT=8aca335bab0955273b38069457ee8162ef5aaa26
JENKINS_HOME=/x1/jenkins/jenkins-home
MAIL=/var/mail/jenkins
MAVEN_HOME=/home/jenkins/tools/maven/apache-maven-3.0.4
ROOT_BUILD_CAUSE_SCMTRIGGER=true
PATH=/home/hudson/tools/java/latest/bin:/home/jenkins/tools/maven/apache-maven-3.0.4/bin:/home/jenkins/tools/java/latest1.8/bin:/usr/local/sbin:/usr/local/bin:/usr/sbin:/usr/bin:/sbin:/bin:/snap/bin
BUILD_CAUSE_SCMTRIGGER=true
RUN_DISPLAY_URL=https://builds.apache.org/job/Bigtop-trunk-iTest/3378/display/redirect
GIT_COMMITTER_EMAIL=builds@apache.org
PWD=<https://builds.apache.org/job/Bigtop-trunk-iTest/ws/>
JAVA_HOME=/home/hudson/tools/java/latest
HUDSON_URL=https://builds.apache.org/
LANG=en_US
JOB_NAME=Bigtop-trunk-iTest
POM_VERSION=1.5.0-SNAPSHOT
XFILESEARCHPATH=/usr/dt/app-defaults/%L/Dt
BUILD_DISPLAY_NAME=#3378
BUILD_CAUSE=SCMTRIGGER,SCMTRIGGER,SCMTRIGGER
BUILD_ID=3378
JENKINS_URL=https://builds.apache.org/
WIN_LABEL=Windows
JOB_BASE_NAME=Bigtop-trunk-iTest
GIT_PREVIOUS_SUCCESSFUL_COMMIT=6a4f7ad8dfbdae739227a189c4d1834131b3867a
POM_PACKAGING=jar
HOME=/home/jenkins
SHLVL=2
M2_HOME=/home/jenkins/tools/maven/apache-maven-3.0.4
GIT_BRANCH=origin/master
EXECUTOR_NUMBER=0
JENKINS_SERVER_COOKIE=f4ebd1e6b0d976e8
GIT_URL=https://git-wip-us.apache.org/repos/asf/bigtop.git
NODE_LABELS=H38 ubuntu xenial
LOGNAME=jenkins
SSH_CONNECTION=195.201.213.130 50052 67.195.81.166 22
HUDSON_HOME=/x1/jenkins/jenkins-home
NODE_NAME=H38
NIX_LABEL=ubuntu
BUILD_NUMBER=3378
JOB_DISPLAY_URL=https://builds.apache.org/job/Bigtop-trunk-iTest/display/redirect
XDG_RUNTIME_DIR=/run/user/910
HUDSON_COOKIE=5e2ad350-0010-4c19-b02e-75ee8493e6a7
GIT_AUTHOR_EMAIL=builds@apache.org
_=/usr/bin/env
Parsing POMs
Established TCP socket on 37633
maven3-agent.jar already up to date
maven3-interceptor.jar already up to date
maven3-interceptor-commons.jar already up to date
[bigtop-test-framework] $ /home/jenkins/tools/java/latest1.8/bin/java -Xmx4g -Xms4g -cp /home/jenkins/jenkins-slave/maven3-agent.jar:/home/jenkins/tools/maven/apache-maven-3.0.4/boot/plexus-classworlds-2.4.jar org.jvnet.hudson.maven3.agent.Maven3Main /home/jenkins/tools/maven/apache-maven-3.0.4 /home/jenkins/jenkins-slave/remoting.jar /home/jenkins/jenkins-slave/maven3-interceptor.jar /home/jenkins/jenkins-slave/maven3-interceptor-commons.jar 37633
<===[JENKINS REMOTING CAPACITY]===> channel started
Executing Maven: -B -f <https://builds.apache.org/job/Bigtop-trunk-iTest/ws/bigtop-test-framework/pom.xml> -Dmaven.repo.local=/home/jenkins/jenkins-slave/maven-repositories/0 clean deploy -DskipITs
[INFO] Scanning for projects...
[INFO]
[INFO] ------------------------------------------------------------------------
[INFO] Building iTest: system and integration testing in the cloud 1.5.0-SNAPSHOT
[INFO] ------------------------------------------------------------------------
[INFO]
[INFO] --- maven-clean-plugin:3.1.0:clean (default-clean) @ itest-common ---
[INFO]
[INFO] --- maven-enforcer-plugin:1.4.1:enforce (enforce-maven-version) @ itest-common ---
[WARNING] Rule 0: org.apache.maven.plugins.enforcer.RequireMavenVersion failed with message:
Detected Maven Version: 3.0.4 is not in the allowed range 3.0.5.
[INFO] ------------------------------------------------------------------------
[INFO] BUILD FAILURE
[INFO] ------------------------------------------------------------------------
[INFO] Total time: 37.280s
[INFO] Finished at: Fri Aug 09 05:06:54 UTC 2019
[INFO] Final Memory: 35M/3925M
[INFO] ------------------------------------------------------------------------
Waiting for Jenkins to finish collecting data
[ERROR] Failed to execute goal org.apache.maven.plugins:maven-enforcer-plugin:1.4.1:enforce (enforce-maven-version) on project itest-common: Some Enforcer rules have failed. Look above for specific messages explaining why the rule failed. -> [Help 1]
[ERROR]
[ERROR] To see the full stack trace of the errors, re-run Maven with the -e switch.
[ERROR] Re-run Maven using the -X switch to enable full debug logging.
[ERROR]
[ERROR] For more information about the errors and possible solutions, please read the following articles:
[ERROR] [Help 1] http://cwiki.apache.org/confluence/display/MAVEN/MojoExecutionException
[JENKINS] Archiving <https://builds.apache.org/job/Bigtop-trunk-iTest/ws/bigtop-test-framework/pom.xml> to org.apache.bigtop.itest/itest-common/1.5.0-SNAPSHOT/itest-common-1.5.0-SNAPSHOT.pom
Sending e-mails to: ci@bigtop.apache.org
channel stopped