You are viewing a plain text version of this content. The canonical link for it is here.
Posted to builds@mesos.apache.org by Apache Jenkins Server <je...@builds.apache.org> on 2016/09/30 13:02:14 UTC
Build failed in Jenkins: Mesos » autotools,gcc,--verbose --enable-libevent --enable-ssl,GLOG_v=1 MESOS_VERBOSE=1,ubuntu:14.04,(docker||Hadoop)&&(!ubuntu-us1)&&(!ubuntu-6) #2719
See <https://builds.apache.org/job/Mesos/BUILDTOOL=autotools,COMPILER=gcc,CONFIGURATION=--verbose%20--enable-libevent%20--enable-ssl,ENVIRONMENT=GLOG_v=1%20MESOS_VERBOSE=1,OS=ubuntu%3A14.04,label_exp=(docker%7C%7CHadoop)&&(!ubuntu-us1)&&(!ubuntu-6)/2719/changes>
Changes:
[alexr] Fixed help display for mesos-containerizer subcommands.
------------------------------------------
[...truncated 210601 lines...]
I0930 13:00:42.266724 30372 slave.cpp:787] Agent terminating
[ OK ] Endpoint/SlaveEndpointTest.AuthorizedRequest/0 (19 ms)
[ RUN ] Endpoint/SlaveEndpointTest.AuthorizedRequest/1
I0930 13:00:42.274679 30343 containerizer.cpp:226] Using isolation: posix/cpu,posix/mem,filesystem/posix,network/cni
W0930 13:00:42.275254 30343 backend.cpp:75] Failed to create 'aufs' backend: AufsBackend requires root privileges, but is running as user mesos
W0930 13:00:42.275403 30343 backend.cpp:75] Failed to create 'bind' backend: BindBackend requires root privileges
I0930 13:00:42.278074 30365 slave.cpp:208] Mesos agent started on (608)@172.17.0.2:57796
I0930 13:00:42.278100 30365 slave.cpp:209] Flags at startup: --acls="" --appc_simple_discovery_uri_prefix="http://" --appc_store_dir="/tmp/mesos/store/appc" --authenticate_http_readonly="true" --authenticate_http_readwrite="true" --authenticatee="crammd5" --authentication_backoff_factor="1secs" --authorizer="local" --cgroups_cpu_enable_pids_and_tids_count="false" --cgroups_enable_cfs="false" --cgroups_hierarchy="/sys/fs/cgroup" --cgroups_limit_swap="false" --cgroups_root="mesos" --container_disk_watch_interval="15secs" --containerizers="mesos" --credential="/tmp/Endpoint_SlaveEndpointTest_AuthorizedRequest_1_CcOXge/credential" --default_role="*" --disk_watch_interval="1mins" --docker="docker" --docker_kill_orphans="true" --docker_registry="https://registry-1.docker.io" --docker_remove_delay="6hrs" --docker_socket="/var/run/docker.sock" --docker_stop_timeout="0ns" --docker_store_dir="/tmp/mesos/store/docker" --docker_volume_checkpoint_dir="/var/run/mesos/isolators/docker/volume" --enforce_container_disk_quota="false" --executor_registration_timeout="1mins" --executor_shutdown_grace_period="5secs" --fetcher_cache_dir="/tmp/Endpoint_SlaveEndpointTest_AuthorizedRequest_1_CcOXge/fetch" --fetcher_cache_size="2GB" --frameworks_home="" --gc_delay="1weeks" --gc_disk_headroom="0.1" --hadoop_home="" --help="true" --hostname_lookup="true" --http_authenticators="basic" --http_command_executor="false" --http_credentials="/tmp/Endpoint_SlaveEndpointTest_AuthorizedRequest_1_CcOXge/http_credentials" --image_provisioner_backend="copy" --initialize_driver_logging="true" --isolation="posix/cpu,posix/mem" --launcher="posix" --launcher_dir="/mesos/mesos-1.1.0/_build/src" --logbufsecs="0" --logging_level="INFO" --oversubscribed_resources_interval="15secs" --perf_duration="10secs" --perf_interval="1mins" --qos_correction_interval_min="0ns" --quiet="false" --recover="reconnect" --recovery_timeout="15mins" --registration_backoff_factor="10ms" --resources="cpus:2;gpus:0;mem:1024;disk:1024;ports:[31000-32000]" --revocable_cpu_low_priority="true" --runtime_dir="/tmp/Endpoint_SlaveEndpointTest_AuthorizedRequest_1_CcOXge" --sandbox_directory="/mnt/mesos/sandbox" --strict="true" --switch_user="true" --systemd_enable_support="true" --systemd_runtime_directory="/run/systemd/system" --version="false" --work_dir="/tmp/Endpoint_SlaveEndpointTest_AuthorizedRequest_1_HQ1khD"
I0930 13:00:42.278834 30365 credentials.hpp:86] Loading credential for authentication from '/tmp/Endpoint_SlaveEndpointTest_AuthorizedRequest_1_CcOXge/credential'
I0930 13:00:42.279134 30365 slave.cpp:346] Agent using credential for: test-principal
I0930 13:00:42.279158 30365 credentials.hpp:37] Loading credentials for authentication from '/tmp/Endpoint_SlaveEndpointTest_AuthorizedRequest_1_CcOXge/http_credentials'
I0930 13:00:42.279412 30365 http.cpp:883] Using default 'basic' HTTP authenticator for realm 'mesos-agent-readonly'
I0930 13:00:42.279566 30365 http.cpp:883] Using default 'basic' HTTP authenticator for realm 'mesos-agent-readwrite'
I0930 13:00:42.280490 30365 slave.cpp:533] Agent resources: cpus(*):2; mem(*):1024; disk(*):1024; ports(*):[31000-32000]
I0930 13:00:42.280565 30365 slave.cpp:541] Agent attributes: [ ]
I0930 13:00:42.280633 30365 slave.cpp:546] Agent hostname: e0237b91f525
I0930 13:00:42.282037 30375 state.cpp:57] Recovering state from '/tmp/Endpoint_SlaveEndpointTest_AuthorizedRequest_1_HQ1khD/meta'
I0930 13:00:42.282135 30365 process.cpp:3377] Handling HTTP event for process 'slave(608)' with path: '/slave(608)/monitor/statistics.json'
I0930 13:00:42.282678 30365 status_update_manager.cpp:203] Recovering status update manager
I0930 13:00:42.282846 30377 containerizer.cpp:580] Recovering containerizer
I0930 13:00:42.283315 30362 http.cpp:835] Authorizing principal 'test-principal' to GET the '/monitor/statistics.json' endpoint
I0930 13:00:42.285405 30373 provisioner.cpp:253] Provisioner recovery complete
I0930 13:00:42.285765 30362 slave.cpp:5256] Finished recovery
I0930 13:00:42.286366 30362 slave.cpp:5428] Querying resource estimator for oversubscribable resources
I0930 13:00:42.286640 30363 slave.cpp:5442] Received oversubscribable resources {} from the resource estimator
I0930 13:00:42.286715 30363 slave.cpp:787] Agent terminating
[ OK ] Endpoint/SlaveEndpointTest.AuthorizedRequest/1 (19 ms)
[ RUN ] Endpoint/SlaveEndpointTest.AuthorizedRequest/2
I0930 13:00:42.294837 30343 containerizer.cpp:226] Using isolation: posix/cpu,posix/mem,filesystem/posix,network/cni
W0930 13:00:42.295420 30343 backend.cpp:75] Failed to create 'aufs' backend: AufsBackend requires root privileges, but is running as user mesos
W0930 13:00:42.295577 30343 backend.cpp:75] Failed to create 'bind' backend: BindBackend requires root privileges
I0930 13:00:42.298198 30364 slave.cpp:208] Mesos agent started on (609)@172.17.0.2:57796
I0930 13:00:42.298224 30364 slave.cpp:209] Flags at startup: --acls="" --appc_simple_discovery_uri_prefix="http://" --appc_store_dir="/tmp/mesos/store/appc" --authenticate_http_readonly="true" --authenticate_http_readwrite="true" --authenticatee="crammd5" --authentication_backoff_factor="1secs" --authorizer="local" --cgroups_cpu_enable_pids_and_tids_count="false" --cgroups_enable_cfs="false" --cgroups_hierarchy="/sys/fs/cgroup" --cgroups_limit_swap="false" --cgroups_root="mesos" --container_disk_watch_interval="15secs" --containerizers="mesos" --credential="/tmp/Endpoint_SlaveEndpointTest_AuthorizedRequest_2_XhGarC/credential" --default_role="*" --disk_watch_interval="1mins" --docker="docker" --docker_kill_orphans="true" --docker_registry="https://registry-1.docker.io" --docker_remove_delay="6hrs" --docker_socket="/var/run/docker.sock" --docker_stop_timeout="0ns" --docker_store_dir="/tmp/mesos/store/docker" --docker_volume_checkpoint_dir="/var/run/mesos/isolators/docker/volume" --enforce_container_disk_quota="false" --executor_registration_timeout="1mins" --executor_shutdown_grace_period="5secs" --fetcher_cache_dir="/tmp/Endpoint_SlaveEndpointTest_AuthorizedRequest_2_XhGarC/fetch" --fetcher_cache_size="2GB" --frameworks_home="" --gc_delay="1weeks" --gc_disk_headroom="0.1" --hadoop_home="" --help="true" --hostname_lookup="true" --http_authenticators="basic" --http_command_executor="false" --http_credentials="/tmp/Endpoint_SlaveEndpointTest_AuthorizedRequest_2_XhGarC/http_credentials" --image_provisioner_backend="copy" --initialize_driver_logging="true" --isolation="posix/cpu,posix/mem" --launcher="posix" --launcher_dir="/mesos/mesos-1.1.0/_build/src" --logbufsecs="0" --logging_level="INFO" --oversubscribed_resources_interval="15secs" --perf_duration="10secs" --perf_interval="1mins" --qos_correction_interval_min="0ns" --quiet="false" --recover="reconnect" --recovery_timeout="15mins" --registration_backoff_factor="10ms" --resources="cpus:2;gpus:0;mem:1024;disk:1024;ports:[31000-32000]" --revocable_cpu_low_priority="true" --runtime_dir="/tmp/Endpoint_SlaveEndpointTest_AuthorizedRequest_2_XhGarC" --sandbox_directory="/mnt/mesos/sandbox" --strict="true" --switch_user="true" --systemd_enable_support="true" --systemd_runtime_directory="/run/systemd/system" --version="false" --work_dir="/tmp/Endpoint_SlaveEndpointTest_AuthorizedRequest_2_zHgho1"
I0930 13:00:42.298678 30364 credentials.hpp:86] Loading credential for authentication from '/tmp/Endpoint_SlaveEndpointTest_AuthorizedRequest_2_XhGarC/credential'
I0930 13:00:42.298913 30364 slave.cpp:346] Agent using credential for: test-principal
I0930 13:00:42.298935 30364 credentials.hpp:37] Loading credentials for authentication from '/tmp/Endpoint_SlaveEndpointTest_AuthorizedRequest_2_XhGarC/http_credentials'
I0930 13:00:42.299183 30364 http.cpp:883] Using default 'basic' HTTP authenticator for realm 'mesos-agent-readonly'
I0930 13:00:42.299317 30364 http.cpp:883] Using default 'basic' HTTP authenticator for realm 'mesos-agent-readwrite'
I0930 13:00:42.300258 30364 slave.cpp:533] Agent resources: cpus(*):2; mem(*):1024; disk(*):1024; ports(*):[31000-32000]
I0930 13:00:42.300343 30364 slave.cpp:541] Agent attributes: [ ]
I0930 13:00:42.300365 30364 slave.cpp:546] Agent hostname: e0237b91f525
I0930 13:00:42.301707 30364 process.cpp:3377] Handling HTTP event for process 'slave(609)' with path: '/slave(609)/containers'
I0930 13:00:42.301733 30363 state.cpp:57] Recovering state from '/tmp/Endpoint_SlaveEndpointTest_AuthorizedRequest_2_zHgho1/meta'
I0930 13:00:42.302340 30364 status_update_manager.cpp:203] Recovering status update manager
I0930 13:00:42.302575 30364 containerizer.cpp:580] Recovering containerizer
I0930 13:00:42.302814 30365 http.cpp:835] Authorizing principal 'test-principal' to GET the '/containers' endpoint
I0930 13:00:42.304533 30362 provisioner.cpp:253] Provisioner recovery complete
I0930 13:00:42.310474 30365 slave.cpp:5256] Finished recovery
I0930 13:00:42.311166 30365 slave.cpp:5428] Querying resource estimator for oversubscribable resources
I0930 13:00:42.311419 30373 slave.cpp:5442] Received oversubscribable resources {} from the resource estimator
I0930 13:00:42.312932 30377 slave.cpp:787] Agent terminating
[ OK ] Endpoint/SlaveEndpointTest.AuthorizedRequest/2 (25 ms)
[ RUN ] Endpoint/SlaveEndpointTest.UnauthorizedRequest/0
I0930 13:00:42.320956 30343 containerizer.cpp:226] Using isolation: posix/cpu,posix/mem,filesystem/posix,network/cni
W0930 13:00:42.321509 30343 backend.cpp:75] Failed to create 'aufs' backend: AufsBackend requires root privileges, but is running as user mesos
W0930 13:00:42.321658 30343 backend.cpp:75] Failed to create 'bind' backend: BindBackend requires root privileges
I0930 13:00:42.324277 30369 slave.cpp:208] Mesos agent started on (610)@172.17.0.2:57796
I0930 13:00:42.324304 30369 slave.cpp:209] Flags at startup: --acls="" --appc_simple_discovery_uri_prefix="http://" --appc_store_dir="/tmp/mesos/store/appc" --authenticate_http_readonly="true" --authenticate_http_readwrite="true" --authenticatee="crammd5" --authentication_backoff_factor="1secs" --authorizer="local" --cgroups_cpu_enable_pids_and_tids_count="false" --cgroups_enable_cfs="false" --cgroups_hierarchy="/sys/fs/cgroup" --cgroups_limit_swap="false" --cgroups_root="mesos" --container_disk_watch_interval="15secs" --containerizers="mesos" --credential="/tmp/Endpoint_SlaveEndpointTest_UnauthorizedRequest_0_Dez7R0/credential" --default_role="*" --disk_watch_interval="1mins" --docker="docker" --docker_kill_orphans="true" --docker_registry="https://registry-1.docker.io" --docker_remove_delay="6hrs" --docker_socket="/var/run/docker.sock" --docker_stop_timeout="0ns" --docker_store_dir="/tmp/mesos/store/docker" --docker_volume_checkpoint_dir="/var/run/mesos/isolators/docker/volume" --enforce_container_disk_quota="false" --executor_registration_timeout="1mins" --executor_shutdown_grace_period="5secs" --fetcher_cache_dir="/tmp/Endpoint_SlaveEndpointTest_UnauthorizedRequest_0_Dez7R0/fetch" --fetcher_cache_size="2GB" --frameworks_home="" --gc_delay="1weeks" --gc_disk_headroom="0.1" --hadoop_home="" --help="true" --hostname_lookup="true" --http_authenticators="basic" --http_command_executor="false" --http_credentials="/tmp/Endpoint_SlaveEndpointTest_UnauthorizedRequest_0_Dez7R0/http_credentials" --image_provisioner_backend="copy" --initialize_driver_logging="true" --isolation="posix/cpu,posix/mem" --launcher="posix" --launcher_dir="/mesos/mesos-1.1.0/_build/src" --logbufsecs="0" --logging_level="INFO" --oversubscribed_resources_interval="15secs" --perf_duration="10secs" --perf_interval="1mins" --qos_correction_interval_min="0ns" --quiet="false" --recover="reconnect" --recovery_timeout="15mins" --registration_backoff_factor="10ms" --resources="cpus:2;gpus:0;mem:1024;disk:1024;ports:[31000-32000]" --revocable_cpu_low_priority="true" --runtime_dir="/tmp/Endpoint_SlaveEndpointTest_UnauthorizedRequest_0_Dez7R0" --sandbox_directory="/mnt/mesos/sandbox" --strict="true" --switch_user="true" --systemd_enable_support="true" --systemd_runtime_directory="/run/systemd/system" --version="false" --work_dir="/tmp/Endpoint_SlaveEndpointTest_UnauthorizedRequest_0_thXYKp"
I0930 13:00:42.324803 30369 credentials.hpp:86] Loading credential for authentication from '/tmp/Endpoint_SlaveEndpointTest_UnauthorizedRequest_0_Dez7R0/credential'
I0930 13:00:42.325083 30369 slave.cpp:346] Agent using credential for: test-principal
I0930 13:00:42.325111 30369 credentials.hpp:37] Loading credentials for authentication from '/tmp/Endpoint_SlaveEndpointTest_UnauthorizedRequest_0_Dez7R0/http_credentials'
I0930 13:00:42.325453 30369 http.cpp:883] Using default 'basic' HTTP authenticator for realm 'mesos-agent-readonly'
I0930 13:00:42.325646 30369 http.cpp:883] Using default 'basic' HTTP authenticator for realm 'mesos-agent-readwrite'
I0930 13:00:42.326659 30369 slave.cpp:533] Agent resources: cpus(*):2; mem(*):1024; disk(*):1024; ports(*):[31000-32000]
I0930 13:00:42.326735 30369 slave.cpp:541] Agent attributes: [ ]
I0930 13:00:42.326756 30369 slave.cpp:546] Agent hostname: e0237b91f525
I0930 13:00:42.328150 30374 state.cpp:57] Recovering state from '/tmp/Endpoint_SlaveEndpointTest_UnauthorizedRequest_0_thXYKp/meta'
I0930 13:00:42.328265 30369 process.cpp:3377] Handling HTTP event for process 'slave(610)' with path: '/slave(610)/monitor/statistics'
I0930 13:00:42.328783 30362 status_update_manager.cpp:203] Recovering status update manager
I0930 13:00:42.328951 30362 containerizer.cpp:580] Recovering containerizer
I0930 13:00:42.329566 30375 http.cpp:835] Authorizing principal 'test-principal' to GET the '/monitor/statistics' endpoint
I0930 13:00:42.330826 30362 provisioner.cpp:253] Provisioner recovery complete
I0930 13:00:42.331202 30366 slave.cpp:5256] Finished recovery
I0930 13:00:42.331903 30366 slave.cpp:5428] Querying resource estimator for oversubscribable resources
I0930 13:00:42.332214 30376 slave.cpp:5442] Received oversubscribable resources {} from the resource estimator
I0930 13:00:42.332342 30369 slave.cpp:787] Agent terminating
[ OK ] Endpoint/SlaveEndpointTest.UnauthorizedRequest/0 (20 ms)
[ RUN ] Endpoint/SlaveEndpointTest.UnauthorizedRequest/1
I0930 13:00:42.343436 30343 containerizer.cpp:226] Using isolation: posix/cpu,posix/mem,filesystem/posix,network/cni
W0930 13:00:42.344255 30343 backend.cpp:75] Failed to create 'aufs' backend: AufsBackend requires root privileges, but is running as user mesos
W0930 13:00:42.344431 30343 backend.cpp:75] Failed to create 'bind' backend: BindBackend requires root privileges
I0930 13:00:42.348235 30370 slave.cpp:208] Mesos agent started on (611)@172.17.0.2:57796
I0930 13:00:42.348255 30370 slave.cpp:209] Flags at startup: --acls="" --appc_simple_discovery_uri_prefix="http://" --appc_store_dir="/tmp/mesos/store/appc" --authenticate_http_readonly="true" --authenticate_http_readwrite="true" --authenticatee="crammd5" --authentication_backoff_factor="1secs" --authorizer="local" --cgroups_cpu_enable_pids_and_tids_count="false" --cgroups_enable_cfs="false" --cgroups_hierarchy="/sys/fs/cgroup" --cgroups_limit_swap="false" --cgroups_root="mesos" --container_disk_watch_interval="15secs" --containerizers="mesos" --credential="/tmp/Endpoint_SlaveEndpointTest_UnauthorizedRequest_1_EdWMwp/credential" --default_role="*" --disk_watch_interval="1mins" --docker="docker" --docker_kill_orphans="true" --docker_registry="https://registry-1.docker.io" --docker_remove_delay="6hrs" --docker_socket="/var/run/docker.sock" --docker_stop_timeout="0ns" --docker_store_dir="/tmp/mesos/store/docker" --docker_volume_checkpoint_dir="/var/run/mesos/isolators/docker/volume" --enforce_container_disk_quota="false" --executor_registration_timeout="1mins" --executor_shutdown_grace_period="5secs" --fetcher_cache_dir="/tmp/Endpoint_SlaveEndpointTest_UnauthorizedRequest_1_EdWMwp/fetch" --fetcher_cache_size="2GB" --frameworks_home="" --gc_delay="1weeks" --gc_disk_headroom="0.1" --hadoop_home="" --help="true" --hostname_lookup="true" --http_authenticators="basic" --http_command_executor="false" --http_credentials="/tmp/Endpoint_SlaveEndpointTest_UnauthorizedRequest_1_EdWMwp/http_credentials" --image_provisioner_backend="copy" --initialize_driver_logging="true" --isolation="posix/cpu,posix/mem" --launcher="posix" --launcher_dir="/mesos/mesos-1.1.0/_build/src" --logbufsecs="0" --logging_level="INFO" --oversubscribed_resources_interval="15secs" --perf_duration="10secs" --perf_interval="1mins" --qos_correction_interval_min="0ns" --quiet="false" --recover="reconnect" --recovery_timeout="15mins" --registration_backoff_factor="10ms" --resources="cpus:2;gpus:0;mem:1024;disk:1024;ports:[31000-32000]" --revocable_cpu_low_priority="true" --runtime_dir="/tmp/Endpoint_SlaveEndpointTest_UnauthorizedRequest_1_EdWMwp" --sandbox_directory="/mnt/mesos/sandbox" --strict="true" --switch_user="true" --systemd_enable_support="true" --systemd_runtime_directory="/run/systemd/system" --version="false" --work_dir="/tmp/Endpoint_SlaveEndpointTest_UnauthorizedRequest_1_DpS9lO"
I0930 13:00:42.348708 30370 credentials.hpp:86] Loading credential for authentication from '/tmp/Endpoint_SlaveEndpointTest_UnauthorizedRequest_1_EdWMwp/credential'
I0930 13:00:42.348909 30370 slave.cpp:346] Agent using credential for: test-principal
I0930 13:00:42.348934 30370 credentials.hpp:37] Loading credentials for authentication from '/tmp/Endpoint_SlaveEndpointTest_UnauthorizedRequest_1_EdWMwp/http_credentials'
I0930 13:00:42.349202 30370 http.cpp:883] Using default 'basic' HTTP authenticator for realm 'mesos-agent-readonly'
I0930 13:00:42.349331 30370 http.cpp:883] Using default 'basic' HTTP authenticator for realm 'mesos-agent-readwrite'
I0930 13:00:42.350339 30370 slave.cpp:533] Agent resources: cpus(*):2; mem(*):1024; disk(*):1024; ports(*):[31000-32000]
I0930 13:00:42.350441 30370 slave.cpp:541] Agent attributes: [ ]
I0930 13:00:42.350461 30370 slave.cpp:546] Agent hostname: e0237b91f525
I0930 13:00:42.351809 30375 state.cpp:57] Recovering state from '/tmp/Endpoint_SlaveEndpointTest_UnauthorizedRequest_1_DpS9lO/meta'
I0930 13:00:42.351933 30370 process.cpp:3377] Handling HTTP event for process 'slave(611)' with path: '/slave(611)/monitor/statistics.json'
I0930 13:00:42.352396 30372 status_update_manager.cpp:203] Recovering status update manager
I0930 13:00:42.352527 30372 containerizer.cpp:580] Recovering containerizer
I0930 13:00:42.353058 30366 http.cpp:835] Authorizing principal 'test-principal' to GET the '/monitor/statistics.json' endpoint
I0930 13:00:42.353909 30374 provisioner.cpp:253] Provisioner recovery complete
I0930 13:00:42.354249 30374 slave.cpp:5256] Finished recovery
I0930 13:00:42.354846 30374 slave.cpp:5428] Querying resource estimator for oversubscribable resources
I0930 13:00:42.355329 30367 slave.cpp:5442] Received oversubscribable resources {} from the resource estimator
I0930 13:00:42.355476 30363 slave.cpp:787] Agent terminating
[ OK ] Endpoint/SlaveEndpointTest.UnauthorizedRequest/1 (22 ms)
[ RUN ] Endpoint/SlaveEndpointTest.UnauthorizedRequest/2
I0930 13:00:42.364068 30343 containerizer.cpp:226] Using isolation: posix/cpu,posix/mem,filesystem/posix,network/cni
W0930 13:00:42.364625 30343 backend.cpp:75] Failed to create 'aufs' backend: AufsBackend requires root privileges, but is running as user mesos
W0930 13:00:42.364781 30343 backend.cpp:75] Failed to create 'bind' backend: BindBackend requires root privileges
I0930 13:00:42.367625 30375 slave.cpp:208] Mesos agent started on (612)@172.17.0.2:57796
I0930 13:00:42.367645 30375 slave.cpp:209] Flags at startup: --acls="" --appc_simple_discovery_uri_prefix="http://" --appc_store_dir="/tmp/mesos/store/appc" --authenticate_http_readonly="true" --authenticate_http_readwrite="true" --authenticatee="crammd5" --authentication_backoff_factor="1secs" --authorizer="local" --cgroups_cpu_enable_pids_and_tids_count="false" --cgroups_enable_cfs="false" --cgroups_hierarchy="/sys/fs/cgroup" --cgroups_limit_swap="false" --cgroups_root="mesos" --container_disk_watch_interval="15secs" --containerizers="mesos" --credential="/tmp/Endpoint_SlaveEndpointTest_UnauthorizedRequest_2_eGgSpO/credential" --default_role="*" --disk_watch_interval="1mins" --docker="docker" --docker_kill_orphans="true" --docker_registry="https://registry-1.docker.io" --docker_remove_delay="6hrs" --docker_socket="/var/run/docker.sock" --docker_stop_timeout="0ns" --docker_store_dir="/tmp/mesos/store/docker" --docker_volume_checkpoint_dir="/var/run/mesos/isolators/docker/volume" --enforce_container_disk_quota="false" --executor_registration_timeout="1mins" --executor_shutdown_grace_period="5secs" --fetcher_cache_dir="/tmp/Endpoint_SlaveEndpointTest_UnauthorizedRequest_2_eGgSpO/fetch" --fetcher_cache_size="2GB" --frameworks_home="" --gc_delay="1weeks" --gc_disk_headroom="0.1" --hadoop_home="" --help="true" --hostname_lookup="true" --http_authenticators="basic" --http_command_executor="false" --http_credentials="/tmp/Endpoint_SlaveEndpointTest_UnauthorizedRequest_2_eGgSpO/http_credentials" --image_provisioner_backend="copy" --initialize_driver_logging="true" --isolation="posix/cpu,posix/mem" --launcher="posix" --launcher_dir="/mesos/mesos-1.1.0/_build/src" --logbufsecs="0" --logging_level="INFO" --oversubscribed_resources_interval="15secs" --perf_duration="10secs" --perf_interval="1mins" --qos_correction_interval_min="0ns" --quiet="false" --recover="reconnect" --recovery_timeout="15mins" --registration_backoff_factor="10ms" --resources="cpus:2;gpus:0;mem:1024;disk:1024;ports:[31000-32000]" --revocable_cpu_low_priority="true" --runtime_dir="/tmp/Endpoint_SlaveEndpointTest_UnauthorizedRequest_2_eGgSpO" --sandbox_directory="/mnt/mesos/sandbox" --strict="true" --switch_user="true" --systemd_enable_support="true" --systemd_runtime_directory="/run/systemd/system" --version="false" --work_dir="/tmp/Endpoint_SlaveEndpointTest_UnauthorizedRequest_2_lccJbd"
I0930 13:00:42.368129 30375 credentials.hpp:86] Loading credential for authentication from '/tmp/Endpoint_SlaveEndpointTest_UnauthorizedRequest_2_eGgSpO/credential'
I0930 13:00:42.368377 30375 slave.cpp:346] Agent using credential for: test-principal
I0930 13:00:42.368402 30375 credentials.hpp:37] Loading credentials for authentication from '/tmp/Endpoint_SlaveEndpointTest_UnauthorizedRequest_2_eGgSpO/http_credentials'
I0930 13:00:42.368713 30375 http.cpp:883] Using default 'basic' HTTP authenticator for realm 'mesos-agent-readonly'
I0930 13:00:42.368863 30375 http.cpp:883] Using default 'basic' HTTP authenticator for realm 'mesos-agent-readwrite'
I0930 13:00:42.369998 30375 slave.cpp:533] Agent resources: cpus(*):2; mem(*):1024; disk(*):1024; ports(*):[31000-32000]
I0930 13:00:42.370071 30375 slave.cpp:541] Agent attributes: [ ]
I0930 13:00:42.370085 30375 slave.cpp:546] Agent hostname: e0237b91f525
I0930 13:00:42.371449 30375 process.cpp:3377] Handling HTTP event for process 'slave(612)' with path: '/slave(612)/containers'
I0930 13:00:42.371486 30376 state.cpp:57] Recovering state from '/tmp/Endpoint_SlaveEndpointTest_UnauthorizedRequest_2_lccJbd/meta'
I0930 13:00:42.372289 30372 status_update_manager.cpp:203] Recovering status update manager
I0930 13:00:42.372388 30364 http.cpp:835] Authorizing principal 'test-principal' to GET the '/containers' endpoint
I0930 13:00:42.372761 30376 containerizer.cpp:580] Recovering containerizer
I0930 13:00:42.374456 30365 provisioner.cpp:253] Provisioner recovery complete
I0930 13:00:42.374853 30367 slave.cpp:787] Agent terminating
[ OK ] Endpoint/SlaveEndpointTest.UnauthorizedRequest/2 (19 ms)
[ RUN ] Endpoint/SlaveEndpointTest.NoAuthorizer/0
I0930 13:00:42.383117 30343 containerizer.cpp:226] Using isolation: posix/cpu,posix/mem,filesystem/posix,network/cni
W0930 13:00:42.383666 30343 backend.cpp:75] Failed to create 'aufs' backend: AufsBackend requires root privileges, but is running as user mesos
W0930 13:00:42.383810 30343 backend.cpp:75] Failed to create 'bind' backend: BindBackend requires root privileges
I0930 13:00:42.385015 30343 cluster.cpp:435] Creating default 'local' authorizer
I0930 13:00:42.386487 30364 slave.cpp:208] Mesos agent started on (613)@172.17.0.2:57796
I0930 13:00:42.386535 30364 slave.cpp:209] Flags at startup: --acls="" --appc_simple_discovery_uri_prefix="http://" --appc_store_dir="/tmp/mesos/store/appc" --authenticate_http_readonly="true" --authenticate_http_readwrite="true" --authenticatee="crammd5" --authentication_backoff_factor="1secs" --authorizer="local" --cgroups_cpu_enable_pids_and_tids_count="false" --cgroups_enable_cfs="false" --cgroups_hierarchy="/sys/fs/cgroup" --cgroups_limit_swap="false" --cgroups_root="mesos" --container_disk_watch_interval="15secs" --containerizers="mesos" --credential="/tmp/Endpoint_SlaveEndpointTest_NoAuthorizer_0_oPTefC/credential" --default_role="*" --disk_watch_interval="1mins" --docker="docker" --docker_kill_orphans="true" --docker_registry="https://registry-1.docker.io" --docker_remove_delay="6hrs" --docker_socket="/var/run/docker.sock" --docker_stop_timeout="0ns" --docker_store_dir="/tmp/mesos/store/docker" --docker_volume_checkpoint_dir="/var/run/mesos/isolators/docker/volume" --enforce_container_disk_quota="false" --executor_registration_timeout="1mins" --executor_shutdown_grace_period="5secs" --fetcher_cache_dir="/tmp/Endpoint_SlaveEndpointTest_NoAuthorizer_0_oPTefC/fetch" --fetcher_cache_size="2GB" --frameworks_home="" --gc_delay="1weeks" --gc_disk_headroom="0.1" --hadoop_home="" --help="false" --hostname_lookup="true" --http_authenticators="basic" --http_command_executor="false" --http_credentials="/tmp/Endpoint_SlaveEndpointTest_NoAuthorizer_0_oPTefC/http_credentials" --image_provisioner_backend="copy" --initialize_driver_logging="true" --isolation="posix/cpu,posix/mem" --launcher="posix" --launcher_dir="/mesos/mesos-1.1.0/_build/src" --logbufsecs="0" --logging_level="INFO" --oversubscribed_resources_interval="15secs" --perf_duration="10secs" --perf_interval="1mins" --qos_correction_interval_min="0ns" --quiet="false" --recover="reconnect" --recovery_timeout="15mins" --registration_backoff_factor="10ms" --resources="cpus:2;gpus:0;mem:1024;disk:1024;ports:[31000-32000]" --revocable_cpu_low_priority="true" --runtime_dir="/tmp/Endpoint_SlaveEndpointTest_NoAuthorizer_0_oPTefC" --sandbox_directory="/mnt/mesos/sandbox" --strict="true" --switch_user="true" --systemd_enable_support="true" --systemd_runtime_directory="/run/systemd/system" --version="false" --work_dir="/tmp/Endpoint_SlaveEndpointTest_NoAuthorizer_0_onV1X0"
I0930 13:00:42.387039 30364 credentials.hpp:86] Loading credential for authentication from '/tmp/Endpoint_SlaveEndpointTest_NoAuthorizer_0_oPTefC/credential'
I0930 13:00:42.387240 30364 slave.cpp:346] Agent using credential for: test-principal
I0930 13:00:42.387265 30364 credentials.hpp:37] Loading credentials for authentication from '/tmp/Endpoint_SlaveEndpointTest_NoAuthorizer_0_oPTefC/http_credentials'
I0930 13:00:42.387531 30364 http.cpp:883] Using default 'basic' HTTP authenticator for realm 'mesos-agent-readonly'
I0930 13:00:42.387678 30364 http.cpp:883] Using default 'basic' HTTP authenticator for realm 'mesos-agent-readwrite'
I0930 13:00:42.388875 30364 slave.cpp:533] Agent resources: cpus(*):2; mem(*):1024; disk(*):1024; ports(*):[31000-32000]
I0930 13:00:42.388950 30364 slave.cpp:541] Agent attributes: [ ]
I0930 13:00:42.388968 30364 slave.cpp:546] Agent hostname: e0237b91f525
I0930 13:00:42.390703 30364 process.cpp:3377] Handling HTTP event for process 'slave(613)' with path: '/slave(613)/monitor/statistics'
I0930 13:00:42.391193 30374 state.cpp:57] Recovering state from '/tmp/Endpoint_SlaveEndpointTest_NoAuthorizer_0_onV1X0/meta'
I0930 13:00:42.392503 30364 status_update_manager.cpp:203] Recovering status update manager
I0930 13:00:42.392779 30374 containerizer.cpp:580] Recovering containerizer
I0930 13:00:42.394923 30374 provisioner.cpp:253] Provisioner recovery complete
I0930 13:00:42.395366 30376 slave.cpp:5256] Finished recovery
I0930 13:00:42.396067 30376 slave.cpp:5428] Querying resource estimator for oversubscribable resources
I0930 13:00:42.396432 30376 slave.cpp:5442] Received oversubscribable resources {} from the resource estimator
I0930 13:00:42.396692 30375 http.cpp:835] Authorizing principal 'test-principal' to GET the '/monitor/statistics' endpoint
I0930 13:00:42.401904 30375 slave.cpp:787] Agent terminating
[ OK ] Endpoint/SlaveEndpointTest.NoAuthorizer/0 (27 ms)
[ RUN ] Endpoint/SlaveEndpointTest.NoAuthorizer/1
I0930 13:00:42.411063 30343 containerizer.cpp:226] Using isolation: posix/cpu,posix/mem,filesystem/posix,network/cni
W0930 13:00:42.411712 30343 backend.cpp:75] Failed to create 'aufs' backend: AufsBackend requires root privileges, but is running as user mesos
W0930 13:00:42.411895 30343 backend.cpp:75] Failed to create 'bind' backend: BindBackend requires root privileges
I0930 13:00:42.413252 30343 cluster.cpp:435] Creating default 'local' authorizer
I0930 13:00:42.415901 30371 slave.cpp:208] Mesos agent started on (614)@172.17.0.2:57796
I0930 13:00:42.415931 30371 slave.cpp:209] Flags at startup: --acls="" --appc_simple_discovery_uri_prefix="http://" --appc_store_dir="/tmp/mesos/store/appc" --authenticate_http_readonly="true" --authenticate_http_readwrite="true" --authenticatee="crammd5" --authentication_backoff_factor="1secs" --authorizer="local" --cgroups_cpu_enable_pids_and_tids_count="false" --cgroups_enable_cfs="false" --cgroups_hierarchy="/sys/fs/cgroup" --cgroups_limit_swap="false" --cgroups_root="mesos" --container_disk_watch_interval="15secs" --containerizers="mesos" --credential="/tmp/Endpoint_SlaveEndpointTest_NoAuthorizer_1_rkUGB1/credential" --default_role="*" --disk_watch_interval="1mins" --docker="docker" --docker_kill_orphans="true" --docker_registry="https://registry-1.docker.io" --docker_remove_delay="6hrs" --docker_socket="/var/run/docker.sock" --docker_stop_timeout="0ns" --docker_store_dir="/tmp/mesos/store/docker" --docker_volume_checkpoint_dir="/var/run/mesos/isolators/docker/volume" --enforce_container_disk_quota="false" --executor_registration_timeout="1mins" --executor_shutdown_grace_period="5secs" --fetcher_cache_dir="/tmp/Endpoint_SlaveEndpointTest_NoAuthorizer_1_rkUGB1/fetch" --fetcher_cache_size="2GB" --frameworks_home="" --gc_delay="1weeks" --gc_disk_headroom="0.1" --hadoop_home="" --help="false" --hostname_lookup="true" --http_authenticators="basic" --http_command_executor="false" --http_credentials="/tmp/Endpoint_SlaveEndpointTest_NoAuthorizer_1_rkUGB1/http_credentials" --image_provisioner_backend="copy" --initialize_driver_logging="true" --isolation="posix/cpu,posix/mem" --launcher="posix" --launcher_dir="/mesos/mesos-1.1.0/_build/src" --logbufsecs="0" --logging_level="INFO" --oversubscribed_resources_interval="15secs" --perf_duration="10secs" --perf_interval="1mins" --qos_correction_interval_min="0ns" --quiet="false" --recover="reconnect" --recovery_timeout="15mins" --registration_backoff_factor="10ms" --resources="cpus:2;gpus:0;mem:1024;disk:1024;ports:[31000-32000]" --revocable_cpu_low_priority="true" --runtime_dir="/tmp/Endpoint_SlaveEndpointTest_NoAuthorizer_1_rkUGB1" --sandbox_directory="/mnt/mesos/sandbox" --strict="true" --switch_user="true" --systemd_enable_support="true" --systemd_runtime_directory="/run/systemd/system" --version="false" --work_dir="/tmp/Endpoint_SlaveEndpointTest_NoAuthorizer_1_3ULYfq"
I0930 13:00:42.416373 30371 credentials.hpp:86] Loading credential for authentication from '/tmp/Endpoint_SlaveEndpointTest_NoAuthorizer_1_rkUGB1/credential'
I0930 13:00:42.416599 30371 slave.cpp:346] Agent using credential for: test-principal
I0930 13:00:42.416622 30371 credentials.hpp:37] Loading credentials for authentication from '/tmp/Endpoint_SlaveEndpointTest_NoAuthorizer_1_rkUGB1/http_credentials'
I0930 13:00:42.416906 30371 http.cpp:883] Using default 'basic' HTTP authenticator for realm 'mesos-agent-readonly'
I0930 13:00:42.417068 30371 http.cpp:883] Using default 'basic' HTTP authenticator for realm 'mesos-agent-readwrite'
I0930 13:00:42.418313 30371 slave.cpp:533] Agent resources: cpus(*):2; mem(*):1024; disk(*):1024; ports(*):[31000-32000]
I0930 13:00:42.418403 30371 slave.cpp:541] Agent attributes: [ ]
I0930 13:00:42.418426 30371 slave.cpp:546] Agent hostname: e0237b91f525
I0930 13:00:42.419908 30377 state.cpp:57] Recovering state from '/tmp/Endpoint_SlaveEndpointTest_NoAuthorizer_1_3ULYfq/meta'
I0930 13:00:42.419991 30371 process.cpp:3377] Handling HTTP event for process 'slave(614)' with path: '/slave(614)/monitor/statistics.json'
I0930 13:00:42.420907 30377 status_update_manager.cpp:203] Recovering status update manager
I0930 13:00:42.421226 30368 containerizer.cpp:580] Recovering containerizer
I0930 13:00:42.422302 30377 http.cpp:835] Authorizing principal 'test-principal' to GET the '/monitor/statistics.json' endpoint
I0930 13:00:42.422785 30366 provisioner.cpp:253] Provisioner recovery complete
I0930 13:00:42.423782 30377 slave.cpp:5256] Finished recovery
I0930 13:00:42.424300 30377 slave.cpp:5428] Querying resource estimator for oversubscribable resources
I0930 13:00:42.424898 30363 slave.cpp:5442] Received oversubscribable resources {} from the resource estimator
I0930 13:00:42.426108 30365 slave.cpp:787] Agent terminating
[ OK ] Endpoint/SlaveEndpointTest.NoAuthorizer/1 (25 ms)
[ RUN ] Endpoint/SlaveEndpointTest.NoAuthorizer/2
I0930 13:00:42.443666 30343 containerizer.cpp:226] Using isolation: posix/cpu,posix/mem,filesystem/posix,network/cni
W0930 13:00:42.444931 30343 backend.cpp:75] Failed to create 'aufs' backend: AufsBackend requires root privileges, but is running as user mesos
W0930 13:00:42.445384 30343 backend.cpp:75] Failed to create 'bind' backend: BindBackend requires root privileges
I0930 13:00:42.447580 30343 cluster.cpp:435] Creating default 'local' authorizer
I0930 13:00:42.451195 30376 slave.cpp:208] Mesos agent started on (615)@172.17.0.2:57796
I0930 13:00:42.451225 30376 slave.cpp:209] Flags at startup: --acls="" --appc_simple_discovery_uri_prefix="http://" --appc_store_dir="/tmp/mesos/store/appc" --authenticate_http_readonly="true" --authenticate_http_readwrite="true" --authenticatee="crammd5" --authentication_backoff_factor="1secs" --authorizer="local" --cgroups_cpu_enable_pids_and_tids_count="false" --cgroups_enable_cfs="false" --cgroups_hierarchy="/sys/fs/cgroup" --cgroups_limit_swap="false" --cgroups_root="mesos" --container_disk_watch_interval="15secs" --containerizers="mesos" --credential="/tmp/Endpoint_SlaveEndpointTest_NoAuthorizer_2_sAZugr/credential" --default_role="*" --disk_watch_interval="1mins" --docker="docker" --docker_kill_orphans="true" --docker_registry="https://registry-1.docker.io" --docker_remove_delay="6hrs" --docker_socket="/var/run/docker.sock" --docker_stop_timeout="0ns" --docker_store_dir="/tmp/mesos/store/docker" --docker_volume_checkpoint_dir="/var/run/mesos/isolators/docker/volume" --enforce_container_disk_quota="false" --executor_registration_timeout="1mins" --executor_shutdown_grace_period="5secs" --fetcher_cache_dir="/tmp/Endpoint_SlaveEndpointTest_NoAuthorizer_2_sAZugr/fetch" --fetcher_cache_size="2GB" --frameworks_home="" --gc_delay="1weeks" --gc_disk_headroom="0.1" --hadoop_home="" --help="false" --hostname_lookup="true" --http_authenticators="basic" --http_command_executor="false" --http_credentials="/tmp/Endpoint_SlaveEndpointTest_NoAuthorizer_2_sAZugr/http_credentials" --image_provisioner_backend="copy" --initialize_driver_logging="true" --isolation="posix/cpu,posix/mem" --launcher="posix" --launcher_dir="/mesos/mesos-1.1.0/_build/src" --logbufsecs="0" --logging_level="INFO" --oversubscribed_resources_interval="15secs" --perf_duration="10secs" --perf_interval="1mins" --qos_correction_interval_min="0ns" --quiet="false" --recover="reconnect" --recovery_timeout="15mins" --registration_backoff_factor="10ms" --resources="cpus:2;gpus:0;mem:1024;disk:1024;ports:[31000-32000]" --revocable_cpu_low_priority="true" --runtime_dir="/tmp/Endpoint_SlaveEndpointTest_NoAuthorizer_2_sAZugr" --sandbox_directory="/mnt/mesos/sandbox" --strict="true" --switch_user="true" --systemd_enable_support="true" --systemd_runtime_directory="/run/systemd/system" --version="false" --work_dir="/tmp/Endpoint_SlaveEndpointTest_NoAuthorizer_2_F6aYPP"
I0930 13:00:42.451854 30376 credentials.hpp:86] Loading credential for authentication from '/tmp/Endpoint_SlaveEndpointTest_NoAuthorizer_2_sAZugr/credential'
I0930 13:00:42.452080 30376 slave.cpp:346] Agent using credential for: test-principal
I0930 13:00:42.452107 30376 credentials.hpp:37] Loading credentials for authentication from '/tmp/Endpoint_SlaveEndpointTest_NoAuthorizer_2_sAZugr/http_credentials'
I0930 13:00:42.452402 30376 http.cpp:883] Using default 'basic' HTTP authenticator for realm 'mesos-agent-readonly'
I0930 13:00:42.452576 30376 http.cpp:883] Using default 'basic' HTTP authenticator for realm 'mesos-agent-readwrite'
I0930 13:00:42.454422 30376 slave.cpp:533] Agent resources: cpus(*):2; mem(*):1024; disk(*):1024; ports(*):[31000-32000]
I0930 13:00:42.454500 30376 slave.cpp:541] Agent attributes: [ ]
I0930 13:00:42.454521 30376 slave.cpp:546] Agent hostname: e0237b91f525
I0930 13:00:42.455899 30363 state.cpp:57] Recovering state from '/tmp/Endpoint_SlaveEndpointTest_NoAuthorizer_2_F6aYPP/meta'
I0930 13:00:42.455987 30376 process.cpp:3377] Handling HTTP event for process 'slave(615)' with path: '/slave(615)/containers'
I0930 13:00:42.456615 30373 status_update_manager.cpp:203] Recovering status update manager
I0930 13:00:42.456774 30367 containerizer.cpp:580] Recovering containerizer
I0930 13:00:42.457118 30366 http.cpp:835] Authorizing principal 'test-principal' to GET the '/containers' endpoint
I0930 13:00:42.458556 30371 provisioner.cpp:253] Provisioner recovery complete
I0930 13:00:42.458865 30364 slave.cpp:5256] Finished recovery
I0930 13:00:42.459370 30364 slave.cpp:5428] Querying resource estimator for oversubscribable resources
I0930 13:00:42.459697 30366 slave.cpp:5442] Received oversubscribable resources {} from the resource estimator
I0930 13:00:42.461649 30365 slave.cpp:787] Agent terminating
[ OK ] Endpoint/SlaveEndpointTest.NoAuthorizer/2 (34 ms)
[----------] 9 tests from Endpoint/SlaveEndpointTest (216 ms total)
[----------] Global test environment tear-down
[==========] 1339 tests from 152 test cases ran. (432726 ms total)
[ PASSED ] 1338 tests.
[ FAILED ] 1 test, listed below:
[ FAILED ] RegistrarTest.MarkUnreachable
1 FAILED TEST
YOU HAVE 6 DISABLED TESTS
make[4]: *** [check-local] Error 1
make[4]: Leaving directory `/mesos/mesos-1.1.0/_build/src'
make[3]: *** [check-am] Error 2
make[3]: Leaving directory `/mesos/mesos-1.1.0/_build/src'
make[2]: *** [check] Error 2
make[2]: Leaving directory `/mesos/mesos-1.1.0/_build/src'
make[1]: *** [check-recursive] Error 1
make[1]: Leaving directory `/mesos/mesos-1.1.0/_build'
make: *** [distcheck] Error 1
+ docker rmi mesos-1475238050-2884
Untagged: mesos-1475238050-2884:latest
Deleted: sha256:546eac04cd4860cc49e8ce7cd95e9c7546588186ce1a3959511f7fd8df79930d
Deleted: sha256:f10f3e2ae0620f62afe0b8735c2b5137a3b7ee3bca83155292410bdb856f5fbd
Deleted: sha256:627a07cb7287a858e8e567122d02880fd9ff93dd04987e298a639e2c9d387482
Deleted: sha256:17d68f946b001a90f2fbbcd69c9350ab1078a2d53f053d35652a363a26845174
Deleted: sha256:5173f5bd8a0eea648160d79a103c3193896082ca23948faa5edbf9587c96c42c
Deleted: sha256:3c9d3303c5d066168af8ed02bd360f9bb2a3c62bfa1f5ac5548fd27814a1c679
Deleted: sha256:b5159d4e5cd770cf9f0d8c30cbd972f6ce6062332107321b57cbe9b740cd533f
Deleted: sha256:00d32e48c5491b6110b423d3bf2a0f1b67dcc585b6505a2ebe9481069fd4582b
Deleted: sha256:52ec461f241b57a0610e171e95e51f77ee25111255d5c3368708d8a73d34b35c
Deleted: sha256:ec20247b092adb948baabd24f4dfff07f223a5f455bedadcce6eede7b87f5f98
Deleted: sha256:78cf787a4e31c7c5a559ff30291536b3df23f1fd948d37416de311ea50fda992
Deleted: sha256:83d6bec6f0a5ada73ab8404fd207482d35e0082099c37048cde85e12e5ad9e2d
Deleted: sha256:b58999ccd09de5a01b9cac8ad8667f9744cbd5c6e6da283a027f27a7717273a9
Deleted: sha256:f7ce596e52ecbaef4a6dd45f5766278a9fa292b75e3b30be46332944c591e488
Deleted: sha256:dbd5b950d0e020217f6407e28924fe094862fa76b3dc6acf76a3d314d1c28115
Deleted: sha256:aee4359376172c1de1630314ff77ccc205e1e922976295d3fe24a8da6afc6703
Deleted: sha256:0fa61c1d4c7eb6727151fc4421cf2610760bfcd1cf4327ca921501fa25daba22
Deleted: sha256:8d1b624f8727f4f6c11eaa2f2a77c688be35e46c9b21d2036a3742f9d20aee6e
Deleted: sha256:ae26224238e7016e20ffe2ffa99539144e490e1c4e0e38d949537742da56535b
Deleted: sha256:1a93855d7b5fad08f105aabd569875a33352b1762e4f42a44323c70a54f56b33
Deleted: sha256:0f0941fd5d51152e493c3812fbd1e6efd8bde42bb660cab11754484c61103e2e
Deleted: sha256:410d1194f642eb5eab89b587b067159198456380700684d168cc817207f2562d
Deleted: sha256:c6500a17ca4719e99d98459e4ed5227c37c564d07bb111323bb8d8510ba7fb68
Deleted: sha256:5035135d832eade93b9f726e756d858fafaaba7f4bfb547bc9e1e44deac617e0
Build step 'Execute shell' marked build as failure
Jenkins build is back to normal : Mesos » autotools,gcc,--verbose --enable-libevent --enable-ssl,GLOG_v=1 MESOS_VERBOSE=1,ubuntu:14.04,(docker||Hadoop)&&(!ubuntu-us1)&&(!ubuntu-6) #2720
Posted by Apache Jenkins Server <je...@builds.apache.org>.
See <https://builds.apache.org/job/Mesos/BUILDTOOL=autotools,COMPILER=gcc,CONFIGURATION=--verbose%20--enable-libevent%20--enable-ssl,ENVIRONMENT=GLOG_v=1%20MESOS_VERBOSE=1,OS=ubuntu%3A14.04,label_exp=(docker%7C%7CHadoop)&&(!ubuntu-us1)&&(!ubuntu-6)/2720/changes>
Re: Build failed in Jenkins: Mesos » autotools,gcc,--verbose --enable-libevent --enable-ssl,GLOG_v=1 MESOS_VERBOSE=1,ubuntu:14.04,(docker||Hadoop)&&(!ubuntu-us1)&&(!ubuntu-6) #2719
Posted by Neil Conway <ne...@gmail.com>.
It's a little difficult to isolate the problem, because of how stdout
and stderr seem to be intermixed in the test log. Test failure is:
../../src/tests/registrar_tests.cpp:332: Failure
(registrar.apply( Owned<Operation>( new MarkSlaveUnreachable(info1,
protobuf::getCurrentTime())))).failure(): Failed to update registry:
Failed to perform store within 10secs
Which I'd suspect is either (a) a timeout due to a slow VM or
overloaded test machine, or (b) bug in registrar/replicated log that
isn't specific to the MarkSlaveUnreachable registry operation. I'm
inclined to shelve this until/unless we see another test failure.
Neil
On Fri, Sep 30, 2016 at 5:21 PM, Vinod Kone <vi...@apache.org> wrote:
> neil, can you take a look?
>
> On Fri, Sep 30, 2016 at 6:02 AM, Apache Jenkins Server <
> jenkins@builds.apache.org> wrote:
>
>> See <https://builds.apache.org/job/Mesos/BUILDTOOL=autotools,
>> COMPILER=gcc,CONFIGURATION=--verbose%20--enable-libevent%
>> 20--enable-ssl,ENVIRONMENT=GLOG_v=1%20MESOS_VERBOSE=1,OS=
>> ubuntu%3A14.04,label_exp=(docker%7C%7CHadoop)&&(!ubuntu-
>> us1)&&(!ubuntu-6)/2719/changes>
>>
>> Changes:
>>
>> [alexr] Fixed help display for mesos-containerizer subcommands.
>>
>> ------------------------------------------
>> [...truncated 210601 lines...]
>> I0930 13:00:42.266724 30372 slave.cpp:787] Agent terminating
>> [ OK ] Endpoint/SlaveEndpointTest.AuthorizedRequest/0 (19 ms)
>> [ RUN ] Endpoint/SlaveEndpointTest.AuthorizedRequest/1
>> I0930 13:00:42.274679 30343 containerizer.cpp:226] Using isolation:
>> posix/cpu,posix/mem,filesystem/posix,network/cni
>> W0930 13:00:42.275254 30343 backend.cpp:75] Failed to create 'aufs'
>> backend: AufsBackend requires root privileges, but is running as user mesos
>> W0930 13:00:42.275403 30343 backend.cpp:75] Failed to create 'bind'
>> backend: BindBackend requires root privileges
>> I0930 13:00:42.278074 30365 slave.cpp:208] Mesos agent started on (608)@
>> 172.17.0.2:57796
>> I0930 13:00:42.278100 30365 slave.cpp:209] Flags at startup: --acls=""
>> --appc_simple_discovery_uri_prefix="http://" --appc_store_dir="/tmp/mesos/store/appc"
>> --authenticate_http_readonly="true" --authenticate_http_readwrite="true"
>> --authenticatee="crammd5" --authentication_backoff_factor="1secs"
>> --authorizer="local" --cgroups_cpu_enable_pids_and_tids_count="false"
>> --cgroups_enable_cfs="false" --cgroups_hierarchy="/sys/fs/cgroup"
>> --cgroups_limit_swap="false" --cgroups_root="mesos" --container_disk_watch_interval="15secs"
>> --containerizers="mesos" --credential="/tmp/Endpoint_SlaveEndpointTest_
>> AuthorizedRequest_1_CcOXge/credential" --default_role="*"
>> --disk_watch_interval="1mins" --docker="docker"
>> --docker_kill_orphans="true" --docker_registry="https://
>> registry-1.docker.io" --docker_remove_delay="6hrs"
>> --docker_socket="/var/run/docker.sock" --docker_stop_timeout="0ns"
>> --docker_store_dir="/tmp/mesos/store/docker" --docker_volume_checkpoint_
>> dir="/var/run/mesos/isolators/docker/volume" --enforce_container_disk_quota="false"
>> --executor_registration_timeout="1mins" --executor_shutdown_grace_period="5secs"
>> --fetcher_cache_dir="/tmp/Endpoint_SlaveEndpointTest_
>> AuthorizedRequest_1_CcOXge/fetch" --fetcher_cache_size="2GB"
>> --frameworks_home="" --gc_delay="1weeks" --gc_disk_headroom="0.1"
>> --hadoop_home="" --help="true" --hostname_lookup="true"
>> --http_authenticators="basic" --http_command_executor="false"
>> --http_credentials="/tmp/Endpoint_SlaveEndpointTest_
>> AuthorizedRequest_1_CcOXge/http_credentials" --image_provisioner_backend="copy"
>> --initialize_driver_logging="true" --isolation="posix/cpu,posix/mem"
>> --launcher="posix" --launcher_dir="/mesos/mesos-1.1.0/_build/src"
>> --logbufsecs="0" --logging_level="INFO" --oversubscribed_resources_interval="15secs"
>> --perf_duration="10secs" --perf_interval="1mins"
>> --qos_correction_interval_min="0ns" --quiet="false" --recover="reconnect"
>> --recovery_timeout="15mins" --registration_backoff_factor="10ms"
>> --resources="cpus:2;gpus:0;mem:1024;disk:1024;ports:[31000-32000]"
>> --revocable_cpu_low_priority="true" --runtime_dir="/tmp/Endpoint_
>> SlaveEndpointTest_AuthorizedRequest_1_CcOXge" --sandbox_directory="/mnt/mesos/sandbox"
>> --strict="true" --switch_user="true" --systemd_enable_support="true"
>> --systemd_runtime_directory="/run/systemd/system" --version="false"
>> --work_dir="/tmp/Endpoint_SlaveEndpointTest_AuthorizedRequest_1_HQ1khD"
>> I0930 13:00:42.278834 30365 credentials.hpp:86] Loading credential for
>> authentication from '/tmp/Endpoint_SlaveEndpointTest_
>> AuthorizedRequest_1_CcOXge/credential'
>> I0930 13:00:42.279134 30365 slave.cpp:346] Agent using credential for:
>> test-principal
>> I0930 13:00:42.279158 30365 credentials.hpp:37] Loading credentials for
>> authentication from '/tmp/Endpoint_SlaveEndpointTest_
>> AuthorizedRequest_1_CcOXge/http_credentials'
>> I0930 13:00:42.279412 30365 http.cpp:883] Using default 'basic' HTTP
>> authenticator for realm 'mesos-agent-readonly'
>> I0930 13:00:42.279566 30365 http.cpp:883] Using default 'basic' HTTP
>> authenticator for realm 'mesos-agent-readwrite'
>> I0930 13:00:42.280490 30365 slave.cpp:533] Agent resources: cpus(*):2;
>> mem(*):1024; disk(*):1024; ports(*):[31000-32000]
>> I0930 13:00:42.280565 30365 slave.cpp:541] Agent attributes: [ ]
>> I0930 13:00:42.280633 30365 slave.cpp:546] Agent hostname: e0237b91f525
>> I0930 13:00:42.282037 30375 state.cpp:57] Recovering state from
>> '/tmp/Endpoint_SlaveEndpointTest_AuthorizedRequest_1_HQ1khD/meta'
>> I0930 13:00:42.282135 30365 process.cpp:3377] Handling HTTP event for
>> process 'slave(608)' with path: '/slave(608)/monitor/statistics.json'
>> I0930 13:00:42.282678 30365 status_update_manager.cpp:203] Recovering
>> status update manager
>> I0930 13:00:42.282846 30377 containerizer.cpp:580] Recovering containerizer
>> I0930 13:00:42.283315 30362 http.cpp:835] Authorizing principal
>> 'test-principal' to GET the '/monitor/statistics.json' endpoint
>> I0930 13:00:42.285405 30373 provisioner.cpp:253] Provisioner recovery
>> complete
>> I0930 13:00:42.285765 30362 slave.cpp:5256] Finished recovery
>> I0930 13:00:42.286366 30362 slave.cpp:5428] Querying resource estimator
>> for oversubscribable resources
>> I0930 13:00:42.286640 30363 slave.cpp:5442] Received oversubscribable
>> resources {} from the resource estimator
>> I0930 13:00:42.286715 30363 slave.cpp:787] Agent terminating
>> [ OK ] Endpoint/SlaveEndpointTest.AuthorizedRequest/1 (19 ms)
>> [ RUN ] Endpoint/SlaveEndpointTest.AuthorizedRequest/2
>> I0930 13:00:42.294837 30343 containerizer.cpp:226] Using isolation:
>> posix/cpu,posix/mem,filesystem/posix,network/cni
>> W0930 13:00:42.295420 30343 backend.cpp:75] Failed to create 'aufs'
>> backend: AufsBackend requires root privileges, but is running as user mesos
>> W0930 13:00:42.295577 30343 backend.cpp:75] Failed to create 'bind'
>> backend: BindBackend requires root privileges
>> I0930 13:00:42.298198 30364 slave.cpp:208] Mesos agent started on (609)@
>> 172.17.0.2:57796
>> I0930 13:00:42.298224 30364 slave.cpp:209] Flags at startup: --acls=""
>> --appc_simple_discovery_uri_prefix="http://" --appc_store_dir="/tmp/mesos/store/appc"
>> --authenticate_http_readonly="true" --authenticate_http_readwrite="true"
>> --authenticatee="crammd5" --authentication_backoff_factor="1secs"
>> --authorizer="local" --cgroups_cpu_enable_pids_and_tids_count="false"
>> --cgroups_enable_cfs="false" --cgroups_hierarchy="/sys/fs/cgroup"
>> --cgroups_limit_swap="false" --cgroups_root="mesos" --container_disk_watch_interval="15secs"
>> --containerizers="mesos" --credential="/tmp/Endpoint_SlaveEndpointTest_
>> AuthorizedRequest_2_XhGarC/credential" --default_role="*"
>> --disk_watch_interval="1mins" --docker="docker"
>> --docker_kill_orphans="true" --docker_registry="https://
>> registry-1.docker.io" --docker_remove_delay="6hrs"
>> --docker_socket="/var/run/docker.sock" --docker_stop_timeout="0ns"
>> --docker_store_dir="/tmp/mesos/store/docker" --docker_volume_checkpoint_
>> dir="/var/run/mesos/isolators/docker/volume" --enforce_container_disk_quota="false"
>> --executor_registration_timeout="1mins" --executor_shutdown_grace_period="5secs"
>> --fetcher_cache_dir="/tmp/Endpoint_SlaveEndpointTest_
>> AuthorizedRequest_2_XhGarC/fetch" --fetcher_cache_size="2GB"
>> --frameworks_home="" --gc_delay="1weeks" --gc_disk_headroom="0.1"
>> --hadoop_home="" --help="true" --hostname_lookup="true"
>> --http_authenticators="basic" --http_command_executor="false"
>> --http_credentials="/tmp/Endpoint_SlaveEndpointTest_
>> AuthorizedRequest_2_XhGarC/http_credentials" --image_provisioner_backend="copy"
>> --initialize_driver_logging="true" --isolation="posix/cpu,posix/mem"
>> --launcher="posix" --launcher_dir="/mesos/mesos-1.1.0/_build/src"
>> --logbufsecs="0" --logging_level="INFO" --oversubscribed_resources_interval="15secs"
>> --perf_duration="10secs" --perf_interval="1mins"
>> --qos_correction_interval_min="0ns" --quiet="false" --recover="reconnect"
>> --recovery_timeout="15mins" --registration_backoff_factor="10ms"
>> --resources="cpus:2;gpus:0;mem:1024;disk:1024;ports:[31000-32000]"
>> --revocable_cpu_low_priority="true" --runtime_dir="/tmp/Endpoint_
>> SlaveEndpointTest_AuthorizedRequest_2_XhGarC" --sandbox_directory="/mnt/mesos/sandbox"
>> --strict="true" --switch_user="true" --systemd_enable_support="true"
>> --systemd_runtime_directory="/run/systemd/system" --version="false"
>> --work_dir="/tmp/Endpoint_SlaveEndpointTest_AuthorizedRequest_2_zHgho1"
>> I0930 13:00:42.298678 30364 credentials.hpp:86] Loading credential for
>> authentication from '/tmp/Endpoint_SlaveEndpointTest_
>> AuthorizedRequest_2_XhGarC/credential'
>> I0930 13:00:42.298913 30364 slave.cpp:346] Agent using credential for:
>> test-principal
>> I0930 13:00:42.298935 30364 credentials.hpp:37] Loading credentials for
>> authentication from '/tmp/Endpoint_SlaveEndpointTest_
>> AuthorizedRequest_2_XhGarC/http_credentials'
>> I0930 13:00:42.299183 30364 http.cpp:883] Using default 'basic' HTTP
>> authenticator for realm 'mesos-agent-readonly'
>> I0930 13:00:42.299317 30364 http.cpp:883] Using default 'basic' HTTP
>> authenticator for realm 'mesos-agent-readwrite'
>> I0930 13:00:42.300258 30364 slave.cpp:533] Agent resources: cpus(*):2;
>> mem(*):1024; disk(*):1024; ports(*):[31000-32000]
>> I0930 13:00:42.300343 30364 slave.cpp:541] Agent attributes: [ ]
>> I0930 13:00:42.300365 30364 slave.cpp:546] Agent hostname: e0237b91f525
>> I0930 13:00:42.301707 30364 process.cpp:3377] Handling HTTP event for
>> process 'slave(609)' with path: '/slave(609)/containers'
>> I0930 13:00:42.301733 30363 state.cpp:57] Recovering state from
>> '/tmp/Endpoint_SlaveEndpointTest_AuthorizedRequest_2_zHgho1/meta'
>> I0930 13:00:42.302340 30364 status_update_manager.cpp:203] Recovering
>> status update manager
>> I0930 13:00:42.302575 30364 containerizer.cpp:580] Recovering containerizer
>> I0930 13:00:42.302814 30365 http.cpp:835] Authorizing principal
>> 'test-principal' to GET the '/containers' endpoint
>> I0930 13:00:42.304533 30362 provisioner.cpp:253] Provisioner recovery
>> complete
>> I0930 13:00:42.310474 30365 slave.cpp:5256] Finished recovery
>> I0930 13:00:42.311166 30365 slave.cpp:5428] Querying resource estimator
>> for oversubscribable resources
>> I0930 13:00:42.311419 30373 slave.cpp:5442] Received oversubscribable
>> resources {} from the resource estimator
>> I0930 13:00:42.312932 30377 slave.cpp:787] Agent terminating
>> [ OK ] Endpoint/SlaveEndpointTest.AuthorizedRequest/2 (25 ms)
>> [ RUN ] Endpoint/SlaveEndpointTest.UnauthorizedRequest/0
>> I0930 13:00:42.320956 30343 containerizer.cpp:226] Using isolation:
>> posix/cpu,posix/mem,filesystem/posix,network/cni
>> W0930 13:00:42.321509 30343 backend.cpp:75] Failed to create 'aufs'
>> backend: AufsBackend requires root privileges, but is running as user mesos
>> W0930 13:00:42.321658 30343 backend.cpp:75] Failed to create 'bind'
>> backend: BindBackend requires root privileges
>> I0930 13:00:42.324277 30369 slave.cpp:208] Mesos agent started on (610)@
>> 172.17.0.2:57796
>> I0930 13:00:42.324304 30369 slave.cpp:209] Flags at startup: --acls=""
>> --appc_simple_discovery_uri_prefix="http://" --appc_store_dir="/tmp/mesos/store/appc"
>> --authenticate_http_readonly="true" --authenticate_http_readwrite="true"
>> --authenticatee="crammd5" --authentication_backoff_factor="1secs"
>> --authorizer="local" --cgroups_cpu_enable_pids_and_tids_count="false"
>> --cgroups_enable_cfs="false" --cgroups_hierarchy="/sys/fs/cgroup"
>> --cgroups_limit_swap="false" --cgroups_root="mesos" --container_disk_watch_interval="15secs"
>> --containerizers="mesos" --credential="/tmp/Endpoint_SlaveEndpointTest_
>> UnauthorizedRequest_0_Dez7R0/credential" --default_role="*"
>> --disk_watch_interval="1mins" --docker="docker"
>> --docker_kill_orphans="true" --docker_registry="https://
>> registry-1.docker.io" --docker_remove_delay="6hrs"
>> --docker_socket="/var/run/docker.sock" --docker_stop_timeout="0ns"
>> --docker_store_dir="/tmp/mesos/store/docker" --docker_volume_checkpoint_
>> dir="/var/run/mesos/isolators/docker/volume" --enforce_container_disk_quota="false"
>> --executor_registration_timeout="1mins" --executor_shutdown_grace_period="5secs"
>> --fetcher_cache_dir="/tmp/Endpoint_SlaveEndpointTest_
>> UnauthorizedRequest_0_Dez7R0/fetch" --fetcher_cache_size="2GB"
>> --frameworks_home="" --gc_delay="1weeks" --gc_disk_headroom="0.1"
>> --hadoop_home="" --help="true" --hostname_lookup="true"
>> --http_authenticators="basic" --http_command_executor="false"
>> --http_credentials="/tmp/Endpoint_SlaveEndpointTest_
>> UnauthorizedRequest_0_Dez7R0/http_credentials"
>> --image_provisioner_backend="copy" --initialize_driver_logging="true"
>> --isolation="posix/cpu,posix/mem" --launcher="posix"
>> --launcher_dir="/mesos/mesos-1.1.0/_build/src" --logbufsecs="0"
>> --logging_level="INFO" --oversubscribed_resources_interval="15secs"
>> --perf_duration="10secs" --perf_interval="1mins"
>> --qos_correction_interval_min="0ns" --quiet="false" --recover="reconnect"
>> --recovery_timeout="15mins" --registration_backoff_factor="10ms"
>> --resources="cpus:2;gpus:0;mem:1024;disk:1024;ports:[31000-32000]"
>> --revocable_cpu_low_priority="true" --runtime_dir="/tmp/Endpoint_
>> SlaveEndpointTest_UnauthorizedRequest_0_Dez7R0" --sandbox_directory="/mnt/mesos/sandbox"
>> --strict="true" --switch_user="true" --systemd_enable_support="true"
>> --systemd_runtime_directory="/run/systemd/system" --version="false"
>> --work_dir="/tmp/Endpoint_SlaveEndpointTest_UnauthorizedRequest_0_thXYKp"
>> I0930 13:00:42.324803 30369 credentials.hpp:86] Loading credential for
>> authentication from '/tmp/Endpoint_SlaveEndpointTest_
>> UnauthorizedRequest_0_Dez7R0/credential'
>> I0930 13:00:42.325083 30369 slave.cpp:346] Agent using credential for:
>> test-principal
>> I0930 13:00:42.325111 30369 credentials.hpp:37] Loading credentials for
>> authentication from '/tmp/Endpoint_SlaveEndpointTest_
>> UnauthorizedRequest_0_Dez7R0/http_credentials'
>> I0930 13:00:42.325453 30369 http.cpp:883] Using default 'basic' HTTP
>> authenticator for realm 'mesos-agent-readonly'
>> I0930 13:00:42.325646 30369 http.cpp:883] Using default 'basic' HTTP
>> authenticator for realm 'mesos-agent-readwrite'
>> I0930 13:00:42.326659 30369 slave.cpp:533] Agent resources: cpus(*):2;
>> mem(*):1024; disk(*):1024; ports(*):[31000-32000]
>> I0930 13:00:42.326735 30369 slave.cpp:541] Agent attributes: [ ]
>> I0930 13:00:42.326756 30369 slave.cpp:546] Agent hostname: e0237b91f525
>> I0930 13:00:42.328150 30374 state.cpp:57] Recovering state from
>> '/tmp/Endpoint_SlaveEndpointTest_UnauthorizedRequest_0_thXYKp/meta'
>> I0930 13:00:42.328265 30369 process.cpp:3377] Handling HTTP event for
>> process 'slave(610)' with path: '/slave(610)/monitor/statistics'
>> I0930 13:00:42.328783 30362 status_update_manager.cpp:203] Recovering
>> status update manager
>> I0930 13:00:42.328951 30362 containerizer.cpp:580] Recovering containerizer
>> I0930 13:00:42.329566 30375 http.cpp:835] Authorizing principal
>> 'test-principal' to GET the '/monitor/statistics' endpoint
>> I0930 13:00:42.330826 30362 provisioner.cpp:253] Provisioner recovery
>> complete
>> I0930 13:00:42.331202 30366 slave.cpp:5256] Finished recovery
>> I0930 13:00:42.331903 30366 slave.cpp:5428] Querying resource estimator
>> for oversubscribable resources
>> I0930 13:00:42.332214 30376 slave.cpp:5442] Received oversubscribable
>> resources {} from the resource estimator
>> I0930 13:00:42.332342 30369 slave.cpp:787] Agent terminating
>> [ OK ] Endpoint/SlaveEndpointTest.UnauthorizedRequest/0 (20 ms)
>> [ RUN ] Endpoint/SlaveEndpointTest.UnauthorizedRequest/1
>> I0930 13:00:42.343436 30343 containerizer.cpp:226] Using isolation:
>> posix/cpu,posix/mem,filesystem/posix,network/cni
>> W0930 13:00:42.344255 30343 backend.cpp:75] Failed to create 'aufs'
>> backend: AufsBackend requires root privileges, but is running as user mesos
>> W0930 13:00:42.344431 30343 backend.cpp:75] Failed to create 'bind'
>> backend: BindBackend requires root privileges
>> I0930 13:00:42.348235 30370 slave.cpp:208] Mesos agent started on (611)@
>> 172.17.0.2:57796
>> I0930 13:00:42.348255 30370 slave.cpp:209] Flags at startup: --acls=""
>> --appc_simple_discovery_uri_prefix="http://" --appc_store_dir="/tmp/mesos/store/appc"
>> --authenticate_http_readonly="true" --authenticate_http_readwrite="true"
>> --authenticatee="crammd5" --authentication_backoff_factor="1secs"
>> --authorizer="local" --cgroups_cpu_enable_pids_and_tids_count="false"
>> --cgroups_enable_cfs="false" --cgroups_hierarchy="/sys/fs/cgroup"
>> --cgroups_limit_swap="false" --cgroups_root="mesos" --container_disk_watch_interval="15secs"
>> --containerizers="mesos" --credential="/tmp/Endpoint_SlaveEndpointTest_
>> UnauthorizedRequest_1_EdWMwp/credential" --default_role="*"
>> --disk_watch_interval="1mins" --docker="docker"
>> --docker_kill_orphans="true" --docker_registry="https://
>> registry-1.docker.io" --docker_remove_delay="6hrs"
>> --docker_socket="/var/run/docker.sock" --docker_stop_timeout="0ns"
>> --docker_store_dir="/tmp/mesos/store/docker" --docker_volume_checkpoint_
>> dir="/var/run/mesos/isolators/docker/volume" --enforce_container_disk_quota="false"
>> --executor_registration_timeout="1mins" --executor_shutdown_grace_period="5secs"
>> --fetcher_cache_dir="/tmp/Endpoint_SlaveEndpointTest_
>> UnauthorizedRequest_1_EdWMwp/fetch" --fetcher_cache_size="2GB"
>> --frameworks_home="" --gc_delay="1weeks" --gc_disk_headroom="0.1"
>> --hadoop_home="" --help="true" --hostname_lookup="true"
>> --http_authenticators="basic" --http_command_executor="false"
>> --http_credentials="/tmp/Endpoint_SlaveEndpointTest_
>> UnauthorizedRequest_1_EdWMwp/http_credentials"
>> --image_provisioner_backend="copy" --initialize_driver_logging="true"
>> --isolation="posix/cpu,posix/mem" --launcher="posix"
>> --launcher_dir="/mesos/mesos-1.1.0/_build/src" --logbufsecs="0"
>> --logging_level="INFO" --oversubscribed_resources_interval="15secs"
>> --perf_duration="10secs" --perf_interval="1mins"
>> --qos_correction_interval_min="0ns" --quiet="false" --recover="reconnect"
>> --recovery_timeout="15mins" --registration_backoff_factor="10ms"
>> --resources="cpus:2;gpus:0;mem:1024;disk:1024;ports:[31000-32000]"
>> --revocable_cpu_low_priority="true" --runtime_dir="/tmp/Endpoint_
>> SlaveEndpointTest_UnauthorizedRequest_1_EdWMwp" --sandbox_directory="/mnt/mesos/sandbox"
>> --strict="true" --switch_user="true" --systemd_enable_support="true"
>> --systemd_runtime_directory="/run/systemd/system" --version="false"
>> --work_dir="/tmp/Endpoint_SlaveEndpointTest_UnauthorizedRequest_1_DpS9lO"
>> I0930 13:00:42.348708 30370 credentials.hpp:86] Loading credential for
>> authentication from '/tmp/Endpoint_SlaveEndpointTest_
>> UnauthorizedRequest_1_EdWMwp/credential'
>> I0930 13:00:42.348909 30370 slave.cpp:346] Agent using credential for:
>> test-principal
>> I0930 13:00:42.348934 30370 credentials.hpp:37] Loading credentials for
>> authentication from '/tmp/Endpoint_SlaveEndpointTest_
>> UnauthorizedRequest_1_EdWMwp/http_credentials'
>> I0930 13:00:42.349202 30370 http.cpp:883] Using default 'basic' HTTP
>> authenticator for realm 'mesos-agent-readonly'
>> I0930 13:00:42.349331 30370 http.cpp:883] Using default 'basic' HTTP
>> authenticator for realm 'mesos-agent-readwrite'
>> I0930 13:00:42.350339 30370 slave.cpp:533] Agent resources: cpus(*):2;
>> mem(*):1024; disk(*):1024; ports(*):[31000-32000]
>> I0930 13:00:42.350441 30370 slave.cpp:541] Agent attributes: [ ]
>> I0930 13:00:42.350461 30370 slave.cpp:546] Agent hostname: e0237b91f525
>> I0930 13:00:42.351809 30375 state.cpp:57] Recovering state from
>> '/tmp/Endpoint_SlaveEndpointTest_UnauthorizedRequest_1_DpS9lO/meta'
>> I0930 13:00:42.351933 30370 process.cpp:3377] Handling HTTP event for
>> process 'slave(611)' with path: '/slave(611)/monitor/statistics.json'
>> I0930 13:00:42.352396 30372 status_update_manager.cpp:203] Recovering
>> status update manager
>> I0930 13:00:42.352527 30372 containerizer.cpp:580] Recovering containerizer
>> I0930 13:00:42.353058 30366 http.cpp:835] Authorizing principal
>> 'test-principal' to GET the '/monitor/statistics.json' endpoint
>> I0930 13:00:42.353909 30374 provisioner.cpp:253] Provisioner recovery
>> complete
>> I0930 13:00:42.354249 30374 slave.cpp:5256] Finished recovery
>> I0930 13:00:42.354846 30374 slave.cpp:5428] Querying resource estimator
>> for oversubscribable resources
>> I0930 13:00:42.355329 30367 slave.cpp:5442] Received oversubscribable
>> resources {} from the resource estimator
>> I0930 13:00:42.355476 30363 slave.cpp:787] Agent terminating
>> [ OK ] Endpoint/SlaveEndpointTest.UnauthorizedRequest/1 (22 ms)
>> [ RUN ] Endpoint/SlaveEndpointTest.UnauthorizedRequest/2
>> I0930 13:00:42.364068 30343 containerizer.cpp:226] Using isolation:
>> posix/cpu,posix/mem,filesystem/posix,network/cni
>> W0930 13:00:42.364625 30343 backend.cpp:75] Failed to create 'aufs'
>> backend: AufsBackend requires root privileges, but is running as user mesos
>> W0930 13:00:42.364781 30343 backend.cpp:75] Failed to create 'bind'
>> backend: BindBackend requires root privileges
>> I0930 13:00:42.367625 30375 slave.cpp:208] Mesos agent started on (612)@
>> 172.17.0.2:57796
>> I0930 13:00:42.367645 30375 slave.cpp:209] Flags at startup: --acls=""
>> --appc_simple_discovery_uri_prefix="http://" --appc_store_dir="/tmp/mesos/store/appc"
>> --authenticate_http_readonly="true" --authenticate_http_readwrite="true"
>> --authenticatee="crammd5" --authentication_backoff_factor="1secs"
>> --authorizer="local" --cgroups_cpu_enable_pids_and_tids_count="false"
>> --cgroups_enable_cfs="false" --cgroups_hierarchy="/sys/fs/cgroup"
>> --cgroups_limit_swap="false" --cgroups_root="mesos" --container_disk_watch_interval="15secs"
>> --containerizers="mesos" --credential="/tmp/Endpoint_SlaveEndpointTest_
>> UnauthorizedRequest_2_eGgSpO/credential" --default_role="*"
>> --disk_watch_interval="1mins" --docker="docker"
>> --docker_kill_orphans="true" --docker_registry="https://
>> registry-1.docker.io" --docker_remove_delay="6hrs"
>> --docker_socket="/var/run/docker.sock" --docker_stop_timeout="0ns"
>> --docker_store_dir="/tmp/mesos/store/docker" --docker_volume_checkpoint_
>> dir="/var/run/mesos/isolators/docker/volume" --enforce_container_disk_quota="false"
>> --executor_registration_timeout="1mins" --executor_shutdown_grace_period="5secs"
>> --fetcher_cache_dir="/tmp/Endpoint_SlaveEndpointTest_
>> UnauthorizedRequest_2_eGgSpO/fetch" --fetcher_cache_size="2GB"
>> --frameworks_home="" --gc_delay="1weeks" --gc_disk_headroom="0.1"
>> --hadoop_home="" --help="true" --hostname_lookup="true"
>> --http_authenticators="basic" --http_command_executor="false"
>> --http_credentials="/tmp/Endpoint_SlaveEndpointTest_
>> UnauthorizedRequest_2_eGgSpO/http_credentials"
>> --image_provisioner_backend="copy" --initialize_driver_logging="true"
>> --isolation="posix/cpu,posix/mem" --launcher="posix"
>> --launcher_dir="/mesos/mesos-1.1.0/_build/src" --logbufsecs="0"
>> --logging_level="INFO" --oversubscribed_resources_interval="15secs"
>> --perf_duration="10secs" --perf_interval="1mins"
>> --qos_correction_interval_min="0ns" --quiet="false" --recover="reconnect"
>> --recovery_timeout="15mins" --registration_backoff_factor="10ms"
>> --resources="cpus:2;gpus:0;mem:1024;disk:1024;ports:[31000-32000]"
>> --revocable_cpu_low_priority="true" --runtime_dir="/tmp/Endpoint_
>> SlaveEndpointTest_UnauthorizedRequest_2_eGgSpO" --sandbox_directory="/mnt/mesos/sandbox"
>> --strict="true" --switch_user="true" --systemd_enable_support="true"
>> --systemd_runtime_directory="/run/systemd/system" --version="false"
>> --work_dir="/tmp/Endpoint_SlaveEndpointTest_UnauthorizedRequest_2_lccJbd"
>> I0930 13:00:42.368129 30375 credentials.hpp:86] Loading credential for
>> authentication from '/tmp/Endpoint_SlaveEndpointTest_
>> UnauthorizedRequest_2_eGgSpO/credential'
>> I0930 13:00:42.368377 30375 slave.cpp:346] Agent using credential for:
>> test-principal
>> I0930 13:00:42.368402 30375 credentials.hpp:37] Loading credentials for
>> authentication from '/tmp/Endpoint_SlaveEndpointTest_
>> UnauthorizedRequest_2_eGgSpO/http_credentials'
>> I0930 13:00:42.368713 30375 http.cpp:883] Using default 'basic' HTTP
>> authenticator for realm 'mesos-agent-readonly'
>> I0930 13:00:42.368863 30375 http.cpp:883] Using default 'basic' HTTP
>> authenticator for realm 'mesos-agent-readwrite'
>> I0930 13:00:42.369998 30375 slave.cpp:533] Agent resources: cpus(*):2;
>> mem(*):1024; disk(*):1024; ports(*):[31000-32000]
>> I0930 13:00:42.370071 30375 slave.cpp:541] Agent attributes: [ ]
>> I0930 13:00:42.370085 30375 slave.cpp:546] Agent hostname: e0237b91f525
>> I0930 13:00:42.371449 30375 process.cpp:3377] Handling HTTP event for
>> process 'slave(612)' with path: '/slave(612)/containers'
>> I0930 13:00:42.371486 30376 state.cpp:57] Recovering state from
>> '/tmp/Endpoint_SlaveEndpointTest_UnauthorizedRequest_2_lccJbd/meta'
>> I0930 13:00:42.372289 30372 status_update_manager.cpp:203] Recovering
>> status update manager
>> I0930 13:00:42.372388 30364 http.cpp:835] Authorizing principal
>> 'test-principal' to GET the '/containers' endpoint
>> I0930 13:00:42.372761 30376 containerizer.cpp:580] Recovering containerizer
>> I0930 13:00:42.374456 30365 provisioner.cpp:253] Provisioner recovery
>> complete
>> I0930 13:00:42.374853 30367 slave.cpp:787] Agent terminating
>> [ OK ] Endpoint/SlaveEndpointTest.UnauthorizedRequest/2 (19 ms)
>> [ RUN ] Endpoint/SlaveEndpointTest.NoAuthorizer/0
>> I0930 13:00:42.383117 30343 containerizer.cpp:226] Using isolation:
>> posix/cpu,posix/mem,filesystem/posix,network/cni
>> W0930 13:00:42.383666 30343 backend.cpp:75] Failed to create 'aufs'
>> backend: AufsBackend requires root privileges, but is running as user mesos
>> W0930 13:00:42.383810 30343 backend.cpp:75] Failed to create 'bind'
>> backend: BindBackend requires root privileges
>> I0930 13:00:42.385015 30343 cluster.cpp:435] Creating default 'local'
>> authorizer
>> I0930 13:00:42.386487 30364 slave.cpp:208] Mesos agent started on (613)@
>> 172.17.0.2:57796
>> I0930 13:00:42.386535 30364 slave.cpp:209] Flags at startup: --acls=""
>> --appc_simple_discovery_uri_prefix="http://" --appc_store_dir="/tmp/mesos/store/appc"
>> --authenticate_http_readonly="true" --authenticate_http_readwrite="true"
>> --authenticatee="crammd5" --authentication_backoff_factor="1secs"
>> --authorizer="local" --cgroups_cpu_enable_pids_and_tids_count="false"
>> --cgroups_enable_cfs="false" --cgroups_hierarchy="/sys/fs/cgroup"
>> --cgroups_limit_swap="false" --cgroups_root="mesos" --container_disk_watch_interval="15secs"
>> --containerizers="mesos" --credential="/tmp/Endpoint_SlaveEndpointTest_
>> NoAuthorizer_0_oPTefC/credential" --default_role="*"
>> --disk_watch_interval="1mins" --docker="docker"
>> --docker_kill_orphans="true" --docker_registry="https://
>> registry-1.docker.io" --docker_remove_delay="6hrs"
>> --docker_socket="/var/run/docker.sock" --docker_stop_timeout="0ns"
>> --docker_store_dir="/tmp/mesos/store/docker" --docker_volume_checkpoint_
>> dir="/var/run/mesos/isolators/docker/volume" --enforce_container_disk_quota="false"
>> --executor_registration_timeout="1mins" --executor_shutdown_grace_period="5secs"
>> --fetcher_cache_dir="/tmp/Endpoint_SlaveEndpointTest_NoAuthorizer_0_oPTefC/fetch"
>> --fetcher_cache_size="2GB" --frameworks_home="" --gc_delay="1weeks"
>> --gc_disk_headroom="0.1" --hadoop_home="" --help="false"
>> --hostname_lookup="true" --http_authenticators="basic"
>> --http_command_executor="false" --http_credentials="/tmp/
>> Endpoint_SlaveEndpointTest_NoAuthorizer_0_oPTefC/http_credentials"
>> --image_provisioner_backend="copy" --initialize_driver_logging="true"
>> --isolation="posix/cpu,posix/mem" --launcher="posix"
>> --launcher_dir="/mesos/mesos-1.1.0/_build/src" --logbufsecs="0"
>> --logging_level="INFO" --oversubscribed_resources_interval="15secs"
>> --perf_duration="10secs" --perf_interval="1mins"
>> --qos_correction_interval_min="0ns" --quiet="false" --recover="reconnect"
>> --recovery_timeout="15mins" --registration_backoff_factor="10ms"
>> --resources="cpus:2;gpus:0;mem:1024;disk:1024;ports:[31000-32000]"
>> --revocable_cpu_low_priority="true" --runtime_dir="/tmp/Endpoint_
>> SlaveEndpointTest_NoAuthorizer_0_oPTefC" --sandbox_directory="/mnt/mesos/sandbox"
>> --strict="true" --switch_user="true" --systemd_enable_support="true"
>> --systemd_runtime_directory="/run/systemd/system" --version="false"
>> --work_dir="/tmp/Endpoint_SlaveEndpointTest_NoAuthorizer_0_onV1X0"
>> I0930 13:00:42.387039 30364 credentials.hpp:86] Loading credential for
>> authentication from '/tmp/Endpoint_SlaveEndpointTest_
>> NoAuthorizer_0_oPTefC/credential'
>> I0930 13:00:42.387240 30364 slave.cpp:346] Agent using credential for:
>> test-principal
>> I0930 13:00:42.387265 30364 credentials.hpp:37] Loading credentials for
>> authentication from '/tmp/Endpoint_SlaveEndpointTest_
>> NoAuthorizer_0_oPTefC/http_credentials'
>> I0930 13:00:42.387531 30364 http.cpp:883] Using default 'basic' HTTP
>> authenticator for realm 'mesos-agent-readonly'
>> I0930 13:00:42.387678 30364 http.cpp:883] Using default 'basic' HTTP
>> authenticator for realm 'mesos-agent-readwrite'
>> I0930 13:00:42.388875 30364 slave.cpp:533] Agent resources: cpus(*):2;
>> mem(*):1024; disk(*):1024; ports(*):[31000-32000]
>> I0930 13:00:42.388950 30364 slave.cpp:541] Agent attributes: [ ]
>> I0930 13:00:42.388968 30364 slave.cpp:546] Agent hostname: e0237b91f525
>> I0930 13:00:42.390703 30364 process.cpp:3377] Handling HTTP event for
>> process 'slave(613)' with path: '/slave(613)/monitor/statistics'
>> I0930 13:00:42.391193 30374 state.cpp:57] Recovering state from
>> '/tmp/Endpoint_SlaveEndpointTest_NoAuthorizer_0_onV1X0/meta'
>> I0930 13:00:42.392503 30364 status_update_manager.cpp:203] Recovering
>> status update manager
>> I0930 13:00:42.392779 30374 containerizer.cpp:580] Recovering containerizer
>> I0930 13:00:42.394923 30374 provisioner.cpp:253] Provisioner recovery
>> complete
>> I0930 13:00:42.395366 30376 slave.cpp:5256] Finished recovery
>> I0930 13:00:42.396067 30376 slave.cpp:5428] Querying resource estimator
>> for oversubscribable resources
>> I0930 13:00:42.396432 30376 slave.cpp:5442] Received oversubscribable
>> resources {} from the resource estimator
>> I0930 13:00:42.396692 30375 http.cpp:835] Authorizing principal
>> 'test-principal' to GET the '/monitor/statistics' endpoint
>> I0930 13:00:42.401904 30375 slave.cpp:787] Agent terminating
>> [ OK ] Endpoint/SlaveEndpointTest.NoAuthorizer/0 (27 ms)
>> [ RUN ] Endpoint/SlaveEndpointTest.NoAuthorizer/1
>> I0930 13:00:42.411063 30343 containerizer.cpp:226] Using isolation:
>> posix/cpu,posix/mem,filesystem/posix,network/cni
>> W0930 13:00:42.411712 30343 backend.cpp:75] Failed to create 'aufs'
>> backend: AufsBackend requires root privileges, but is running as user mesos
>> W0930 13:00:42.411895 30343 backend.cpp:75] Failed to create 'bind'
>> backend: BindBackend requires root privileges
>> I0930 13:00:42.413252 30343 cluster.cpp:435] Creating default 'local'
>> authorizer
>> I0930 13:00:42.415901 30371 slave.cpp:208] Mesos agent started on (614)@
>> 172.17.0.2:57796
>> I0930 13:00:42.415931 30371 slave.cpp:209] Flags at startup: --acls=""
>> --appc_simple_discovery_uri_prefix="http://" --appc_store_dir="/tmp/mesos/store/appc"
>> --authenticate_http_readonly="true" --authenticate_http_readwrite="true"
>> --authenticatee="crammd5" --authentication_backoff_factor="1secs"
>> --authorizer="local" --cgroups_cpu_enable_pids_and_tids_count="false"
>> --cgroups_enable_cfs="false" --cgroups_hierarchy="/sys/fs/cgroup"
>> --cgroups_limit_swap="false" --cgroups_root="mesos" --container_disk_watch_interval="15secs"
>> --containerizers="mesos" --credential="/tmp/Endpoint_SlaveEndpointTest_
>> NoAuthorizer_1_rkUGB1/credential" --default_role="*"
>> --disk_watch_interval="1mins" --docker="docker"
>> --docker_kill_orphans="true" --docker_registry="https://
>> registry-1.docker.io" --docker_remove_delay="6hrs"
>> --docker_socket="/var/run/docker.sock" --docker_stop_timeout="0ns"
>> --docker_store_dir="/tmp/mesos/store/docker" --docker_volume_checkpoint_
>> dir="/var/run/mesos/isolators/docker/volume" --enforce_container_disk_quota="false"
>> --executor_registration_timeout="1mins" --executor_shutdown_grace_period="5secs"
>> --fetcher_cache_dir="/tmp/Endpoint_SlaveEndpointTest_NoAuthorizer_1_rkUGB1/fetch"
>> --fetcher_cache_size="2GB" --frameworks_home="" --gc_delay="1weeks"
>> --gc_disk_headroom="0.1" --hadoop_home="" --help="false"
>> --hostname_lookup="true" --http_authenticators="basic"
>> --http_command_executor="false" --http_credentials="/tmp/
>> Endpoint_SlaveEndpointTest_NoAuthorizer_1_rkUGB1/http_credentials"
>> --image_provisioner_backend="copy" --initialize_driver_logging="true"
>> --isolation="posix/cpu,posix/mem" --launcher="posix"
>> --launcher_dir="/mesos/mesos-1.1.0/_build/src" --logbufsecs="0"
>> --logging_level="INFO" --oversubscribed_resources_interval="15secs"
>> --perf_duration="10secs" --perf_interval="1mins"
>> --qos_correction_interval_min="0ns" --quiet="false" --recover="reconnect"
>> --recovery_timeout="15mins" --registration_backoff_factor="10ms"
>> --resources="cpus:2;gpus:0;mem:1024;disk:1024;ports:[31000-32000]"
>> --revocable_cpu_low_priority="true" --runtime_dir="/tmp/Endpoint_
>> SlaveEndpointTest_NoAuthorizer_1_rkUGB1" --sandbox_directory="/mnt/mesos/sandbox"
>> --strict="true" --switch_user="true" --systemd_enable_support="true"
>> --systemd_runtime_directory="/run/systemd/system" --version="false"
>> --work_dir="/tmp/Endpoint_SlaveEndpointTest_NoAuthorizer_1_3ULYfq"
>> I0930 13:00:42.416373 30371 credentials.hpp:86] Loading credential for
>> authentication from '/tmp/Endpoint_SlaveEndpointTest_
>> NoAuthorizer_1_rkUGB1/credential'
>> I0930 13:00:42.416599 30371 slave.cpp:346] Agent using credential for:
>> test-principal
>> I0930 13:00:42.416622 30371 credentials.hpp:37] Loading credentials for
>> authentication from '/tmp/Endpoint_SlaveEndpointTest_
>> NoAuthorizer_1_rkUGB1/http_credentials'
>> I0930 13:00:42.416906 30371 http.cpp:883] Using default 'basic' HTTP
>> authenticator for realm 'mesos-agent-readonly'
>> I0930 13:00:42.417068 30371 http.cpp:883] Using default 'basic' HTTP
>> authenticator for realm 'mesos-agent-readwrite'
>> I0930 13:00:42.418313 30371 slave.cpp:533] Agent resources: cpus(*):2;
>> mem(*):1024; disk(*):1024; ports(*):[31000-32000]
>> I0930 13:00:42.418403 30371 slave.cpp:541] Agent attributes: [ ]
>> I0930 13:00:42.418426 30371 slave.cpp:546] Agent hostname: e0237b91f525
>> I0930 13:00:42.419908 30377 state.cpp:57] Recovering state from
>> '/tmp/Endpoint_SlaveEndpointTest_NoAuthorizer_1_3ULYfq/meta'
>> I0930 13:00:42.419991 30371 process.cpp:3377] Handling HTTP event for
>> process 'slave(614)' with path: '/slave(614)/monitor/statistics.json'
>> I0930 13:00:42.420907 30377 status_update_manager.cpp:203] Recovering
>> status update manager
>> I0930 13:00:42.421226 30368 containerizer.cpp:580] Recovering containerizer
>> I0930 13:00:42.422302 30377 http.cpp:835] Authorizing principal
>> 'test-principal' to GET the '/monitor/statistics.json' endpoint
>> I0930 13:00:42.422785 30366 provisioner.cpp:253] Provisioner recovery
>> complete
>> I0930 13:00:42.423782 30377 slave.cpp:5256] Finished recovery
>> I0930 13:00:42.424300 30377 slave.cpp:5428] Querying resource estimator
>> for oversubscribable resources
>> I0930 13:00:42.424898 30363 slave.cpp:5442] Received oversubscribable
>> resources {} from the resource estimator
>> I0930 13:00:42.426108 30365 slave.cpp:787] Agent terminating
>> [ OK ] Endpoint/SlaveEndpointTest.NoAuthorizer/1 (25 ms)
>> [ RUN ] Endpoint/SlaveEndpointTest.NoAuthorizer/2
>> I0930 13:00:42.443666 30343 containerizer.cpp:226] Using isolation:
>> posix/cpu,posix/mem,filesystem/posix,network/cni
>> W0930 13:00:42.444931 30343 backend.cpp:75] Failed to create 'aufs'
>> backend: AufsBackend requires root privileges, but is running as user mesos
>> W0930 13:00:42.445384 30343 backend.cpp:75] Failed to create 'bind'
>> backend: BindBackend requires root privileges
>> I0930 13:00:42.447580 30343 cluster.cpp:435] Creating default 'local'
>> authorizer
>> I0930 13:00:42.451195 30376 slave.cpp:208] Mesos agent started on (615)@
>> 172.17.0.2:57796
>> I0930 13:00:42.451225 30376 slave.cpp:209] Flags at startup: --acls=""
>> --appc_simple_discovery_uri_prefix="http://" --appc_store_dir="/tmp/mesos/store/appc"
>> --authenticate_http_readonly="true" --authenticate_http_readwrite="true"
>> --authenticatee="crammd5" --authentication_backoff_factor="1secs"
>> --authorizer="local" --cgroups_cpu_enable_pids_and_tids_count="false"
>> --cgroups_enable_cfs="false" --cgroups_hierarchy="/sys/fs/cgroup"
>> --cgroups_limit_swap="false" --cgroups_root="mesos" --container_disk_watch_interval="15secs"
>> --containerizers="mesos" --credential="/tmp/Endpoint_SlaveEndpointTest_
>> NoAuthorizer_2_sAZugr/credential" --default_role="*"
>> --disk_watch_interval="1mins" --docker="docker"
>> --docker_kill_orphans="true" --docker_registry="https://
>> registry-1.docker.io" --docker_remove_delay="6hrs"
>> --docker_socket="/var/run/docker.sock" --docker_stop_timeout="0ns"
>> --docker_store_dir="/tmp/mesos/store/docker" --docker_volume_checkpoint_
>> dir="/var/run/mesos/isolators/docker/volume" --enforce_container_disk_quota="false"
>> --executor_registration_timeout="1mins" --executor_shutdown_grace_period="5secs"
>> --fetcher_cache_dir="/tmp/Endpoint_SlaveEndpointTest_NoAuthorizer_2_sAZugr/fetch"
>> --fetcher_cache_size="2GB" --frameworks_home="" --gc_delay="1weeks"
>> --gc_disk_headroom="0.1" --hadoop_home="" --help="false"
>> --hostname_lookup="true" --http_authenticators="basic"
>> --http_command_executor="false" --http_credentials="/tmp/
>> Endpoint_SlaveEndpointTest_NoAuthorizer_2_sAZugr/http_credentials"
>> --image_provisioner_backend="copy" --initialize_driver_logging="true"
>> --isolation="posix/cpu,posix/mem" --launcher="posix"
>> --launcher_dir="/mesos/mesos-1.1.0/_build/src" --logbufsecs="0"
>> --logging_level="INFO" --oversubscribed_resources_interval="15secs"
>> --perf_duration="10secs" --perf_interval="1mins"
>> --qos_correction_interval_min="0ns" --quiet="false" --recover="reconnect"
>> --recovery_timeout="15mins" --registration_backoff_factor="10ms"
>> --resources="cpus:2;gpus:0;mem:1024;disk:1024;ports:[31000-32000]"
>> --revocable_cpu_low_priority="true" --runtime_dir="/tmp/Endpoint_
>> SlaveEndpointTest_NoAuthorizer_2_sAZugr" --sandbox_directory="/mnt/mesos/sandbox"
>> --strict="true" --switch_user="true" --systemd_enable_support="true"
>> --systemd_runtime_directory="/run/systemd/system" --version="false"
>> --work_dir="/tmp/Endpoint_SlaveEndpointTest_NoAuthorizer_2_F6aYPP"
>> I0930 13:00:42.451854 30376 credentials.hpp:86] Loading credential for
>> authentication from '/tmp/Endpoint_SlaveEndpointTest_
>> NoAuthorizer_2_sAZugr/credential'
>> I0930 13:00:42.452080 30376 slave.cpp:346] Agent using credential for:
>> test-principal
>> I0930 13:00:42.452107 30376 credentials.hpp:37] Loading credentials for
>> authentication from '/tmp/Endpoint_SlaveEndpointTest_
>> NoAuthorizer_2_sAZugr/http_credentials'
>> I0930 13:00:42.452402 30376 http.cpp:883] Using default 'basic' HTTP
>> authenticator for realm 'mesos-agent-readonly'
>> I0930 13:00:42.452576 30376 http.cpp:883] Using default 'basic' HTTP
>> authenticator for realm 'mesos-agent-readwrite'
>> I0930 13:00:42.454422 30376 slave.cpp:533] Agent resources: cpus(*):2;
>> mem(*):1024; disk(*):1024; ports(*):[31000-32000]
>> I0930 13:00:42.454500 30376 slave.cpp:541] Agent attributes: [ ]
>> I0930 13:00:42.454521 30376 slave.cpp:546] Agent hostname: e0237b91f525
>> I0930 13:00:42.455899 30363 state.cpp:57] Recovering state from
>> '/tmp/Endpoint_SlaveEndpointTest_NoAuthorizer_2_F6aYPP/meta'
>> I0930 13:00:42.455987 30376 process.cpp:3377] Handling HTTP event for
>> process 'slave(615)' with path: '/slave(615)/containers'
>> I0930 13:00:42.456615 30373 status_update_manager.cpp:203] Recovering
>> status update manager
>> I0930 13:00:42.456774 30367 containerizer.cpp:580] Recovering containerizer
>> I0930 13:00:42.457118 30366 http.cpp:835] Authorizing principal
>> 'test-principal' to GET the '/containers' endpoint
>> I0930 13:00:42.458556 30371 provisioner.cpp:253] Provisioner recovery
>> complete
>> I0930 13:00:42.458865 30364 slave.cpp:5256] Finished recovery
>> I0930 13:00:42.459370 30364 slave.cpp:5428] Querying resource estimator
>> for oversubscribable resources
>> I0930 13:00:42.459697 30366 slave.cpp:5442] Received oversubscribable
>> resources {} from the resource estimator
>> I0930 13:00:42.461649 30365 slave.cpp:787] Agent terminating
>> [ OK ] Endpoint/SlaveEndpointTest.NoAuthorizer/2 (34 ms)
>> [----------] 9 tests from Endpoint/SlaveEndpointTest (216 ms total)
>>
>> [----------] Global test environment tear-down
>> [==========] 1339 tests from 152 test cases ran. (432726 ms total)
>> [ PASSED ] 1338 tests.
>> [ FAILED ] 1 test, listed below:
>> [ FAILED ] RegistrarTest.MarkUnreachable
>>
>> 1 FAILED TEST
>> YOU HAVE 6 DISABLED TESTS
>>
>> make[4]: *** [check-local] Error 1
>> make[4]: Leaving directory `/mesos/mesos-1.1.0/_build/src'
>> make[3]: *** [check-am] Error 2
>> make[3]: Leaving directory `/mesos/mesos-1.1.0/_build/src'
>> make[2]: *** [check] Error 2
>> make[2]: Leaving directory `/mesos/mesos-1.1.0/_build/src'
>> make[1]: *** [check-recursive] Error 1
>> make[1]: Leaving directory `/mesos/mesos-1.1.0/_build'
>> make: *** [distcheck] Error 1
>> + docker rmi mesos-1475238050-2884
>> Untagged: mesos-1475238050-2884:latest
>> Deleted: sha256:546eac04cd4860cc49e8ce7cd95e9c
>> 7546588186ce1a3959511f7fd8df79930d
>> Deleted: sha256:f10f3e2ae0620f62afe0b8735c2b51
>> 37a3b7ee3bca83155292410bdb856f5fbd
>> Deleted: sha256:627a07cb7287a858e8e567122d0288
>> 0fd9ff93dd04987e298a639e2c9d387482
>> Deleted: sha256:17d68f946b001a90f2fbbcd69c9350
>> ab1078a2d53f053d35652a363a26845174
>> Deleted: sha256:5173f5bd8a0eea648160d79a103c31
>> 93896082ca23948faa5edbf9587c96c42c
>> Deleted: sha256:3c9d3303c5d066168af8ed02bd360f
>> 9bb2a3c62bfa1f5ac5548fd27814a1c679
>> Deleted: sha256:b5159d4e5cd770cf9f0d8c30cbd972
>> f6ce6062332107321b57cbe9b740cd533f
>> Deleted: sha256:00d32e48c5491b6110b423d3bf2a0f
>> 1b67dcc585b6505a2ebe9481069fd4582b
>> Deleted: sha256:52ec461f241b57a0610e171e95e51f
>> 77ee25111255d5c3368708d8a73d34b35c
>> Deleted: sha256:ec20247b092adb948baabd24f4dfff
>> 07f223a5f455bedadcce6eede7b87f5f98
>> Deleted: sha256:78cf787a4e31c7c5a559ff30291536
>> b3df23f1fd948d37416de311ea50fda992
>> Deleted: sha256:83d6bec6f0a5ada73ab8404fd20748
>> 2d35e0082099c37048cde85e12e5ad9e2d
>> Deleted: sha256:b58999ccd09de5a01b9cac8ad8667f
>> 9744cbd5c6e6da283a027f27a7717273a9
>> Deleted: sha256:f7ce596e52ecbaef4a6dd45f576627
>> 8a9fa292b75e3b30be46332944c591e488
>> Deleted: sha256:dbd5b950d0e020217f6407e28924fe
>> 094862fa76b3dc6acf76a3d314d1c28115
>> Deleted: sha256:aee4359376172c1de1630314ff77cc
>> c205e1e922976295d3fe24a8da6afc6703
>> Deleted: sha256:0fa61c1d4c7eb6727151fc4421cf26
>> 10760bfcd1cf4327ca921501fa25daba22
>> Deleted: sha256:8d1b624f8727f4f6c11eaa2f2a77c6
>> 88be35e46c9b21d2036a3742f9d20aee6e
>> Deleted: sha256:ae26224238e7016e20ffe2ffa99539
>> 144e490e1c4e0e38d949537742da56535b
>> Deleted: sha256:1a93855d7b5fad08f105aabd569875
>> a33352b1762e4f42a44323c70a54f56b33
>> Deleted: sha256:0f0941fd5d51152e493c3812fbd1e6
>> efd8bde42bb660cab11754484c61103e2e
>> Deleted: sha256:410d1194f642eb5eab89b587b06715
>> 9198456380700684d168cc817207f2562d
>> Deleted: sha256:c6500a17ca4719e99d98459e4ed522
>> 7c37c564d07bb111323bb8d8510ba7fb68
>> Deleted: sha256:5035135d832eade93b9f726e756d85
>> 8fafaaba7f4bfb547bc9e1e44deac617e0
>> Build step 'Execute shell' marked build as failure
>>
Re: Build failed in Jenkins: Mesos » autotools,gcc,--verbose --enable-libevent --enable-ssl,GLOG_v=1 MESOS_VERBOSE=1,ubuntu:14.04,(docker||Hadoop)&&(!ubuntu-us1)&&(!ubuntu-6) #2719
Posted by Vinod Kone <vi...@apache.org>.
neil, can you take a look?
On Fri, Sep 30, 2016 at 6:02 AM, Apache Jenkins Server <
jenkins@builds.apache.org> wrote:
> See <https://builds.apache.org/job/Mesos/BUILDTOOL=autotools,
> COMPILER=gcc,CONFIGURATION=--verbose%20--enable-libevent%
> 20--enable-ssl,ENVIRONMENT=GLOG_v=1%20MESOS_VERBOSE=1,OS=
> ubuntu%3A14.04,label_exp=(docker%7C%7CHadoop)&&(!ubuntu-
> us1)&&(!ubuntu-6)/2719/changes>
>
> Changes:
>
> [alexr] Fixed help display for mesos-containerizer subcommands.
>
> ------------------------------------------
> [...truncated 210601 lines...]
> I0930 13:00:42.266724 30372 slave.cpp:787] Agent terminating
> [ OK ] Endpoint/SlaveEndpointTest.AuthorizedRequest/0 (19 ms)
> [ RUN ] Endpoint/SlaveEndpointTest.AuthorizedRequest/1
> I0930 13:00:42.274679 30343 containerizer.cpp:226] Using isolation:
> posix/cpu,posix/mem,filesystem/posix,network/cni
> W0930 13:00:42.275254 30343 backend.cpp:75] Failed to create 'aufs'
> backend: AufsBackend requires root privileges, but is running as user mesos
> W0930 13:00:42.275403 30343 backend.cpp:75] Failed to create 'bind'
> backend: BindBackend requires root privileges
> I0930 13:00:42.278074 30365 slave.cpp:208] Mesos agent started on (608)@
> 172.17.0.2:57796
> I0930 13:00:42.278100 30365 slave.cpp:209] Flags at startup: --acls=""
> --appc_simple_discovery_uri_prefix="http://" --appc_store_dir="/tmp/mesos/store/appc"
> --authenticate_http_readonly="true" --authenticate_http_readwrite="true"
> --authenticatee="crammd5" --authentication_backoff_factor="1secs"
> --authorizer="local" --cgroups_cpu_enable_pids_and_tids_count="false"
> --cgroups_enable_cfs="false" --cgroups_hierarchy="/sys/fs/cgroup"
> --cgroups_limit_swap="false" --cgroups_root="mesos" --container_disk_watch_interval="15secs"
> --containerizers="mesos" --credential="/tmp/Endpoint_SlaveEndpointTest_
> AuthorizedRequest_1_CcOXge/credential" --default_role="*"
> --disk_watch_interval="1mins" --docker="docker"
> --docker_kill_orphans="true" --docker_registry="https://
> registry-1.docker.io" --docker_remove_delay="6hrs"
> --docker_socket="/var/run/docker.sock" --docker_stop_timeout="0ns"
> --docker_store_dir="/tmp/mesos/store/docker" --docker_volume_checkpoint_
> dir="/var/run/mesos/isolators/docker/volume" --enforce_container_disk_quota="false"
> --executor_registration_timeout="1mins" --executor_shutdown_grace_period="5secs"
> --fetcher_cache_dir="/tmp/Endpoint_SlaveEndpointTest_
> AuthorizedRequest_1_CcOXge/fetch" --fetcher_cache_size="2GB"
> --frameworks_home="" --gc_delay="1weeks" --gc_disk_headroom="0.1"
> --hadoop_home="" --help="true" --hostname_lookup="true"
> --http_authenticators="basic" --http_command_executor="false"
> --http_credentials="/tmp/Endpoint_SlaveEndpointTest_
> AuthorizedRequest_1_CcOXge/http_credentials" --image_provisioner_backend="copy"
> --initialize_driver_logging="true" --isolation="posix/cpu,posix/mem"
> --launcher="posix" --launcher_dir="/mesos/mesos-1.1.0/_build/src"
> --logbufsecs="0" --logging_level="INFO" --oversubscribed_resources_interval="15secs"
> --perf_duration="10secs" --perf_interval="1mins"
> --qos_correction_interval_min="0ns" --quiet="false" --recover="reconnect"
> --recovery_timeout="15mins" --registration_backoff_factor="10ms"
> --resources="cpus:2;gpus:0;mem:1024;disk:1024;ports:[31000-32000]"
> --revocable_cpu_low_priority="true" --runtime_dir="/tmp/Endpoint_
> SlaveEndpointTest_AuthorizedRequest_1_CcOXge" --sandbox_directory="/mnt/mesos/sandbox"
> --strict="true" --switch_user="true" --systemd_enable_support="true"
> --systemd_runtime_directory="/run/systemd/system" --version="false"
> --work_dir="/tmp/Endpoint_SlaveEndpointTest_AuthorizedRequest_1_HQ1khD"
> I0930 13:00:42.278834 30365 credentials.hpp:86] Loading credential for
> authentication from '/tmp/Endpoint_SlaveEndpointTest_
> AuthorizedRequest_1_CcOXge/credential'
> I0930 13:00:42.279134 30365 slave.cpp:346] Agent using credential for:
> test-principal
> I0930 13:00:42.279158 30365 credentials.hpp:37] Loading credentials for
> authentication from '/tmp/Endpoint_SlaveEndpointTest_
> AuthorizedRequest_1_CcOXge/http_credentials'
> I0930 13:00:42.279412 30365 http.cpp:883] Using default 'basic' HTTP
> authenticator for realm 'mesos-agent-readonly'
> I0930 13:00:42.279566 30365 http.cpp:883] Using default 'basic' HTTP
> authenticator for realm 'mesos-agent-readwrite'
> I0930 13:00:42.280490 30365 slave.cpp:533] Agent resources: cpus(*):2;
> mem(*):1024; disk(*):1024; ports(*):[31000-32000]
> I0930 13:00:42.280565 30365 slave.cpp:541] Agent attributes: [ ]
> I0930 13:00:42.280633 30365 slave.cpp:546] Agent hostname: e0237b91f525
> I0930 13:00:42.282037 30375 state.cpp:57] Recovering state from
> '/tmp/Endpoint_SlaveEndpointTest_AuthorizedRequest_1_HQ1khD/meta'
> I0930 13:00:42.282135 30365 process.cpp:3377] Handling HTTP event for
> process 'slave(608)' with path: '/slave(608)/monitor/statistics.json'
> I0930 13:00:42.282678 30365 status_update_manager.cpp:203] Recovering
> status update manager
> I0930 13:00:42.282846 30377 containerizer.cpp:580] Recovering containerizer
> I0930 13:00:42.283315 30362 http.cpp:835] Authorizing principal
> 'test-principal' to GET the '/monitor/statistics.json' endpoint
> I0930 13:00:42.285405 30373 provisioner.cpp:253] Provisioner recovery
> complete
> I0930 13:00:42.285765 30362 slave.cpp:5256] Finished recovery
> I0930 13:00:42.286366 30362 slave.cpp:5428] Querying resource estimator
> for oversubscribable resources
> I0930 13:00:42.286640 30363 slave.cpp:5442] Received oversubscribable
> resources {} from the resource estimator
> I0930 13:00:42.286715 30363 slave.cpp:787] Agent terminating
> [ OK ] Endpoint/SlaveEndpointTest.AuthorizedRequest/1 (19 ms)
> [ RUN ] Endpoint/SlaveEndpointTest.AuthorizedRequest/2
> I0930 13:00:42.294837 30343 containerizer.cpp:226] Using isolation:
> posix/cpu,posix/mem,filesystem/posix,network/cni
> W0930 13:00:42.295420 30343 backend.cpp:75] Failed to create 'aufs'
> backend: AufsBackend requires root privileges, but is running as user mesos
> W0930 13:00:42.295577 30343 backend.cpp:75] Failed to create 'bind'
> backend: BindBackend requires root privileges
> I0930 13:00:42.298198 30364 slave.cpp:208] Mesos agent started on (609)@
> 172.17.0.2:57796
> I0930 13:00:42.298224 30364 slave.cpp:209] Flags at startup: --acls=""
> --appc_simple_discovery_uri_prefix="http://" --appc_store_dir="/tmp/mesos/store/appc"
> --authenticate_http_readonly="true" --authenticate_http_readwrite="true"
> --authenticatee="crammd5" --authentication_backoff_factor="1secs"
> --authorizer="local" --cgroups_cpu_enable_pids_and_tids_count="false"
> --cgroups_enable_cfs="false" --cgroups_hierarchy="/sys/fs/cgroup"
> --cgroups_limit_swap="false" --cgroups_root="mesos" --container_disk_watch_interval="15secs"
> --containerizers="mesos" --credential="/tmp/Endpoint_SlaveEndpointTest_
> AuthorizedRequest_2_XhGarC/credential" --default_role="*"
> --disk_watch_interval="1mins" --docker="docker"
> --docker_kill_orphans="true" --docker_registry="https://
> registry-1.docker.io" --docker_remove_delay="6hrs"
> --docker_socket="/var/run/docker.sock" --docker_stop_timeout="0ns"
> --docker_store_dir="/tmp/mesos/store/docker" --docker_volume_checkpoint_
> dir="/var/run/mesos/isolators/docker/volume" --enforce_container_disk_quota="false"
> --executor_registration_timeout="1mins" --executor_shutdown_grace_period="5secs"
> --fetcher_cache_dir="/tmp/Endpoint_SlaveEndpointTest_
> AuthorizedRequest_2_XhGarC/fetch" --fetcher_cache_size="2GB"
> --frameworks_home="" --gc_delay="1weeks" --gc_disk_headroom="0.1"
> --hadoop_home="" --help="true" --hostname_lookup="true"
> --http_authenticators="basic" --http_command_executor="false"
> --http_credentials="/tmp/Endpoint_SlaveEndpointTest_
> AuthorizedRequest_2_XhGarC/http_credentials" --image_provisioner_backend="copy"
> --initialize_driver_logging="true" --isolation="posix/cpu,posix/mem"
> --launcher="posix" --launcher_dir="/mesos/mesos-1.1.0/_build/src"
> --logbufsecs="0" --logging_level="INFO" --oversubscribed_resources_interval="15secs"
> --perf_duration="10secs" --perf_interval="1mins"
> --qos_correction_interval_min="0ns" --quiet="false" --recover="reconnect"
> --recovery_timeout="15mins" --registration_backoff_factor="10ms"
> --resources="cpus:2;gpus:0;mem:1024;disk:1024;ports:[31000-32000]"
> --revocable_cpu_low_priority="true" --runtime_dir="/tmp/Endpoint_
> SlaveEndpointTest_AuthorizedRequest_2_XhGarC" --sandbox_directory="/mnt/mesos/sandbox"
> --strict="true" --switch_user="true" --systemd_enable_support="true"
> --systemd_runtime_directory="/run/systemd/system" --version="false"
> --work_dir="/tmp/Endpoint_SlaveEndpointTest_AuthorizedRequest_2_zHgho1"
> I0930 13:00:42.298678 30364 credentials.hpp:86] Loading credential for
> authentication from '/tmp/Endpoint_SlaveEndpointTest_
> AuthorizedRequest_2_XhGarC/credential'
> I0930 13:00:42.298913 30364 slave.cpp:346] Agent using credential for:
> test-principal
> I0930 13:00:42.298935 30364 credentials.hpp:37] Loading credentials for
> authentication from '/tmp/Endpoint_SlaveEndpointTest_
> AuthorizedRequest_2_XhGarC/http_credentials'
> I0930 13:00:42.299183 30364 http.cpp:883] Using default 'basic' HTTP
> authenticator for realm 'mesos-agent-readonly'
> I0930 13:00:42.299317 30364 http.cpp:883] Using default 'basic' HTTP
> authenticator for realm 'mesos-agent-readwrite'
> I0930 13:00:42.300258 30364 slave.cpp:533] Agent resources: cpus(*):2;
> mem(*):1024; disk(*):1024; ports(*):[31000-32000]
> I0930 13:00:42.300343 30364 slave.cpp:541] Agent attributes: [ ]
> I0930 13:00:42.300365 30364 slave.cpp:546] Agent hostname: e0237b91f525
> I0930 13:00:42.301707 30364 process.cpp:3377] Handling HTTP event for
> process 'slave(609)' with path: '/slave(609)/containers'
> I0930 13:00:42.301733 30363 state.cpp:57] Recovering state from
> '/tmp/Endpoint_SlaveEndpointTest_AuthorizedRequest_2_zHgho1/meta'
> I0930 13:00:42.302340 30364 status_update_manager.cpp:203] Recovering
> status update manager
> I0930 13:00:42.302575 30364 containerizer.cpp:580] Recovering containerizer
> I0930 13:00:42.302814 30365 http.cpp:835] Authorizing principal
> 'test-principal' to GET the '/containers' endpoint
> I0930 13:00:42.304533 30362 provisioner.cpp:253] Provisioner recovery
> complete
> I0930 13:00:42.310474 30365 slave.cpp:5256] Finished recovery
> I0930 13:00:42.311166 30365 slave.cpp:5428] Querying resource estimator
> for oversubscribable resources
> I0930 13:00:42.311419 30373 slave.cpp:5442] Received oversubscribable
> resources {} from the resource estimator
> I0930 13:00:42.312932 30377 slave.cpp:787] Agent terminating
> [ OK ] Endpoint/SlaveEndpointTest.AuthorizedRequest/2 (25 ms)
> [ RUN ] Endpoint/SlaveEndpointTest.UnauthorizedRequest/0
> I0930 13:00:42.320956 30343 containerizer.cpp:226] Using isolation:
> posix/cpu,posix/mem,filesystem/posix,network/cni
> W0930 13:00:42.321509 30343 backend.cpp:75] Failed to create 'aufs'
> backend: AufsBackend requires root privileges, but is running as user mesos
> W0930 13:00:42.321658 30343 backend.cpp:75] Failed to create 'bind'
> backend: BindBackend requires root privileges
> I0930 13:00:42.324277 30369 slave.cpp:208] Mesos agent started on (610)@
> 172.17.0.2:57796
> I0930 13:00:42.324304 30369 slave.cpp:209] Flags at startup: --acls=""
> --appc_simple_discovery_uri_prefix="http://" --appc_store_dir="/tmp/mesos/store/appc"
> --authenticate_http_readonly="true" --authenticate_http_readwrite="true"
> --authenticatee="crammd5" --authentication_backoff_factor="1secs"
> --authorizer="local" --cgroups_cpu_enable_pids_and_tids_count="false"
> --cgroups_enable_cfs="false" --cgroups_hierarchy="/sys/fs/cgroup"
> --cgroups_limit_swap="false" --cgroups_root="mesos" --container_disk_watch_interval="15secs"
> --containerizers="mesos" --credential="/tmp/Endpoint_SlaveEndpointTest_
> UnauthorizedRequest_0_Dez7R0/credential" --default_role="*"
> --disk_watch_interval="1mins" --docker="docker"
> --docker_kill_orphans="true" --docker_registry="https://
> registry-1.docker.io" --docker_remove_delay="6hrs"
> --docker_socket="/var/run/docker.sock" --docker_stop_timeout="0ns"
> --docker_store_dir="/tmp/mesos/store/docker" --docker_volume_checkpoint_
> dir="/var/run/mesos/isolators/docker/volume" --enforce_container_disk_quota="false"
> --executor_registration_timeout="1mins" --executor_shutdown_grace_period="5secs"
> --fetcher_cache_dir="/tmp/Endpoint_SlaveEndpointTest_
> UnauthorizedRequest_0_Dez7R0/fetch" --fetcher_cache_size="2GB"
> --frameworks_home="" --gc_delay="1weeks" --gc_disk_headroom="0.1"
> --hadoop_home="" --help="true" --hostname_lookup="true"
> --http_authenticators="basic" --http_command_executor="false"
> --http_credentials="/tmp/Endpoint_SlaveEndpointTest_
> UnauthorizedRequest_0_Dez7R0/http_credentials"
> --image_provisioner_backend="copy" --initialize_driver_logging="true"
> --isolation="posix/cpu,posix/mem" --launcher="posix"
> --launcher_dir="/mesos/mesos-1.1.0/_build/src" --logbufsecs="0"
> --logging_level="INFO" --oversubscribed_resources_interval="15secs"
> --perf_duration="10secs" --perf_interval="1mins"
> --qos_correction_interval_min="0ns" --quiet="false" --recover="reconnect"
> --recovery_timeout="15mins" --registration_backoff_factor="10ms"
> --resources="cpus:2;gpus:0;mem:1024;disk:1024;ports:[31000-32000]"
> --revocable_cpu_low_priority="true" --runtime_dir="/tmp/Endpoint_
> SlaveEndpointTest_UnauthorizedRequest_0_Dez7R0" --sandbox_directory="/mnt/mesos/sandbox"
> --strict="true" --switch_user="true" --systemd_enable_support="true"
> --systemd_runtime_directory="/run/systemd/system" --version="false"
> --work_dir="/tmp/Endpoint_SlaveEndpointTest_UnauthorizedRequest_0_thXYKp"
> I0930 13:00:42.324803 30369 credentials.hpp:86] Loading credential for
> authentication from '/tmp/Endpoint_SlaveEndpointTest_
> UnauthorizedRequest_0_Dez7R0/credential'
> I0930 13:00:42.325083 30369 slave.cpp:346] Agent using credential for:
> test-principal
> I0930 13:00:42.325111 30369 credentials.hpp:37] Loading credentials for
> authentication from '/tmp/Endpoint_SlaveEndpointTest_
> UnauthorizedRequest_0_Dez7R0/http_credentials'
> I0930 13:00:42.325453 30369 http.cpp:883] Using default 'basic' HTTP
> authenticator for realm 'mesos-agent-readonly'
> I0930 13:00:42.325646 30369 http.cpp:883] Using default 'basic' HTTP
> authenticator for realm 'mesos-agent-readwrite'
> I0930 13:00:42.326659 30369 slave.cpp:533] Agent resources: cpus(*):2;
> mem(*):1024; disk(*):1024; ports(*):[31000-32000]
> I0930 13:00:42.326735 30369 slave.cpp:541] Agent attributes: [ ]
> I0930 13:00:42.326756 30369 slave.cpp:546] Agent hostname: e0237b91f525
> I0930 13:00:42.328150 30374 state.cpp:57] Recovering state from
> '/tmp/Endpoint_SlaveEndpointTest_UnauthorizedRequest_0_thXYKp/meta'
> I0930 13:00:42.328265 30369 process.cpp:3377] Handling HTTP event for
> process 'slave(610)' with path: '/slave(610)/monitor/statistics'
> I0930 13:00:42.328783 30362 status_update_manager.cpp:203] Recovering
> status update manager
> I0930 13:00:42.328951 30362 containerizer.cpp:580] Recovering containerizer
> I0930 13:00:42.329566 30375 http.cpp:835] Authorizing principal
> 'test-principal' to GET the '/monitor/statistics' endpoint
> I0930 13:00:42.330826 30362 provisioner.cpp:253] Provisioner recovery
> complete
> I0930 13:00:42.331202 30366 slave.cpp:5256] Finished recovery
> I0930 13:00:42.331903 30366 slave.cpp:5428] Querying resource estimator
> for oversubscribable resources
> I0930 13:00:42.332214 30376 slave.cpp:5442] Received oversubscribable
> resources {} from the resource estimator
> I0930 13:00:42.332342 30369 slave.cpp:787] Agent terminating
> [ OK ] Endpoint/SlaveEndpointTest.UnauthorizedRequest/0 (20 ms)
> [ RUN ] Endpoint/SlaveEndpointTest.UnauthorizedRequest/1
> I0930 13:00:42.343436 30343 containerizer.cpp:226] Using isolation:
> posix/cpu,posix/mem,filesystem/posix,network/cni
> W0930 13:00:42.344255 30343 backend.cpp:75] Failed to create 'aufs'
> backend: AufsBackend requires root privileges, but is running as user mesos
> W0930 13:00:42.344431 30343 backend.cpp:75] Failed to create 'bind'
> backend: BindBackend requires root privileges
> I0930 13:00:42.348235 30370 slave.cpp:208] Mesos agent started on (611)@
> 172.17.0.2:57796
> I0930 13:00:42.348255 30370 slave.cpp:209] Flags at startup: --acls=""
> --appc_simple_discovery_uri_prefix="http://" --appc_store_dir="/tmp/mesos/store/appc"
> --authenticate_http_readonly="true" --authenticate_http_readwrite="true"
> --authenticatee="crammd5" --authentication_backoff_factor="1secs"
> --authorizer="local" --cgroups_cpu_enable_pids_and_tids_count="false"
> --cgroups_enable_cfs="false" --cgroups_hierarchy="/sys/fs/cgroup"
> --cgroups_limit_swap="false" --cgroups_root="mesos" --container_disk_watch_interval="15secs"
> --containerizers="mesos" --credential="/tmp/Endpoint_SlaveEndpointTest_
> UnauthorizedRequest_1_EdWMwp/credential" --default_role="*"
> --disk_watch_interval="1mins" --docker="docker"
> --docker_kill_orphans="true" --docker_registry="https://
> registry-1.docker.io" --docker_remove_delay="6hrs"
> --docker_socket="/var/run/docker.sock" --docker_stop_timeout="0ns"
> --docker_store_dir="/tmp/mesos/store/docker" --docker_volume_checkpoint_
> dir="/var/run/mesos/isolators/docker/volume" --enforce_container_disk_quota="false"
> --executor_registration_timeout="1mins" --executor_shutdown_grace_period="5secs"
> --fetcher_cache_dir="/tmp/Endpoint_SlaveEndpointTest_
> UnauthorizedRequest_1_EdWMwp/fetch" --fetcher_cache_size="2GB"
> --frameworks_home="" --gc_delay="1weeks" --gc_disk_headroom="0.1"
> --hadoop_home="" --help="true" --hostname_lookup="true"
> --http_authenticators="basic" --http_command_executor="false"
> --http_credentials="/tmp/Endpoint_SlaveEndpointTest_
> UnauthorizedRequest_1_EdWMwp/http_credentials"
> --image_provisioner_backend="copy" --initialize_driver_logging="true"
> --isolation="posix/cpu,posix/mem" --launcher="posix"
> --launcher_dir="/mesos/mesos-1.1.0/_build/src" --logbufsecs="0"
> --logging_level="INFO" --oversubscribed_resources_interval="15secs"
> --perf_duration="10secs" --perf_interval="1mins"
> --qos_correction_interval_min="0ns" --quiet="false" --recover="reconnect"
> --recovery_timeout="15mins" --registration_backoff_factor="10ms"
> --resources="cpus:2;gpus:0;mem:1024;disk:1024;ports:[31000-32000]"
> --revocable_cpu_low_priority="true" --runtime_dir="/tmp/Endpoint_
> SlaveEndpointTest_UnauthorizedRequest_1_EdWMwp" --sandbox_directory="/mnt/mesos/sandbox"
> --strict="true" --switch_user="true" --systemd_enable_support="true"
> --systemd_runtime_directory="/run/systemd/system" --version="false"
> --work_dir="/tmp/Endpoint_SlaveEndpointTest_UnauthorizedRequest_1_DpS9lO"
> I0930 13:00:42.348708 30370 credentials.hpp:86] Loading credential for
> authentication from '/tmp/Endpoint_SlaveEndpointTest_
> UnauthorizedRequest_1_EdWMwp/credential'
> I0930 13:00:42.348909 30370 slave.cpp:346] Agent using credential for:
> test-principal
> I0930 13:00:42.348934 30370 credentials.hpp:37] Loading credentials for
> authentication from '/tmp/Endpoint_SlaveEndpointTest_
> UnauthorizedRequest_1_EdWMwp/http_credentials'
> I0930 13:00:42.349202 30370 http.cpp:883] Using default 'basic' HTTP
> authenticator for realm 'mesos-agent-readonly'
> I0930 13:00:42.349331 30370 http.cpp:883] Using default 'basic' HTTP
> authenticator for realm 'mesos-agent-readwrite'
> I0930 13:00:42.350339 30370 slave.cpp:533] Agent resources: cpus(*):2;
> mem(*):1024; disk(*):1024; ports(*):[31000-32000]
> I0930 13:00:42.350441 30370 slave.cpp:541] Agent attributes: [ ]
> I0930 13:00:42.350461 30370 slave.cpp:546] Agent hostname: e0237b91f525
> I0930 13:00:42.351809 30375 state.cpp:57] Recovering state from
> '/tmp/Endpoint_SlaveEndpointTest_UnauthorizedRequest_1_DpS9lO/meta'
> I0930 13:00:42.351933 30370 process.cpp:3377] Handling HTTP event for
> process 'slave(611)' with path: '/slave(611)/monitor/statistics.json'
> I0930 13:00:42.352396 30372 status_update_manager.cpp:203] Recovering
> status update manager
> I0930 13:00:42.352527 30372 containerizer.cpp:580] Recovering containerizer
> I0930 13:00:42.353058 30366 http.cpp:835] Authorizing principal
> 'test-principal' to GET the '/monitor/statistics.json' endpoint
> I0930 13:00:42.353909 30374 provisioner.cpp:253] Provisioner recovery
> complete
> I0930 13:00:42.354249 30374 slave.cpp:5256] Finished recovery
> I0930 13:00:42.354846 30374 slave.cpp:5428] Querying resource estimator
> for oversubscribable resources
> I0930 13:00:42.355329 30367 slave.cpp:5442] Received oversubscribable
> resources {} from the resource estimator
> I0930 13:00:42.355476 30363 slave.cpp:787] Agent terminating
> [ OK ] Endpoint/SlaveEndpointTest.UnauthorizedRequest/1 (22 ms)
> [ RUN ] Endpoint/SlaveEndpointTest.UnauthorizedRequest/2
> I0930 13:00:42.364068 30343 containerizer.cpp:226] Using isolation:
> posix/cpu,posix/mem,filesystem/posix,network/cni
> W0930 13:00:42.364625 30343 backend.cpp:75] Failed to create 'aufs'
> backend: AufsBackend requires root privileges, but is running as user mesos
> W0930 13:00:42.364781 30343 backend.cpp:75] Failed to create 'bind'
> backend: BindBackend requires root privileges
> I0930 13:00:42.367625 30375 slave.cpp:208] Mesos agent started on (612)@
> 172.17.0.2:57796
> I0930 13:00:42.367645 30375 slave.cpp:209] Flags at startup: --acls=""
> --appc_simple_discovery_uri_prefix="http://" --appc_store_dir="/tmp/mesos/store/appc"
> --authenticate_http_readonly="true" --authenticate_http_readwrite="true"
> --authenticatee="crammd5" --authentication_backoff_factor="1secs"
> --authorizer="local" --cgroups_cpu_enable_pids_and_tids_count="false"
> --cgroups_enable_cfs="false" --cgroups_hierarchy="/sys/fs/cgroup"
> --cgroups_limit_swap="false" --cgroups_root="mesos" --container_disk_watch_interval="15secs"
> --containerizers="mesos" --credential="/tmp/Endpoint_SlaveEndpointTest_
> UnauthorizedRequest_2_eGgSpO/credential" --default_role="*"
> --disk_watch_interval="1mins" --docker="docker"
> --docker_kill_orphans="true" --docker_registry="https://
> registry-1.docker.io" --docker_remove_delay="6hrs"
> --docker_socket="/var/run/docker.sock" --docker_stop_timeout="0ns"
> --docker_store_dir="/tmp/mesos/store/docker" --docker_volume_checkpoint_
> dir="/var/run/mesos/isolators/docker/volume" --enforce_container_disk_quota="false"
> --executor_registration_timeout="1mins" --executor_shutdown_grace_period="5secs"
> --fetcher_cache_dir="/tmp/Endpoint_SlaveEndpointTest_
> UnauthorizedRequest_2_eGgSpO/fetch" --fetcher_cache_size="2GB"
> --frameworks_home="" --gc_delay="1weeks" --gc_disk_headroom="0.1"
> --hadoop_home="" --help="true" --hostname_lookup="true"
> --http_authenticators="basic" --http_command_executor="false"
> --http_credentials="/tmp/Endpoint_SlaveEndpointTest_
> UnauthorizedRequest_2_eGgSpO/http_credentials"
> --image_provisioner_backend="copy" --initialize_driver_logging="true"
> --isolation="posix/cpu,posix/mem" --launcher="posix"
> --launcher_dir="/mesos/mesos-1.1.0/_build/src" --logbufsecs="0"
> --logging_level="INFO" --oversubscribed_resources_interval="15secs"
> --perf_duration="10secs" --perf_interval="1mins"
> --qos_correction_interval_min="0ns" --quiet="false" --recover="reconnect"
> --recovery_timeout="15mins" --registration_backoff_factor="10ms"
> --resources="cpus:2;gpus:0;mem:1024;disk:1024;ports:[31000-32000]"
> --revocable_cpu_low_priority="true" --runtime_dir="/tmp/Endpoint_
> SlaveEndpointTest_UnauthorizedRequest_2_eGgSpO" --sandbox_directory="/mnt/mesos/sandbox"
> --strict="true" --switch_user="true" --systemd_enable_support="true"
> --systemd_runtime_directory="/run/systemd/system" --version="false"
> --work_dir="/tmp/Endpoint_SlaveEndpointTest_UnauthorizedRequest_2_lccJbd"
> I0930 13:00:42.368129 30375 credentials.hpp:86] Loading credential for
> authentication from '/tmp/Endpoint_SlaveEndpointTest_
> UnauthorizedRequest_2_eGgSpO/credential'
> I0930 13:00:42.368377 30375 slave.cpp:346] Agent using credential for:
> test-principal
> I0930 13:00:42.368402 30375 credentials.hpp:37] Loading credentials for
> authentication from '/tmp/Endpoint_SlaveEndpointTest_
> UnauthorizedRequest_2_eGgSpO/http_credentials'
> I0930 13:00:42.368713 30375 http.cpp:883] Using default 'basic' HTTP
> authenticator for realm 'mesos-agent-readonly'
> I0930 13:00:42.368863 30375 http.cpp:883] Using default 'basic' HTTP
> authenticator for realm 'mesos-agent-readwrite'
> I0930 13:00:42.369998 30375 slave.cpp:533] Agent resources: cpus(*):2;
> mem(*):1024; disk(*):1024; ports(*):[31000-32000]
> I0930 13:00:42.370071 30375 slave.cpp:541] Agent attributes: [ ]
> I0930 13:00:42.370085 30375 slave.cpp:546] Agent hostname: e0237b91f525
> I0930 13:00:42.371449 30375 process.cpp:3377] Handling HTTP event for
> process 'slave(612)' with path: '/slave(612)/containers'
> I0930 13:00:42.371486 30376 state.cpp:57] Recovering state from
> '/tmp/Endpoint_SlaveEndpointTest_UnauthorizedRequest_2_lccJbd/meta'
> I0930 13:00:42.372289 30372 status_update_manager.cpp:203] Recovering
> status update manager
> I0930 13:00:42.372388 30364 http.cpp:835] Authorizing principal
> 'test-principal' to GET the '/containers' endpoint
> I0930 13:00:42.372761 30376 containerizer.cpp:580] Recovering containerizer
> I0930 13:00:42.374456 30365 provisioner.cpp:253] Provisioner recovery
> complete
> I0930 13:00:42.374853 30367 slave.cpp:787] Agent terminating
> [ OK ] Endpoint/SlaveEndpointTest.UnauthorizedRequest/2 (19 ms)
> [ RUN ] Endpoint/SlaveEndpointTest.NoAuthorizer/0
> I0930 13:00:42.383117 30343 containerizer.cpp:226] Using isolation:
> posix/cpu,posix/mem,filesystem/posix,network/cni
> W0930 13:00:42.383666 30343 backend.cpp:75] Failed to create 'aufs'
> backend: AufsBackend requires root privileges, but is running as user mesos
> W0930 13:00:42.383810 30343 backend.cpp:75] Failed to create 'bind'
> backend: BindBackend requires root privileges
> I0930 13:00:42.385015 30343 cluster.cpp:435] Creating default 'local'
> authorizer
> I0930 13:00:42.386487 30364 slave.cpp:208] Mesos agent started on (613)@
> 172.17.0.2:57796
> I0930 13:00:42.386535 30364 slave.cpp:209] Flags at startup: --acls=""
> --appc_simple_discovery_uri_prefix="http://" --appc_store_dir="/tmp/mesos/store/appc"
> --authenticate_http_readonly="true" --authenticate_http_readwrite="true"
> --authenticatee="crammd5" --authentication_backoff_factor="1secs"
> --authorizer="local" --cgroups_cpu_enable_pids_and_tids_count="false"
> --cgroups_enable_cfs="false" --cgroups_hierarchy="/sys/fs/cgroup"
> --cgroups_limit_swap="false" --cgroups_root="mesos" --container_disk_watch_interval="15secs"
> --containerizers="mesos" --credential="/tmp/Endpoint_SlaveEndpointTest_
> NoAuthorizer_0_oPTefC/credential" --default_role="*"
> --disk_watch_interval="1mins" --docker="docker"
> --docker_kill_orphans="true" --docker_registry="https://
> registry-1.docker.io" --docker_remove_delay="6hrs"
> --docker_socket="/var/run/docker.sock" --docker_stop_timeout="0ns"
> --docker_store_dir="/tmp/mesos/store/docker" --docker_volume_checkpoint_
> dir="/var/run/mesos/isolators/docker/volume" --enforce_container_disk_quota="false"
> --executor_registration_timeout="1mins" --executor_shutdown_grace_period="5secs"
> --fetcher_cache_dir="/tmp/Endpoint_SlaveEndpointTest_NoAuthorizer_0_oPTefC/fetch"
> --fetcher_cache_size="2GB" --frameworks_home="" --gc_delay="1weeks"
> --gc_disk_headroom="0.1" --hadoop_home="" --help="false"
> --hostname_lookup="true" --http_authenticators="basic"
> --http_command_executor="false" --http_credentials="/tmp/
> Endpoint_SlaveEndpointTest_NoAuthorizer_0_oPTefC/http_credentials"
> --image_provisioner_backend="copy" --initialize_driver_logging="true"
> --isolation="posix/cpu,posix/mem" --launcher="posix"
> --launcher_dir="/mesos/mesos-1.1.0/_build/src" --logbufsecs="0"
> --logging_level="INFO" --oversubscribed_resources_interval="15secs"
> --perf_duration="10secs" --perf_interval="1mins"
> --qos_correction_interval_min="0ns" --quiet="false" --recover="reconnect"
> --recovery_timeout="15mins" --registration_backoff_factor="10ms"
> --resources="cpus:2;gpus:0;mem:1024;disk:1024;ports:[31000-32000]"
> --revocable_cpu_low_priority="true" --runtime_dir="/tmp/Endpoint_
> SlaveEndpointTest_NoAuthorizer_0_oPTefC" --sandbox_directory="/mnt/mesos/sandbox"
> --strict="true" --switch_user="true" --systemd_enable_support="true"
> --systemd_runtime_directory="/run/systemd/system" --version="false"
> --work_dir="/tmp/Endpoint_SlaveEndpointTest_NoAuthorizer_0_onV1X0"
> I0930 13:00:42.387039 30364 credentials.hpp:86] Loading credential for
> authentication from '/tmp/Endpoint_SlaveEndpointTest_
> NoAuthorizer_0_oPTefC/credential'
> I0930 13:00:42.387240 30364 slave.cpp:346] Agent using credential for:
> test-principal
> I0930 13:00:42.387265 30364 credentials.hpp:37] Loading credentials for
> authentication from '/tmp/Endpoint_SlaveEndpointTest_
> NoAuthorizer_0_oPTefC/http_credentials'
> I0930 13:00:42.387531 30364 http.cpp:883] Using default 'basic' HTTP
> authenticator for realm 'mesos-agent-readonly'
> I0930 13:00:42.387678 30364 http.cpp:883] Using default 'basic' HTTP
> authenticator for realm 'mesos-agent-readwrite'
> I0930 13:00:42.388875 30364 slave.cpp:533] Agent resources: cpus(*):2;
> mem(*):1024; disk(*):1024; ports(*):[31000-32000]
> I0930 13:00:42.388950 30364 slave.cpp:541] Agent attributes: [ ]
> I0930 13:00:42.388968 30364 slave.cpp:546] Agent hostname: e0237b91f525
> I0930 13:00:42.390703 30364 process.cpp:3377] Handling HTTP event for
> process 'slave(613)' with path: '/slave(613)/monitor/statistics'
> I0930 13:00:42.391193 30374 state.cpp:57] Recovering state from
> '/tmp/Endpoint_SlaveEndpointTest_NoAuthorizer_0_onV1X0/meta'
> I0930 13:00:42.392503 30364 status_update_manager.cpp:203] Recovering
> status update manager
> I0930 13:00:42.392779 30374 containerizer.cpp:580] Recovering containerizer
> I0930 13:00:42.394923 30374 provisioner.cpp:253] Provisioner recovery
> complete
> I0930 13:00:42.395366 30376 slave.cpp:5256] Finished recovery
> I0930 13:00:42.396067 30376 slave.cpp:5428] Querying resource estimator
> for oversubscribable resources
> I0930 13:00:42.396432 30376 slave.cpp:5442] Received oversubscribable
> resources {} from the resource estimator
> I0930 13:00:42.396692 30375 http.cpp:835] Authorizing principal
> 'test-principal' to GET the '/monitor/statistics' endpoint
> I0930 13:00:42.401904 30375 slave.cpp:787] Agent terminating
> [ OK ] Endpoint/SlaveEndpointTest.NoAuthorizer/0 (27 ms)
> [ RUN ] Endpoint/SlaveEndpointTest.NoAuthorizer/1
> I0930 13:00:42.411063 30343 containerizer.cpp:226] Using isolation:
> posix/cpu,posix/mem,filesystem/posix,network/cni
> W0930 13:00:42.411712 30343 backend.cpp:75] Failed to create 'aufs'
> backend: AufsBackend requires root privileges, but is running as user mesos
> W0930 13:00:42.411895 30343 backend.cpp:75] Failed to create 'bind'
> backend: BindBackend requires root privileges
> I0930 13:00:42.413252 30343 cluster.cpp:435] Creating default 'local'
> authorizer
> I0930 13:00:42.415901 30371 slave.cpp:208] Mesos agent started on (614)@
> 172.17.0.2:57796
> I0930 13:00:42.415931 30371 slave.cpp:209] Flags at startup: --acls=""
> --appc_simple_discovery_uri_prefix="http://" --appc_store_dir="/tmp/mesos/store/appc"
> --authenticate_http_readonly="true" --authenticate_http_readwrite="true"
> --authenticatee="crammd5" --authentication_backoff_factor="1secs"
> --authorizer="local" --cgroups_cpu_enable_pids_and_tids_count="false"
> --cgroups_enable_cfs="false" --cgroups_hierarchy="/sys/fs/cgroup"
> --cgroups_limit_swap="false" --cgroups_root="mesos" --container_disk_watch_interval="15secs"
> --containerizers="mesos" --credential="/tmp/Endpoint_SlaveEndpointTest_
> NoAuthorizer_1_rkUGB1/credential" --default_role="*"
> --disk_watch_interval="1mins" --docker="docker"
> --docker_kill_orphans="true" --docker_registry="https://
> registry-1.docker.io" --docker_remove_delay="6hrs"
> --docker_socket="/var/run/docker.sock" --docker_stop_timeout="0ns"
> --docker_store_dir="/tmp/mesos/store/docker" --docker_volume_checkpoint_
> dir="/var/run/mesos/isolators/docker/volume" --enforce_container_disk_quota="false"
> --executor_registration_timeout="1mins" --executor_shutdown_grace_period="5secs"
> --fetcher_cache_dir="/tmp/Endpoint_SlaveEndpointTest_NoAuthorizer_1_rkUGB1/fetch"
> --fetcher_cache_size="2GB" --frameworks_home="" --gc_delay="1weeks"
> --gc_disk_headroom="0.1" --hadoop_home="" --help="false"
> --hostname_lookup="true" --http_authenticators="basic"
> --http_command_executor="false" --http_credentials="/tmp/
> Endpoint_SlaveEndpointTest_NoAuthorizer_1_rkUGB1/http_credentials"
> --image_provisioner_backend="copy" --initialize_driver_logging="true"
> --isolation="posix/cpu,posix/mem" --launcher="posix"
> --launcher_dir="/mesos/mesos-1.1.0/_build/src" --logbufsecs="0"
> --logging_level="INFO" --oversubscribed_resources_interval="15secs"
> --perf_duration="10secs" --perf_interval="1mins"
> --qos_correction_interval_min="0ns" --quiet="false" --recover="reconnect"
> --recovery_timeout="15mins" --registration_backoff_factor="10ms"
> --resources="cpus:2;gpus:0;mem:1024;disk:1024;ports:[31000-32000]"
> --revocable_cpu_low_priority="true" --runtime_dir="/tmp/Endpoint_
> SlaveEndpointTest_NoAuthorizer_1_rkUGB1" --sandbox_directory="/mnt/mesos/sandbox"
> --strict="true" --switch_user="true" --systemd_enable_support="true"
> --systemd_runtime_directory="/run/systemd/system" --version="false"
> --work_dir="/tmp/Endpoint_SlaveEndpointTest_NoAuthorizer_1_3ULYfq"
> I0930 13:00:42.416373 30371 credentials.hpp:86] Loading credential for
> authentication from '/tmp/Endpoint_SlaveEndpointTest_
> NoAuthorizer_1_rkUGB1/credential'
> I0930 13:00:42.416599 30371 slave.cpp:346] Agent using credential for:
> test-principal
> I0930 13:00:42.416622 30371 credentials.hpp:37] Loading credentials for
> authentication from '/tmp/Endpoint_SlaveEndpointTest_
> NoAuthorizer_1_rkUGB1/http_credentials'
> I0930 13:00:42.416906 30371 http.cpp:883] Using default 'basic' HTTP
> authenticator for realm 'mesos-agent-readonly'
> I0930 13:00:42.417068 30371 http.cpp:883] Using default 'basic' HTTP
> authenticator for realm 'mesos-agent-readwrite'
> I0930 13:00:42.418313 30371 slave.cpp:533] Agent resources: cpus(*):2;
> mem(*):1024; disk(*):1024; ports(*):[31000-32000]
> I0930 13:00:42.418403 30371 slave.cpp:541] Agent attributes: [ ]
> I0930 13:00:42.418426 30371 slave.cpp:546] Agent hostname: e0237b91f525
> I0930 13:00:42.419908 30377 state.cpp:57] Recovering state from
> '/tmp/Endpoint_SlaveEndpointTest_NoAuthorizer_1_3ULYfq/meta'
> I0930 13:00:42.419991 30371 process.cpp:3377] Handling HTTP event for
> process 'slave(614)' with path: '/slave(614)/monitor/statistics.json'
> I0930 13:00:42.420907 30377 status_update_manager.cpp:203] Recovering
> status update manager
> I0930 13:00:42.421226 30368 containerizer.cpp:580] Recovering containerizer
> I0930 13:00:42.422302 30377 http.cpp:835] Authorizing principal
> 'test-principal' to GET the '/monitor/statistics.json' endpoint
> I0930 13:00:42.422785 30366 provisioner.cpp:253] Provisioner recovery
> complete
> I0930 13:00:42.423782 30377 slave.cpp:5256] Finished recovery
> I0930 13:00:42.424300 30377 slave.cpp:5428] Querying resource estimator
> for oversubscribable resources
> I0930 13:00:42.424898 30363 slave.cpp:5442] Received oversubscribable
> resources {} from the resource estimator
> I0930 13:00:42.426108 30365 slave.cpp:787] Agent terminating
> [ OK ] Endpoint/SlaveEndpointTest.NoAuthorizer/1 (25 ms)
> [ RUN ] Endpoint/SlaveEndpointTest.NoAuthorizer/2
> I0930 13:00:42.443666 30343 containerizer.cpp:226] Using isolation:
> posix/cpu,posix/mem,filesystem/posix,network/cni
> W0930 13:00:42.444931 30343 backend.cpp:75] Failed to create 'aufs'
> backend: AufsBackend requires root privileges, but is running as user mesos
> W0930 13:00:42.445384 30343 backend.cpp:75] Failed to create 'bind'
> backend: BindBackend requires root privileges
> I0930 13:00:42.447580 30343 cluster.cpp:435] Creating default 'local'
> authorizer
> I0930 13:00:42.451195 30376 slave.cpp:208] Mesos agent started on (615)@
> 172.17.0.2:57796
> I0930 13:00:42.451225 30376 slave.cpp:209] Flags at startup: --acls=""
> --appc_simple_discovery_uri_prefix="http://" --appc_store_dir="/tmp/mesos/store/appc"
> --authenticate_http_readonly="true" --authenticate_http_readwrite="true"
> --authenticatee="crammd5" --authentication_backoff_factor="1secs"
> --authorizer="local" --cgroups_cpu_enable_pids_and_tids_count="false"
> --cgroups_enable_cfs="false" --cgroups_hierarchy="/sys/fs/cgroup"
> --cgroups_limit_swap="false" --cgroups_root="mesos" --container_disk_watch_interval="15secs"
> --containerizers="mesos" --credential="/tmp/Endpoint_SlaveEndpointTest_
> NoAuthorizer_2_sAZugr/credential" --default_role="*"
> --disk_watch_interval="1mins" --docker="docker"
> --docker_kill_orphans="true" --docker_registry="https://
> registry-1.docker.io" --docker_remove_delay="6hrs"
> --docker_socket="/var/run/docker.sock" --docker_stop_timeout="0ns"
> --docker_store_dir="/tmp/mesos/store/docker" --docker_volume_checkpoint_
> dir="/var/run/mesos/isolators/docker/volume" --enforce_container_disk_quota="false"
> --executor_registration_timeout="1mins" --executor_shutdown_grace_period="5secs"
> --fetcher_cache_dir="/tmp/Endpoint_SlaveEndpointTest_NoAuthorizer_2_sAZugr/fetch"
> --fetcher_cache_size="2GB" --frameworks_home="" --gc_delay="1weeks"
> --gc_disk_headroom="0.1" --hadoop_home="" --help="false"
> --hostname_lookup="true" --http_authenticators="basic"
> --http_command_executor="false" --http_credentials="/tmp/
> Endpoint_SlaveEndpointTest_NoAuthorizer_2_sAZugr/http_credentials"
> --image_provisioner_backend="copy" --initialize_driver_logging="true"
> --isolation="posix/cpu,posix/mem" --launcher="posix"
> --launcher_dir="/mesos/mesos-1.1.0/_build/src" --logbufsecs="0"
> --logging_level="INFO" --oversubscribed_resources_interval="15secs"
> --perf_duration="10secs" --perf_interval="1mins"
> --qos_correction_interval_min="0ns" --quiet="false" --recover="reconnect"
> --recovery_timeout="15mins" --registration_backoff_factor="10ms"
> --resources="cpus:2;gpus:0;mem:1024;disk:1024;ports:[31000-32000]"
> --revocable_cpu_low_priority="true" --runtime_dir="/tmp/Endpoint_
> SlaveEndpointTest_NoAuthorizer_2_sAZugr" --sandbox_directory="/mnt/mesos/sandbox"
> --strict="true" --switch_user="true" --systemd_enable_support="true"
> --systemd_runtime_directory="/run/systemd/system" --version="false"
> --work_dir="/tmp/Endpoint_SlaveEndpointTest_NoAuthorizer_2_F6aYPP"
> I0930 13:00:42.451854 30376 credentials.hpp:86] Loading credential for
> authentication from '/tmp/Endpoint_SlaveEndpointTest_
> NoAuthorizer_2_sAZugr/credential'
> I0930 13:00:42.452080 30376 slave.cpp:346] Agent using credential for:
> test-principal
> I0930 13:00:42.452107 30376 credentials.hpp:37] Loading credentials for
> authentication from '/tmp/Endpoint_SlaveEndpointTest_
> NoAuthorizer_2_sAZugr/http_credentials'
> I0930 13:00:42.452402 30376 http.cpp:883] Using default 'basic' HTTP
> authenticator for realm 'mesos-agent-readonly'
> I0930 13:00:42.452576 30376 http.cpp:883] Using default 'basic' HTTP
> authenticator for realm 'mesos-agent-readwrite'
> I0930 13:00:42.454422 30376 slave.cpp:533] Agent resources: cpus(*):2;
> mem(*):1024; disk(*):1024; ports(*):[31000-32000]
> I0930 13:00:42.454500 30376 slave.cpp:541] Agent attributes: [ ]
> I0930 13:00:42.454521 30376 slave.cpp:546] Agent hostname: e0237b91f525
> I0930 13:00:42.455899 30363 state.cpp:57] Recovering state from
> '/tmp/Endpoint_SlaveEndpointTest_NoAuthorizer_2_F6aYPP/meta'
> I0930 13:00:42.455987 30376 process.cpp:3377] Handling HTTP event for
> process 'slave(615)' with path: '/slave(615)/containers'
> I0930 13:00:42.456615 30373 status_update_manager.cpp:203] Recovering
> status update manager
> I0930 13:00:42.456774 30367 containerizer.cpp:580] Recovering containerizer
> I0930 13:00:42.457118 30366 http.cpp:835] Authorizing principal
> 'test-principal' to GET the '/containers' endpoint
> I0930 13:00:42.458556 30371 provisioner.cpp:253] Provisioner recovery
> complete
> I0930 13:00:42.458865 30364 slave.cpp:5256] Finished recovery
> I0930 13:00:42.459370 30364 slave.cpp:5428] Querying resource estimator
> for oversubscribable resources
> I0930 13:00:42.459697 30366 slave.cpp:5442] Received oversubscribable
> resources {} from the resource estimator
> I0930 13:00:42.461649 30365 slave.cpp:787] Agent terminating
> [ OK ] Endpoint/SlaveEndpointTest.NoAuthorizer/2 (34 ms)
> [----------] 9 tests from Endpoint/SlaveEndpointTest (216 ms total)
>
> [----------] Global test environment tear-down
> [==========] 1339 tests from 152 test cases ran. (432726 ms total)
> [ PASSED ] 1338 tests.
> [ FAILED ] 1 test, listed below:
> [ FAILED ] RegistrarTest.MarkUnreachable
>
> 1 FAILED TEST
> YOU HAVE 6 DISABLED TESTS
>
> make[4]: *** [check-local] Error 1
> make[4]: Leaving directory `/mesos/mesos-1.1.0/_build/src'
> make[3]: *** [check-am] Error 2
> make[3]: Leaving directory `/mesos/mesos-1.1.0/_build/src'
> make[2]: *** [check] Error 2
> make[2]: Leaving directory `/mesos/mesos-1.1.0/_build/src'
> make[1]: *** [check-recursive] Error 1
> make[1]: Leaving directory `/mesos/mesos-1.1.0/_build'
> make: *** [distcheck] Error 1
> + docker rmi mesos-1475238050-2884
> Untagged: mesos-1475238050-2884:latest
> Deleted: sha256:546eac04cd4860cc49e8ce7cd95e9c
> 7546588186ce1a3959511f7fd8df79930d
> Deleted: sha256:f10f3e2ae0620f62afe0b8735c2b51
> 37a3b7ee3bca83155292410bdb856f5fbd
> Deleted: sha256:627a07cb7287a858e8e567122d0288
> 0fd9ff93dd04987e298a639e2c9d387482
> Deleted: sha256:17d68f946b001a90f2fbbcd69c9350
> ab1078a2d53f053d35652a363a26845174
> Deleted: sha256:5173f5bd8a0eea648160d79a103c31
> 93896082ca23948faa5edbf9587c96c42c
> Deleted: sha256:3c9d3303c5d066168af8ed02bd360f
> 9bb2a3c62bfa1f5ac5548fd27814a1c679
> Deleted: sha256:b5159d4e5cd770cf9f0d8c30cbd972
> f6ce6062332107321b57cbe9b740cd533f
> Deleted: sha256:00d32e48c5491b6110b423d3bf2a0f
> 1b67dcc585b6505a2ebe9481069fd4582b
> Deleted: sha256:52ec461f241b57a0610e171e95e51f
> 77ee25111255d5c3368708d8a73d34b35c
> Deleted: sha256:ec20247b092adb948baabd24f4dfff
> 07f223a5f455bedadcce6eede7b87f5f98
> Deleted: sha256:78cf787a4e31c7c5a559ff30291536
> b3df23f1fd948d37416de311ea50fda992
> Deleted: sha256:83d6bec6f0a5ada73ab8404fd20748
> 2d35e0082099c37048cde85e12e5ad9e2d
> Deleted: sha256:b58999ccd09de5a01b9cac8ad8667f
> 9744cbd5c6e6da283a027f27a7717273a9
> Deleted: sha256:f7ce596e52ecbaef4a6dd45f576627
> 8a9fa292b75e3b30be46332944c591e488
> Deleted: sha256:dbd5b950d0e020217f6407e28924fe
> 094862fa76b3dc6acf76a3d314d1c28115
> Deleted: sha256:aee4359376172c1de1630314ff77cc
> c205e1e922976295d3fe24a8da6afc6703
> Deleted: sha256:0fa61c1d4c7eb6727151fc4421cf26
> 10760bfcd1cf4327ca921501fa25daba22
> Deleted: sha256:8d1b624f8727f4f6c11eaa2f2a77c6
> 88be35e46c9b21d2036a3742f9d20aee6e
> Deleted: sha256:ae26224238e7016e20ffe2ffa99539
> 144e490e1c4e0e38d949537742da56535b
> Deleted: sha256:1a93855d7b5fad08f105aabd569875
> a33352b1762e4f42a44323c70a54f56b33
> Deleted: sha256:0f0941fd5d51152e493c3812fbd1e6
> efd8bde42bb660cab11754484c61103e2e
> Deleted: sha256:410d1194f642eb5eab89b587b06715
> 9198456380700684d168cc817207f2562d
> Deleted: sha256:c6500a17ca4719e99d98459e4ed522
> 7c37c564d07bb111323bb8d8510ba7fb68
> Deleted: sha256:5035135d832eade93b9f726e756d85
> 8fafaaba7f4bfb547bc9e1e44deac617e0
> Build step 'Execute shell' marked build as failure
>