You are viewing a plain text version of this content. The canonical link for it is here.
Posted to commits@tomee.apache.org by Apache Jenkins Server <je...@builds.apache.org> on 2025/12/06 19:29:40 UTC
Build failed in Jenkins: TomEE » tomee-10-build-full-arquillian #9
See <https://ci-builds.apache.org/job/Tomee/job/tomee-10-build-full-arquillian/9/display/redirect?page=changes>
Changes:
[github] [tomee-10.x]: Bump actions/setup-java from 5.0.0 to 5.1.0 (#2323)
[github] [tomee-10.x]: Bump peter-evans/create-pull-request from 7.0.9 to 7.0.11 (#2326)
[github] TOMEE-4557 - commons-io 2.21.0
[github] [tomee-10.x]: Bump org.apache.maven.plugins:maven-resources-plugin (#2327)
[github] [tomee-10.x]: Bump version.shrinkwrap.resolver.bom from 3.1.4 to 3.3.4 (#2332)
[github] [tomee-10.x]: Bump commons-codec:commons-codec from 1.19.0 to 1.20.0 (#2335)
[github] [tomee-10.x]: Bump org.apache.maven.plugins:maven-release-plugin (#2342)
[github] [tomee-10.x]: Bump version.hibernate.orm (#2349)
[github] [tomee-10.x]: Bump org.netbeans.tools:sigtest-maven-plugin (#2353)
[github] [tomee-10.x]: Bump net.bytebuddy:byte-buddy from 1.17.8 to 1.18.2 (#2354)
[github] Minor: Regenerated BOMs for dd648623504b0418911aca4a2169d67b164304b5 (#2348)
------------------------------------------
[...truncated 1.52 MiB...]
[INFO] TomEE :: Connector Examples :: Connector in EAR :: Functional Tests 10.1.3-SNAPSHOT SUCCESS [ 0.975 s]
[INFO] TomEE :: Connector Examples :: Connector in WAR 10.1.3-SNAPSHOT SUCCESS [ 0.528 s]
[INFO] TomEE :: Examples :: Cucumber JVM 10.1.3-SNAPSHOT .. SUCCESS [ 12.798 s]
[INFO] TomEE :: Examples :: Expanded support for Env Entries 10.1.3-SNAPSHOT SUCCESS [ 0.197 s]
[INFO] TomEE :: Examples :: Datasource Ciphered Password 10.1.3-SNAPSHOT SUCCESS [ 0.135 s]
[INFO] TomEE :: Examples :: Datasource Definition 10.1.3-SNAPSHOT SUCCESS [ 0.285 s]
[INFO] TomEE :: Examples :: Datasource Versioning 10.1.3-SNAPSHOT SUCCESS [ 0.985 s]
[INFO] TomEE :: Examples :: Decorators 10.1.3-SNAPSHOT .... SUCCESS [ 0.203 s]
[INFO] TomEE :: Examples :: Dynamic DAO Implementation 10.1.3-SNAPSHOT SUCCESS [ 0.189 s]
[INFO] TomEE :: Examples :: Dynamic Datasource Routing 10.1.3-SNAPSHOT SUCCESS [ 0.276 s]
[INFO] TomEE :: Examples :: Dynamic Implementation 10.1.3-SNAPSHOT SUCCESS [ 0.204 s]
[INFO] TomEE :: Examples :: Dynamic MBean Proxy 10.1.3-SNAPSHOT SUCCESS [ 0.317 s]
[INFO] TomEE :: Examples :: Ear Testing 10.1.3-SNAPSHOT ... SUCCESS [ 0.005 s]
[INFO] TomEE :: Examples :: Ear Testing :: Business Model 10.1.3-SNAPSHOT SUCCESS [ 0.078 s]
[INFO] TomEE :: Examples :: Ear Testing :: Business Logic 10.1.3-SNAPSHOT SUCCESS [ 0.193 s]
[INFO] TomEE :: Web Examples :: EJB Examples War 10.1.3-SNAPSHOT SUCCESS [ 0.187 s]
[INFO] TomEE :: Web Examples :: EJB Remote Call 10.1.3-SNAPSHOT SUCCESS [ 0.138 s]
[INFO] TomEE :: Web Examples :: EJB Remote Call 10.1.3-SNAPSHOT SUCCESS [ 0.131 s]
[INFO] TomEE :: Web Examples :: EJB WebService 10.1.3-SNAPSHOT SUCCESS [ 0.062 s]
[INFO] TomEE :: Arquillian Adaptors Parent :: OpenEJB Container 10.1.3-SNAPSHOT SUCCESS [ 1.672 s]
[INFO] TomEE :: Examples :: Groovy CDI 10.1.3-SNAPSHOT .... SUCCESS [ 0.927 s]
[INFO] TomEE :: Examples :: Groovy JPA 10.1.3-SNAPSHOT .... SUCCESS [ 0.729 s]
[INFO] TomEE :: Examples :: Hello World - Weblogic 10.1.3-SNAPSHOT SUCCESS [ 0.118 s]
[INFO] TomEE :: Examples :: @Resource jakarta.jms.ConnectionFactory 10.1.3-SNAPSHOT SUCCESS [ 0.326 s]
[INFO] TomEE :: Examples :: @Resource DataSource Injection 10.1.3-SNAPSHOT SUCCESS [ 0.133 s]
[INFO] TomEE :: Examples :: @EJB Injection 10.1.3-SNAPSHOT SUCCESS [ 0.154 s]
[INFO] TomEE :: Examples :: @PersistenceContext EntityManager Injection 10.1.3-SNAPSHOT SUCCESS [ 0.123 s]
[INFO] TomEE :: Examples :: @Resource env-entry Injection 10.1.3-SNAPSHOT SUCCESS [ 0.121 s]
[INFO] TomEE :: Examples :: Interceptors 10.1.3-SNAPSHOT .. SUCCESS [ 0.197 s]
[INFO] TomEE :: Examples :: JakartaMail API 10.1.3-SNAPSHOT SUCCESS [ 1.647 s]
[INFO] TomEE :: Examples :: Jakarta Mail API with Velocity 10.1.3-SNAPSHOT SUCCESS [ 1.060 s]
[INFO] TomEE :: Web Examples :: Java Modules (Simple REST resource) 10.1.3-SNAPSHOT SUCCESS [ 0.974 s]
[INFO] TomEE :: Examples :: JAXRS Filter 10.1.3-SNAPSHOT .. SUCCESS [ 0.602 s]
[INFO] TomEE :: Examples :: JAXRS JSON Provider with Jettison 10.1.3-SNAPSHOT SUCCESS [ 1.557 s]
[INFO] TomEE :: Examples :: JPA with EclipseLink 10.1.3-SNAPSHOT SUCCESS [ 0.338 s]
[INFO] TomEE :: Utils :: Core Hibernate 10.1.3-SNAPSHOT ... SUCCESS [ 1.043 s]
[INFO] TomEE :: Examples :: JPA with Hibernate 10.1.3-SNAPSHOT SUCCESS [ 0.576 s]
[INFO] TomEE :: Examples :: JPA with Hibernate and arquillian 10.1.3-SNAPSHOT SUCCESS [ 0.307 s]
[INFO] TomEE :: Examples :: JPA @Enumerated 10.1.3-SNAPSHOT SUCCESS [ 0.155 s]
[INFO] TomEE :: Web Examples :: JSF - CDI and EJB 10.1.3-SNAPSHOT SUCCESS [ 0.155 s]
[INFO] TomEE :: Examples :: JUnit 5 :: Application Composer 10.1.3-SNAPSHOT SUCCESS [ 0.252 s]
[INFO] TomEE :: Examples :: JUnit 5 :: Multiple TomEE with Arquillian 10.1.3-SNAPSHOT SUCCESS [ 0.197 s]
[INFO] TomEE :: Examples :: JUnit 5 :: Simple Websockets with Arquillian 10.1.3-SNAPSHOT SUCCESS [ 0.691 s]
[INFO] TomEE :: Examples :: @EJB Lookup 10.1.3-SNAPSHOT ... SUCCESS [ 0.137 s]
[INFO] TomEE :: Examples :: EJB Lookup with descriptor 10.1.3-SNAPSHOT SUCCESS [ 0.175 s]
[INFO] TomEE :: Examples :: Movies Complete (Meta) 10.1.3-SNAPSHOT SUCCESS [ 0.210 s]
[INFO] TomEE :: Examples :: Movies Complete 10.1.3-SNAPSHOT SUCCESS [ 0.168 s]
[INFO] TomEE :: Examples :: MicroProfile Config 10.1.3-SNAPSHOT SUCCESS [ 0.350 s]
[INFO] TomEE :: Examples :: MicroProfile Config Source Database 10.1.3-SNAPSHOT SUCCESS [ 0.496 s]
[INFO] TomEE :: Examples :: Microprofile Fault Tolerance :: Fallback 10.1.3-SNAPSHOT SUCCESS [ 0.251 s]
[INFO] TomEE :: Examples :: Microprofile Fault Tolerance :: Retry 10.1.3-SNAPSHOT SUCCESS [ 0.412 s]
[INFO] TomEE :: Examples :: Microprofile Fault Tolerance :: Timeout 10.1.3-SNAPSHOT SUCCESS [ 0.230 s]
[INFO] TomEE :: Examples :: MicroProfile JWT Bean Validation 10.1.3-SNAPSHOT SUCCESS [ 0.537 s]
[INFO] TomEE :: Examples :: MicroProfile JWT Bean Validation, Strongly-typed Annotations 10.1.3-SNAPSHOT SUCCESS [ 0.376 s]
[INFO] TomEE :: Examples :: Microprofile Metrics Counted 10.1.3-SNAPSHOT SUCCESS [ 0.361 s]
[INFO] TomEE :: Examples :: Microprofile Metrics Histogram 10.1.3-SNAPSHOT SUCCESS [ 0.288 s]
[INFO] TomEE :: Examples :: Microprofile Metrics Timed 10.1.3-SNAPSHOT SUCCESS [ 0.329 s]
[INFO] TomEE :: Examples :: MicroProfile Metrics Gauge 10.1.3-SNAPSHOT SUCCESS [ 0.253 s]
[INFO] TomEE :: Examples :: MicroProfile Metrics Metered 10.1.3-SNAPSHOT SUCCESS [ 0.081 s]
[INFO] TomEE :: Examples :: MP REST JWT JWK 10.1.3-SNAPSHOT SUCCESS [ 0.418 s]
[INFO] TomEE :: Examples :: MP REST JWT PRINCIPAL 10.1.3-SNAPSHOT SUCCESS [ 0.257 s]
[INFO] TomEE :: Examples :: MP REST JWT Public Key 10.1.3-SNAPSHOT SUCCESS [ 0.388 s]
[INFO] TomEE :: Examples :: Microprofile REST Client 10.1.3-SNAPSHOT SUCCESS [ 0.436 s]
[INFO] TomEE :: Examples :: Custom HealthCheck 10.1.3-SNAPSHOT SUCCESS [ 0.352 s]
[INFO] TomEE :: Examples :: Microprofile OpenAPI Reader 10.1.3-SNAPSHOT SUCCESS [ 1.176 s]
[INFO] TomEE :: Examples :: MTOM 10.1.3-SNAPSHOT .......... SUCCESS [ 0.739 s]
[INFO] TomEE :: Examples :: Multiple JPA providers 10.1.3-SNAPSHOT SUCCESS [ 0.483 s]
[INFO] TomEE :: Examples :: Multiple Arquillian Adapters 10.1.3-SNAPSHOT SUCCESS [ 0.382 s]
[INFO] TomEE :: Examples :: Multiple TomEE with Arquillian 10.1.3-SNAPSHOT SUCCESS [ 0.138 s]
[INFO] TomEE :: Examples :: Persistence Fragment 10.1.3-SNAPSHOT SUCCESS [ 0.154 s]
[INFO] TomEE :: Web Examples :: Pojo WS 10.1.3-SNAPSHOT ... SUCCESS [ 0.077 s]
[INFO] TomEE :: Examples :: Quartz 10.1.3-SNAPSHOT ........ SUCCESS [ 0.003 s]
[INFO] TomEE :: Examples :: Quartz :: Quartz Resource Adapter 10.1.3-SNAPSHOT SUCCESS [ 0.160 s]
[INFO] TomEE :: Examples :: Quartz :: Quartz Beans 10.1.3-SNAPSHOT SUCCESS [ 0.742 s]
[INFO] TomEE :: Examples :: DataSource Realm 10.1.3-SNAPSHOT SUCCESS [ 0.025 s]
[INFO] TomEE :: Examples :: Reloadable Persistence Unit Properties 10.1.3-SNAPSHOT SUCCESS [ 0.156 s]
[INFO] TomEE :: Web Examples :: Resource Declared In A Webapp 10.1.3-SNAPSHOT SUCCESS [ 0.081 s]
[INFO] TomEE :: Examples :: REST, Mockito and Application Composer 10.1.3-SNAPSHOT SUCCESS [ 0.193 s]
[INFO] TomEE :: Examples :: REST and Application Composer 10.1.3-SNAPSHOT SUCCESS [ 0.209 s]
[INFO] TomEE :: Examples :: REST CDI 10.1.3-SNAPSHOT ...... SUCCESS [ 0.195 s]
[INFO] TomEE :: Examples :: JAXRS and JAAS 10.1.3-SNAPSHOT SUCCESS [ 0.061 s]
[INFO] TomEE :: Examples :: REST and EJB 10.1.3-SNAPSHOT .. SUCCESS [ 0.224 s]
[INFO] TomEE :: Web Examples :: REST Example 10.1.3-SNAPSHOT SUCCESS [ 2.115 s]
[INFO] TomEE :: Web Examples :: REST Example With Application 10.1.3-SNAPSHOT SUCCESS [ 0.765 s]
[INFO] TomEE :: Examples :: REST XML JSON 10.1.3-SNAPSHOT . SUCCESS [ 0.219 s]
[INFO] TomEE :: Examples :: Basic Scala 10.1.3-SNAPSHOT ... SUCCESS [ 24.954 s]
[INFO] TomEE :: Examples :: ScheduleExpression 10.1.3-SNAPSHOT SUCCESS [ 0.167 s]
[INFO] TomEE :: Examples :: @Schedule Events 10.1.3-SNAPSHOT SUCCESS [ 0.155 s]
[INFO] TomEE :: Examples :: @Schedule Methods (Meta) 10.1.3-SNAPSHOT SUCCESS [ 0.203 s]
[INFO] TomEE :: Examples :: @Schedule Methods 10.1.3-SNAPSHOT SUCCESS [ 0.149 s]
[INFO] TomEE :: Examples :: Server Events 10.1.3-SNAPSHOT . SUCCESS [ 0.223 s]
[INFO] TomEE :: Examples :: Serverless Builder 10.1.3-SNAPSHOT SUCCESS [ 0.473 s]
[INFO] TomEE :: Examples :: Serverless Apache TomEE WebProfile 10.1.3-SNAPSHOT SUCCESS [ 0.455 s]
[INFO] TomEE :: Examples :: Serverless Apache TomEE MicroProfile 10.1.3-SNAPSHOT SUCCESS [ 0.637 s]
[INFO] TomEE :: Examples :: Serverless Apache TomEE Plume 10.1.3-SNAPSHOT SUCCESS [ 0.639 s]
[INFO] TomEE :: Examples :: Serverless Apache TomEE Plus 10.1.3-SNAPSHOT SUCCESS [ 0.832 s]
[INFO] TomEE :: Examples :: Singleton startup ordering 10.1.3-SNAPSHOT SUCCESS [ 0.274 s]
[INFO] TomEE :: Examples :: Simple CDI Interceptor 10.1.3-SNAPSHOT SUCCESS [ 0.171 s]
[INFO] TomEE :: Examples :: Simple EAR 10.1.3-SNAPSHOT .... SUCCESS [ 0.004 s]
[INFO] TomEE :: Examples :: Simple EAR :: Business Model 10.1.3-SNAPSHOT SUCCESS [ 0.087 s]
[INFO] TomEE :: Examples :: Simple EAR :: Business Logic 10.1.3-SNAPSHOT SUCCESS [ 0.174 s]
[INFO] TomEE :: Examples :: Simple EAR :: Webapp 10.1.3-SNAPSHOT SUCCESS [ 0.407 s]
[INFO] TomEE :: Examples :: Simple EAR :: EAR Packaging 10.1.3-SNAPSHOT SUCCESS [ 0.061 s]
[INFO] TomEE :: Examples :: Simple EAR :: Functional Tests 10.1.3-SNAPSHOT SUCCESS [ 0.748 s]
[INFO] TomEE :: Examples :: Simple CMP2 Entity 10.1.3-SNAPSHOT SUCCESS [ 0.158 s]
[INFO] TomEE :: Examples :: Simple JMS 10.1.3-SNAPSHOT .... SUCCESS [ 0.996 s]
[INFO] TomEE :: Examples :: Simple JMS Context 10.1.3-SNAPSHOT SUCCESS [ 0.770 s]
[INFO] TomEE :: Examples :: Simple MDB With a CDI Injection 10.1.3-SNAPSHOT SUCCESS [ 0.398 s]
[INFO] TomEE :: Examples :: Simple MDB Example 10.1.3-SNAPSHOT SUCCESS [ 0.359 s]
[INFO] TomEE :: Examples :: Simple MDB Using Deployment Descriptor Example 10.1.3-SNAPSHOT SUCCESS [ 0.366 s]
[INFO] TomEE :: Examples :: Simple Remote tomcat-users.xml 10.1.3-SNAPSHOT SUCCESS [ 0.229 s]
[INFO] TomEE :: Examples :: Simple REST 10.1.3-SNAPSHOT ... SUCCESS [ 0.210 s]
[INFO] TomEE :: Examples :: Simple Singleton 10.1.3-SNAPSHOT SUCCESS [ 0.153 s]
[INFO] TomEE :: Examples :: Simple Stateful Pojo 10.1.3-SNAPSHOT SUCCESS [ 0.132 s]
[INFO] TomEE :: Examples :: Simple Stateful Pojo Callbacks 10.1.3-SNAPSHOT SUCCESS [ 0.227 s]
[INFO] TomEE :: Examples :: Simple Stateless Pojo 10.1.3-SNAPSHOT SUCCESS [ 0.160 s]
[INFO] TomEE :: Examples :: Simple Stateless Pojo Callbacks 10.1.3-SNAPSHOT SUCCESS [ 0.151 s]
[INFO] TomEE :: Examples :: Simple Stateless With Deployment Descriptor 10.1.3-SNAPSHOT SUCCESS [ 0.130 s]
[INFO] TomEE :: Examples :: Simple Webservice 10.1.3-SNAPSHOT SUCCESS [ 0.541 s]
[INFO] TomEE :: Examples :: Simple Webservice Without Interface 10.1.3-SNAPSHOT SUCCESS [ 0.410 s]
[INFO] TomEE :: Examples :: Async Servlet 10.1.3-SNAPSHOT . SUCCESS [ 0.346 s]
[INFO] TomEE :: Web Examples :: Struts 10.1.3-SNAPSHOT .... SUCCESS [ 0.844 s]
[INFO] TomEE :: Examples :: Telephone Stateful Pojo 10.1.3-SNAPSHOT SUCCESS [ 0.152 s]
[INFO] TomEE :: Examples :: TestCase Injection 10.1.3-SNAPSHOT SUCCESS [ 0.163 s]
[INFO] TomEE :: Examples :: Testing Security (Meta) 10.1.3-SNAPSHOT SUCCESS [ 0.182 s]
[INFO] TomEE :: Examples :: Testing Security 10.1.3-SNAPSHOT SUCCESS [ 0.153 s]
[INFO] TomEE :: Examples :: Testing Security 10.1.3-SNAPSHOT SUCCESS [ 0.156 s]
[INFO] TomEE :: Examples :: Testing Security Service Provider 10.1.3-SNAPSHOT SUCCESS [ 0.219 s]
[INFO] TomEE :: Examples :: Testing Security Script Service Provider 10.1.3-SNAPSHOT SUCCESS [ 0.203 s]
[INFO] TomEE :: Examples :: Testing Transactions 10.1.3-SNAPSHOT SUCCESS [ 0.159 s]
[INFO] TomEE :: Examples :: Testing Transactions BMT 10.1.3-SNAPSHOT SUCCESS [ 0.147 s]
[INFO] TomEE :: TomEE :: IBM MQ AMQ Portability Examples :: MDB Example 1.0 SUCCESS [ 0.363 s]
[INFO] TomEE :: Examples :: Transaction Rollback 10.1.3-SNAPSHOT SUCCESS [ 0.199 s]
[INFO] TomEE :: Examples :: Troubleshooting 10.1.3-SNAPSHOT SUCCESS [ 0.171 s]
[INFO] TomEE :: Examples :: Webservice Attachments 10.1.3-SNAPSHOT SUCCESS [ 0.303 s]
[INFO] TomEE :: Examples :: Webservice Inheritance 10.1.3-SNAPSHOT SUCCESS [ 0.433 s]
[INFO] TomEE :: Web Examples :: EJB WebService with Security 10.1.3-SNAPSHOT SUCCESS [ 0.376 s]
[INFO] TomEE :: Web Examples :: EJB WebService with SSL Client Certificate 10.1.3-SNAPSHOT SUCCESS [ 5.058 s]
[INFO] TomEE :: Web Examples :: EJB WebService with WS-Security 10.1.3-SNAPSHOT SUCCESS [ 4.648 s]
[INFO] TomEE :: Web Examples :: EJB WebService WS Security with resources.xml 10.1.3-SNAPSHOT SUCCESS [ 0.666 s]
[INFO] TomEE :: Examples :: Web Service Handlers 10.1.3-SNAPSHOT SUCCESS [ 0.565 s]
[INFO] TomEE :: Examples :: @WebService Holder 10.1.3-SNAPSHOT SUCCESS [ 0.463 s]
[INFO] TomEE :: Web Examples :: Moviefun 10.1.3-SNAPSHOT .. SUCCESS [ 0.717 s]
[INFO] TomEE :: Web Examples :: Moviefun Rest 10.1.3-SNAPSHOT SUCCESS [ 2.444 s]
[INFO] TomEE :: Utils :: Provisionning 10.1.3-SNAPSHOT .... SUCCESS [ 3.471 s]
[INFO] TomEE :: Examples :: Resources/JMX Example 10.1.3-SNAPSHOT SUCCESS [ 0.037 s]
[INFO] TomEE :: Examples :: Resources/JMX Example :: EJB Module 10.1.3-SNAPSHOT SUCCESS [ 0.916 s]
[INFO] TomEE :: Examples :: Resources/JMX Example :: EAR Module 10.1.3-SNAPSHOT SUCCESS [ 0.297 s]
[INFO] TomEE :: Examples :: WebSocket with tls and basic auth Example 10.1.3-SNAPSHOT SUCCESS [ 0.295 s]
[INFO] TomEE :: Examples :: Concurrency utilities example 10.1.3-SNAPSHOT SUCCESS [ 0.178 s]
[INFO] TomEE :: Examples :: Microprofile JSONB Configuration 10.1.3-SNAPSHOT SUCCESS [ 0.198 s]
[INFO] TomEE :: Examples :: Microprofile JSONB Custom Serializer/Deserializer 10.1.3-SNAPSHOT SUCCESS [ 0.205 s]
[INFO] TomEE :: Examples :: Azure deployment example 10.1.3-SNAPSHOT SUCCESS [ 6.379 s]
[INFO] TomEE :: Examples :: XA Datasource configuration and usage 10.1.3-SNAPSHOT SUCCESS [ 0.657 s]
[INFO] TomEE :: Examples :: Websocket JMS 10.1.3-SNAPSHOT . SUCCESS [ 0.446 s]
[INFO] TomEE :: Web Examples :: Multi-Broker 10.1.3-SNAPSHOT SUCCESS [ 0.149 s]
[INFO] TomEE :: Examples :: Jakarta Security tomcat-user.xml Identity Store 10.1.3-SNAPSHOT SUCCESS [ 0.524 s]
[INFO] TomEE :: Examples :: Jakarta Security custom Identity Store 10.1.3-SNAPSHOT SUCCESS [ 1.092 s]
[INFO] TomEE :: Examples :: Jakarta Security OpenID Connect 10.1.3-SNAPSHOT SUCCESS [ 4.010 s]
[INFO] TomEE :: Examples 10.1.3-SNAPSHOT .................. SUCCESS [ 0.022 s]
[INFO] TomEE :: Assembly :: All In One EJB Lite jar 10.1.3-SNAPSHOT SUCCESS [ 16.991 s]
[INFO] TomEE :: Utils :: TomEE Webapps-based Deployer EJB 10.1.3-SNAPSHOT SUCCESS [ 0.306 s]
[INFO] TomEE :: TCK 10.1.3-SNAPSHOT ....................... SUCCESS [ 0.013 s]
[INFO] TomEE :: TCK :: Common 10.1.3-SNAPSHOT ............. SUCCESS [ 0.483 s]
[INFO] TomEE :: TCK :: CDI Embedded 10.1.3-SNAPSHOT ....... SUCCESS [ 2.608 s]
[INFO] TomEE :: TCK :: CDI TomEE 10.1.3-SNAPSHOT .......... SUCCESS [ 1.277 s]
[INFO] TomEE :: TCK :: CDI TCK Signature Tests 10.1.3-SNAPSHOT SUCCESS [ 0.418 s]
[INFO] TomEE :: TCK :: Bean Validation Embedded 10.1.3-SNAPSHOT SUCCESS [ 1.937 s]
[INFO] TomEE :: TCK :: Bean Validation TomEE 10.1.3-SNAPSHOT SUCCESS [ 0.565 s]
[INFO] TomEE :: TCK :: Bean Validation TCK Signature tests 10.1.3-SNAPSHOT FAILURE [ 1.435 s]
[INFO] TomEE :: TCK :: JSON-P Standalone 10.1.3-SNAPSHOT .. SKIPPED
[INFO] TomEE :: TCK :: JSON-P Signature Tests 10.1.3-SNAPSHOT SKIPPED
[INFO] TomEE :: TCK :: JSON-B Standalone 10.1.3-SNAPSHOT .. SKIPPED
[INFO] TomEE :: TCK :: JSON-B Signature Tests 10.1.3-SNAPSHOT SKIPPED
[INFO] TomEE :: TCK :: Concurrency Standalone 10.1.3-SNAPSHOT SKIPPED
[INFO] TomEE :: TCK :: Concurrency Signature Tests 10.1.3-SNAPSHOT SKIPPED
[INFO] TomEE :: TCK :: MicroProfile 10.1.3-SNAPSHOT ....... SKIPPED
[INFO] TomEE :: TCK :: MicroProfile Config TCK 10.1.3-SNAPSHOT SKIPPED
[INFO] TomEE :: TCK :: MicroProfile JWT TCK 10.1.3-SNAPSHOT SKIPPED
[INFO] TomEE :: TCK :: MicroProfile Health TCK 10.1.3-SNAPSHOT SKIPPED
[INFO] TomEE :: TCK :: MicroProfile Metrics TCK 10.1.3-SNAPSHOT SKIPPED
[INFO] TomEE :: TCK :: MicroProfile Rest Client TCK 10.1.3-SNAPSHOT SKIPPED
[INFO] TomEE :: TCK :: MicroProfile Open API TCK 10.1.3-SNAPSHOT SKIPPED
[INFO] TomEE :: TCK :: MicroProfile Fault Tolerance TCK 10.1.3-SNAPSHOT SKIPPED
[INFO] TomEE :: TCK :: MicroProfile Open Telemetry TCK 10.1.3-SNAPSHOT SKIPPED
[INFO] TomEE :: TCK :: JAX-RS TCK 10.1.3-SNAPSHOT ......... SKIPPED
[INFO] TomEE :: TCK :: JAX-RS TCK :: Tests 10.1.3-SNAPSHOT SKIPPED
[INFO] TomEE :: TCK :: JAX-RS TCK :: Tests Embedded 10.1.3-SNAPSHOT SKIPPED
[INFO] TomEE :: TCK :: JAX-RS TCK :: Signature Test 10.1.3-SNAPSHOT SKIPPED
[INFO] TomEE :: Arquillian Adaptors Parent :: Tests 10.1.3-SNAPSHOT SKIPPED
[INFO] TomEE :: Arquillian Adaptors Parent :: Tests :: Web Profile 10.1.3-SNAPSHOT SKIPPED
[INFO] TomEE :: Arquillian Adaptors Parent :: Tests :: JAXRS 10.1.3-SNAPSHOT SKIPPED
[INFO] TomEE :: Arquillian Adaptors Parent :: Tests :: JAXWS 10.1.3-SNAPSHOT SKIPPED
[INFO] TomEE :: Arquillian Adaptors Parent :: Tests :: JMS 10.1.3-SNAPSHOT SKIPPED
[INFO] TomEE :: Arquillian Adaptors Parent :: Tests :: Configuration Tests 10.1.3-SNAPSHOT SKIPPED
[INFO] TomEE :: Arquillian Adaptors Parent :: Sample :: Moviefun 10.1.3-SNAPSHOT SKIPPED
[INFO] TomEE :: Arquillian Adaptors Parent :: Arquillian TCK 10.1.3-SNAPSHOT SKIPPED
[INFO] TomEE :: Arquillian :: Functional Tests 10.1.3-SNAPSHOT SKIPPED
[INFO] TomEE :: Arquillian :: Functional Tests :: Spring CXF Test 10.1.3-SNAPSHOT SKIPPED
[INFO] TomEE :: Utils :: Log4j2 10.1.3-SNAPSHOT ........... SKIPPED
[INFO] TomEE :: TomEE :: webaccess 10.1.3-SNAPSHOT ........ SKIPPED
[INFO] TomEE :: TomEE :: Overlay Runner 10.1.3-SNAPSHOT ... SKIPPED
[INFO] ------------------------------------------------------------------------
[INFO] BUILD FAILURE
[INFO] ------------------------------------------------------------------------
[INFO] Total time: 09:14 min
[INFO] Finished at: 2025-12-06T19:29:32Z
[INFO] ------------------------------------------------------------------------
[WARNING]
[WARNING] Plugin validation issues were detected in 17 plugin(s)
[WARNING]
[WARNING] * org.apache.maven.plugins:maven-jar-plugin:3.0.2
[WARNING] * org.apache.maven.plugins:maven-compiler-plugin:3.14.1
[WARNING] * org.apache.maven.plugins:maven-ejb-plugin:2.3
[WARNING] * org.apache.maven.plugins:maven-compiler-plugin:3.10.1
[WARNING] * org.scalatest:scalatest-maven-plugin:2.2.0
[WARNING] * org.apache.maven.plugins:maven-resources-plugin:3.3.0
[WARNING] * org.apache.openjpa:openjpa-maven-plugin:4.1.1
[WARNING] * org.apache.maven.plugins:maven-surefire-plugin:3.5.3
[WARNING] * org.apache.maven.plugins:maven-war-plugin:3.3.2
[WARNING] * org.apache.maven.plugins:maven-assembly-plugin:2.4.1
[WARNING] * com.googlecode.jslint4java:jslint4java-maven-plugin:2.0.5
[WARNING] * org.apache.tomee.patch:tomee-patch-plugin:0.10
[WARNING] * org.netbeans.tools:sigtest-maven-plugin:1.7
[WARNING] * org.apache.felix:maven-bundle-plugin:6.0.0
[WARNING] * org.apache.maven.plugins:maven-install-plugin:3.0.0-M1
[WARNING] * org.apache.tomee.maven:tomee-maven-plugin:10.1.3-SNAPSHOT
[WARNING] * org.apache.maven.plugins:maven-surefire-report-plugin:3.5.3
[WARNING]
[WARNING] For more or less details, use 'maven.plugin.validation' property with one of the values (case insensitive): [BRIEF, DEFAULT, VERBOSE]
[WARNING]
[ERROR] Failed to execute goal org.netbeans.tools:sigtest-maven-plugin:1.7:check (default) on project bval-signature-test: Execution default of goal org.netbeans.tools:sigtest-maven-plugin:1.7:check failed: Cannot read the array length because "<local5>" is null -> [Help 1]
[ERROR]
[ERROR] To see the full stack trace of the errors, re-run Maven with the -e switch.
[ERROR] Re-run Maven using the -X switch to enable full debug logging.
[ERROR]
[ERROR] For more information about the errors and possible solutions, please read the following articles:
[ERROR] [Help 1] http://cwiki.apache.org/confluence/display/MAVEN/PluginExecutionException
[ERROR]
[ERROR] After correcting the problems, you can resume the build with the command
[ERROR] mvn <args> -rf :bval-signature-test
Build step 'Execute shell' marked build as failure
INFO: Processing JUnit
INFO: [JUnit] - No test report file(s) were found with the pattern '**/target/surefire-reports/TEST-*.xml' relative to '<https://ci-builds.apache.org/job/Tomee/job/tomee-10-build-full-arquillian/ws/'> for the testing framework 'JUnit'.
Did you enter a pattern relative to (and within) the workspace directory?
Did you generate the result report(s) for 'JUnit'?"
WARNING: All test reports are empty.
[Checks API] No suitable checks publisher found.
INFO: Setting the build status to SUCCESS
Jenkins build is back to normal : TomEE » tomee-10-build-full-arquillian #10
Posted by Apache Jenkins Server <je...@builds.apache.org>.
See <https://ci-builds.apache.org/job/Tomee/job/tomee-10-build-full-arquillian/10/display/redirect?page=changes>