You are viewing a plain text version of this content. The canonical link for it is here.
Posted to hdfs-dev@hadoop.apache.org by Apache Jenkins Server <je...@builds.apache.org> on 2012/08/01 14:59:07 UTC

Hadoop-Hdfs-trunk - Build # 1122 - Failure

See https://builds.apache.org/job/Hadoop-Hdfs-trunk/1122/

###################################################################################
########################## LAST 60 LINES OF THE CONSOLE ###########################
[...truncated 11043 lines...]
Running org.apache.hadoop.fs.loadGenerator.TestLoadGenerator
Tests run: 2, Failures: 0, Errors: 0, Skipped: 0, Time elapsed: 14.137 sec
Running org.apache.hadoop.fs.TestFcHdfsSymlink
Tests run: 68, Failures: 0, Errors: 0, Skipped: 0, Time elapsed: 8.413 sec
Running org.apache.hadoop.fs.TestFcHdfsCreateMkdir
Tests run: 8, Failures: 0, Errors: 0, Skipped: 0, Time elapsed: 3.059 sec
Running org.apache.hadoop.fs.TestHDFSFileContextMainOperations
Tests run: 59, Failures: 0, Errors: 0, Skipped: 0, Time elapsed: 6.143 sec

Results :

Tests in error: 
  testCompleteOtherLeaseHoldersFile(org.apache.hadoop.hdfs.TestFileAppend4): test timed out after 60000 milliseconds
  testBlockCorruptionRecoveryPolicy2(org.apache.hadoop.hdfs.TestDatanodeBlockScanner): Timed out waiting for corrupt replicas. Waiting for 2, but only found 0

Tests run: 1453, Failures: 0, Errors: 2, Skipped: 5

[INFO] ------------------------------------------------------------------------
[INFO] Reactor Summary:
[INFO] 
[INFO] Apache Hadoop HDFS ................................ FAILURE [1:18:10.842s]
[INFO] Apache Hadoop HttpFS .............................. SKIPPED
[INFO] Apache Hadoop HDFS BookKeeper Journal ............. SKIPPED
[INFO] Apache Hadoop HDFS Project ........................ SKIPPED
[INFO] ------------------------------------------------------------------------
[INFO] BUILD FAILURE
[INFO] ------------------------------------------------------------------------
[INFO] Total time: 1:18:11.604s
[INFO] Finished at: Wed Aug 01 12:59:02 UTC 2012
[INFO] Final Memory: 24M/421M
[INFO] ------------------------------------------------------------------------
[ERROR] Failed to execute goal org.apache.maven.plugins:maven-surefire-plugin:2.12:test (default-test) on project hadoop-hdfs: There are test failures.
[ERROR] 
[ERROR] Please refer to /home/jenkins/jenkins-slave/workspace/Hadoop-Hdfs-trunk/trunk/hadoop-hdfs-project/hadoop-hdfs/target/surefire-reports for the individual test results.
[ERROR] -> [Help 1]
[ERROR] 
[ERROR] To see the full stack trace of the errors, re-run Maven with the -e switch.
[ERROR] Re-run Maven using the -X switch to enable full debug logging.
[ERROR] 
[ERROR] For more information about the errors and possible solutions, please read the following articles:
[ERROR] [Help 1] http://cwiki.apache.org/confluence/display/MAVEN/MojoFailureException
Build step 'Execute shell' marked build as failure
Archiving artifacts
Updating MAPREDUCE-4444
Updating MAPREDUCE-4375
Updating MAPREDUCE-4457
Updating MAPREDUCE-4483
Updating MAPREDUCE-4492
Updating MAPREDUCE-4493
Updating MAPREDUCE-4456
Updating HDFS-3738
Updating MAPREDUCE-4496
Updating HADOOP-8370
Updating HADOOP-8637
Updating HDFS-3667
Updating MAPREDUCE-4234
Sending e-mails to: hdfs-dev@hadoop.apache.org
Email was triggered for: Failure
Sending email for trigger: Failure



###################################################################################
############################## FAILED TESTS (if any) ##############################
No tests ran.