You are viewing a plain text version of this content. The canonical link for it is here.
Posted to builds@lucene.apache.org by Apache Jenkins Server <je...@builds.apache.org> on 2025/02/21 03:23:56 UTC

[JENKINS] Lucene » Lucene-NightlyTests-10.1 - Build # 65 - Unstable!

Build: https://ci-builds.apache.org/job/Lucene/job/Lucene-NightlyTests-10.1/65/

2 tests failed.
FAILED:  org.apache.lucene.misc.store.TestDirectIODirectory.testRandomByte

Error Message:
java.lang.Exception: Test abandoned because suite timeout was reached.

Stack Trace:
java.lang.Exception: Test abandoned because suite timeout was reached.
	at __randomizedtesting.SeedInfo.seed([6CFAC4C1294C87BD]:0)


FAILED:  org.apache.lucene.misc.store.TestDirectIODirectory.classMethod

Error Message:
java.lang.Exception: Suite timeout exceeded (>= 7200000 msec).

Stack Trace:
java.lang.Exception: Suite timeout exceeded (>= 7200000 msec).
	at __randomizedtesting.SeedInfo.seed([6CFAC4C1294C87BD]:0)




Build Log:
[...truncated 1147 lines...]
ERROR: The following test(s) have failed:
  - org.apache.lucene.misc.store.TestDirectIODirectory.testRandomByte (:lucene:misc)
    Test output: /home/jenkins/jenkins-slave/workspace/Lucene/Lucene-NightlyTests-10.1/checkout/lucene/misc/build/test-results/test/outputs/OUTPUT-org.apache.lucene.misc.store.TestDirectIODirectory.txt
    Reproduce with: gradlew :lucene:misc:test --tests "org.apache.lucene.misc.store.TestDirectIODirectory.testRandomByte" -Ptests.jvms=4 -Ptests.jvmargs= -Ptests.seed=6CFAC4C1294C87BD -Ptests.multiplier=2 -Ptests.nightly=true -Ptests.gui=true -Ptests.file.encoding=US-ASCII -Ptests.linedocsfile=/home/jenkins/jenkins-slave/workspace/Lucene/Lucene-NightlyTests-10.1/test-data/enwiki.random.lines.txt -Ptests.vectorsize=default -Ptests.forceintegervectors=false

  - org.apache.lucene.misc.store.TestDirectIODirectory.classMethod (:lucene:misc)
    Test output: /home/jenkins/jenkins-slave/workspace/Lucene/Lucene-NightlyTests-10.1/checkout/lucene/misc/build/test-results/test/outputs/OUTPUT-org.apache.lucene.misc.store.TestDirectIODirectory.txt
    Reproduce with: gradlew :lucene:misc:test --tests "org.apache.lucene.misc.store.TestDirectIODirectory.classMethod" -Ptests.jvms=4 -Ptests.jvmargs= -Ptests.seed=6CFAC4C1294C87BD -Ptests.multiplier=2 -Ptests.nightly=true -Ptests.gui=true -Ptests.file.encoding=US-ASCII -Ptests.linedocsfile=/home/jenkins/jenkins-slave/workspace/Lucene/Lucene-NightlyTests-10.1/test-data/enwiki.random.lines.txt -Ptests.vectorsize=default -Ptests.forceintegervectors=false


Deprecated Gradle features were used in this build, making it incompatible with Gradle 9.0.

You can use '--warning-mode all' to show the individual deprecation warnings and determine if they come from your own scripts or plugins.

For more on this, please refer to https://docs.gradle.org/8.10/userguide/command_line_interface.html#sec:command_line_warnings in the Gradle documentation.

BUILD SUCCESSFUL in 4h 11m 51s
246 actionable tasks: 246 executed
Build step 'Invoke Gradle script' changed build result to SUCCESS
Archiving artifacts
‘**/*.events’ doesn’t match anything: ‘**’ exists but not ‘**/*.events’
No artifacts found that match the file pattern "**/*.events,heapdumps/**,**/hs_err_pid*". Configuration error?
Recording test results
[Checks API] No suitable checks publisher found.
Build step 'Publish JUnit test result report' changed build result to UNSTABLE
Email was triggered for: Unstable (Test Failures)
Sending email for trigger: Unstable (Test Failures)

[JENKINS] Lucene » Lucene-NightlyTests-10.1 - Build # 66 - Still Unstable!

Posted by Apache Jenkins Server <je...@builds.apache.org>.
Build: https://ci-builds.apache.org/job/Lucene/job/Lucene-NightlyTests-10.1/66/

2 tests failed.
FAILED:  org.apache.lucene.misc.store.TestDirectIODirectory.testRandomByte

Error Message:
java.lang.Exception: Test abandoned because suite timeout was reached.

Stack Trace:
java.lang.Exception: Test abandoned because suite timeout was reached.
	at __randomizedtesting.SeedInfo.seed([342B9E844A82507]:0)


FAILED:  org.apache.lucene.misc.store.TestDirectIODirectory.classMethod

Error Message:
java.lang.Exception: Suite timeout exceeded (>= 7200000 msec).

Stack Trace:
java.lang.Exception: Suite timeout exceeded (>= 7200000 msec).
	at __randomizedtesting.SeedInfo.seed([342B9E844A82507]:0)




Build Log:
[...truncated 1140 lines...]
ERROR: The following test(s) have failed:
  - org.apache.lucene.misc.store.TestDirectIODirectory.testRandomByte (:lucene:misc)
    Test output: /home/jenkins/jenkins-slave/workspace/Lucene/Lucene-NightlyTests-10.1/checkout/lucene/misc/build/test-results/test/outputs/OUTPUT-org.apache.lucene.misc.store.TestDirectIODirectory.txt
    Reproduce with: gradlew :lucene:misc:test --tests "org.apache.lucene.misc.store.TestDirectIODirectory.testRandomByte" -Ptests.jvms=4 -Ptests.jvmargs= -Ptests.seed=342B9E844A82507 -Ptests.multiplier=2 -Ptests.nightly=true -Ptests.gui=true -Ptests.file.encoding=ISO-8859-1 -Ptests.linedocsfile=/home/jenkins/jenkins-slave/workspace/Lucene/Lucene-NightlyTests-10.1/test-data/enwiki.random.lines.txt -Ptests.vectorsize=128 -Ptests.forceintegervectors=true

  - org.apache.lucene.misc.store.TestDirectIODirectory.classMethod (:lucene:misc)
    Test output: /home/jenkins/jenkins-slave/workspace/Lucene/Lucene-NightlyTests-10.1/checkout/lucene/misc/build/test-results/test/outputs/OUTPUT-org.apache.lucene.misc.store.TestDirectIODirectory.txt
    Reproduce with: gradlew :lucene:misc:test --tests "org.apache.lucene.misc.store.TestDirectIODirectory.classMethod" -Ptests.jvms=4 -Ptests.jvmargs= -Ptests.seed=342B9E844A82507 -Ptests.multiplier=2 -Ptests.nightly=true -Ptests.gui=true -Ptests.file.encoding=ISO-8859-1 -Ptests.linedocsfile=/home/jenkins/jenkins-slave/workspace/Lucene/Lucene-NightlyTests-10.1/test-data/enwiki.random.lines.txt -Ptests.vectorsize=128 -Ptests.forceintegervectors=true


Deprecated Gradle features were used in this build, making it incompatible with Gradle 9.0.

You can use '--warning-mode all' to show the individual deprecation warnings and determine if they come from your own scripts or plugins.

For more on this, please refer to https://docs.gradle.org/8.10/userguide/command_line_interface.html#sec:command_line_warnings in the Gradle documentation.

BUILD SUCCESSFUL in 3h 56m 44s
246 actionable tasks: 181 executed, 65 up-to-date
Build step 'Invoke Gradle script' changed build result to SUCCESS
Archiving artifacts
‘**/*.events’ doesn’t match anything: ‘**’ exists but not ‘**/*.events’
No artifacts found that match the file pattern "**/*.events,heapdumps/**,**/hs_err_pid*". Configuration error?
Recording test results
[Checks API] No suitable checks publisher found.
Build step 'Publish JUnit test result report' changed build result to UNSTABLE
Email was triggered for: Unstable (Test Failures)
Sending email for trigger: Unstable (Test Failures)