You are viewing a plain text version of this content. The canonical link for it is here.
Posted to builds@solr.apache.org by Policeman Jenkins Server via builds <bu...@solr.apache.org> on 2026/03/18 19:56:19 UTC

[JENKINS] Solr-main-Linux (64bit/hotspot/jdk-25) - Build # 32328 - Unstable!

Build: https://jenkins.thetaphi.de/job/Solr-main-Linux/32328/
Java: 64bit/hotspot/jdk-25 -XX:-UseCompressedOops -XX:+UseParallelGC

1 tests failed.
FAILED:  org.apache.solr.search.TestFiltering.testRandomFiltering

Error Message:
java.lang.AssertionError: FAILURE: indexSize=98 iiter=1 qiter=454 request=[q, {! cache=true tag=t}id:RAND405369040 OR val_i:[00080 TO 00130}, fq, {!cache=false tag=t} -val_i:0 -val_i:1 -val_i:2 -val_i:3 -val_i:6 -val_i:7 -val_i:8 -val_i:9 -val_i:10 -val_i:11 -val_i:12 -val_i:15 -val_i:18 -val_i:19 -val_i:24 -val_i:25 -val_i:26 -val_i:27 -val_i:29 -val_i:33 -val_i:34 -val_i:36 -val_i:39 -val_i:40 -val_i:43 -val_i:44 -val_i:47 -val_i:48 -val_i:52 -val_i:53 -val_i:54 -val_i:55 -val_i:57 -val_i:58 -val_i:61 -val_i:62 -val_i:63 -val_i:64 -val_i:65 -val_i:66 -val_i:67 -val_i:71 -val_i:72 -val_i:73 -val_i:74 -val_i:75 -val_i:78 -val_i:80 -val_i:81 -val_i:82 -val_i:83 -val_i:84 -val_i:85 -val_i:86 -val_i:87 -val_i:88 -val_i:91 -val_i:93 -val_i:94 -val_i:96 -val_i:97, fq, {!}val_s:{00000 TO 00085} AND val_s:[00001 TO 00084], fq, {!cache=false cost=176} -val_i:2 -val_i:6 -val_i:8 -val_i:10 -val_i:13 -val_i:14 -val_i:16 -val_i:24 -val_i:26 -val_i:31 -val_i:33 -val_i:42 -val_i:45 -val_i:46 -val_i:47 -val_i:48 -val_i:49 -val_i:52 -val_i:54 -val_i:55 -val_i:56 -val_i:58 -val_i:64 -val_i:65 -val_i:68 -val_i:71 -val_i:72 -val_i:74 -val_i:77 -val_i:79 -val_i:80 -val_i:81 -val_i:83 -val_i:85 -val_i:86 -val_i:87 -val_i:88 -val_i:90 -val_i:92 -val_i:96 -val_i:97]

Stack Trace:
java.lang.AssertionError: FAILURE: indexSize=98 iiter=1 qiter=454 request=[q, {! cache=true tag=t}id:RAND405369040 OR val_i:[00080 TO 00130}, fq, {!cache=false tag=t} -val_i:0 -val_i:1 -val_i:2 -val_i:3 -val_i:6 -val_i:7 -val_i:8 -val_i:9 -val_i:10 -val_i:11 -val_i:12 -val_i:15 -val_i:18 -val_i:19 -val_i:24 -val_i:25 -val_i:26 -val_i:27 -val_i:29 -val_i:33 -val_i:34 -val_i:36 -val_i:39 -val_i:40 -val_i:43 -val_i:44 -val_i:47 -val_i:48 -val_i:52 -val_i:53 -val_i:54 -val_i:55 -val_i:57 -val_i:58 -val_i:61 -val_i:62 -val_i:63 -val_i:64 -val_i:65 -val_i:66 -val_i:67 -val_i:71 -val_i:72 -val_i:73 -val_i:74 -val_i:75 -val_i:78 -val_i:80 -val_i:81 -val_i:82 -val_i:83 -val_i:84 -val_i:85 -val_i:86 -val_i:87 -val_i:88 -val_i:91 -val_i:93 -val_i:94 -val_i:96 -val_i:97, fq, {!}val_s:{00000 TO 00085} AND val_s:[00001 TO 00084], fq, {!cache=false cost=176} -val_i:2 -val_i:6 -val_i:8 -val_i:10 -val_i:13 -val_i:14 -val_i:16 -val_i:24 -val_i:26 -val_i:31 -val_i:33 -val_i:42 -val_i:45 -val_i:46 -val_i:47 -val_i:48 -val_i:49 -val_i:52 -val_i:54 -val_i:55 -val_i:56 -val_i:58 -val_i:64 -val_i:65 -val_i:68 -val_i:71 -val_i:72 -val_i:74 -val_i:77 -val_i:79 -val_i:80 -val_i:81 -val_i:83 -val_i:85 -val_i:86 -val_i:87 -val_i:88 -val_i:90 -val_i:92 -val_i:96 -val_i:97]
	at __randomizedtesting.SeedInfo.seed([48DC6952AF4DAC3E:57BFCA974A6AEC37]:0)
	at org.junit.Assert.fail(Assert.java:89)
	at org.apache.solr.search.TestFiltering.testRandomFiltering(TestFiltering.java:575)
	at java.base/jdk.internal.reflect.DirectMethodHandleAccessor.invoke(DirectMethodHandleAccessor.java:104)
	at java.base/java.lang.reflect.Method.invoke(Method.java:565)
	at com.carrotsearch.randomizedtesting.RandomizedRunner.invoke(RandomizedRunner.java:1763)
	at com.carrotsearch.randomizedtesting.RandomizedRunner$8.evaluate(RandomizedRunner.java:946)
	at com.carrotsearch.randomizedtesting.RandomizedRunner$9.evaluate(RandomizedRunner.java:982)
	at com.carrotsearch.randomizedtesting.RandomizedRunner$10.evaluate(RandomizedRunner.java:996)
	at com.carrotsearch.randomizedtesting.rules.SystemPropertiesRestoreRule$1.evaluate(SystemPropertiesRestoreRule.java:80)
	at org.junit.rules.RunRules.evaluate(RunRules.java:20)
	at org.apache.lucene.tests.util.TestRuleSetupTeardownChained$1.evaluate(TestRuleSetupTeardownChained.java:48)
	at org.apache.lucene.tests.util.AbstractBeforeAfterRule$1.evaluate(AbstractBeforeAfterRule.java:43)
	at org.apache.lucene.tests.util.TestRuleThreadAndTestName$1.evaluate(TestRuleThreadAndTestName.java:45)
	at org.apache.lucene.tests.util.TestRuleIgnoreAfterMaxFailures$1.evaluate(TestRuleIgnoreAfterMaxFailures.java:60)
	at org.apache.lucene.tests.util.TestRuleMarkFailure$1.evaluate(TestRuleMarkFailure.java:44)
	at org.junit.rules.RunRules.evaluate(RunRules.java:20)
	at com.carrotsearch.randomizedtesting.rules.StatementAdapter.evaluate(StatementAdapter.java:36)
	at com.carrotsearch.randomizedtesting.ThreadLeakControl$StatementRunner.run(ThreadLeakControl.java:390)
	at com.carrotsearch.randomizedtesting.ThreadLeakControl.forkTimeoutingTask(ThreadLeakControl.java:843)
	at com.carrotsearch.randomizedtesting.ThreadLeakControl$3.evaluate(ThreadLeakControl.java:490)
	at com.carrotsearch.randomizedtesting.RandomizedRunner.runSingleTest(RandomizedRunner.java:955)
	at com.carrotsearch.randomizedtesting.RandomizedRunner$5.evaluate(RandomizedRunner.java:840)
	at com.carrotsearch.randomizedtesting.RandomizedRunner$6.evaluate(RandomizedRunner.java:891)
	at com.carrotsearch.randomizedtesting.RandomizedRunner$7.evaluate(RandomizedRunner.java:902)
	at com.carrotsearch.randomizedtesting.rules.StatementAdapter.evaluate(StatementAdapter.java:36)
	at com.carrotsearch.randomizedtesting.rules.StatementAdapter.evaluate(StatementAdapter.java:36)
	at org.apache.lucene.tests.util.AbstractBeforeAfterRule$1.evaluate(AbstractBeforeAfterRule.java:43)
	at com.carrotsearch.randomizedtesting.rules.SystemPropertiesRestoreRule$1.evaluate(SystemPropertiesRestoreRule.java:80)
	at org.junit.rules.RunRules.evaluate(RunRules.java:20)
	at org.apache.lucene.tests.util.AbstractBeforeAfterRule$1.evaluate(AbstractBeforeAfterRule.java:43)
	at com.carrotsearch.randomizedtesting.rules.StatementAdapter.evaluate(StatementAdapter.java:36)
	at org.apache.lucene.tests.util.TestRuleStoreClassName$1.evaluate(TestRuleStoreClassName.java:38)
	at com.carrotsearch.randomizedtesting.rules.NoShadowingOrOverridesOnMethodsRule$1.evaluate(NoShadowingOrOverridesOnMethodsRule.java:40)
	at com.carrotsearch.randomizedtesting.rules.NoShadowingOrOverridesOnMethodsRule$1.evaluate(NoShadowingOrOverridesOnMethodsRule.java:40)
	at com.carrotsearch.randomizedtesting.rules.StatementAdapter.evaluate(StatementAdapter.java:36)
	at com.carrotsearch.randomizedtesting.rules.StatementAdapter.evaluate(StatementAdapter.java:36)
	at org.apache.lucene.tests.util.TestRuleAssertionsRequired$1.evaluate(TestRuleAssertionsRequired.java:53)
	at org.apache.lucene.tests.util.AbstractBeforeAfterRule$1.evaluate(AbstractBeforeAfterRule.java:43)
	at org.apache.lucene.tests.util.TestRuleMarkFailure$1.evaluate(TestRuleMarkFailure.java:44)
	at org.apache.lucene.tests.util.TestRuleIgnoreAfterMaxFailures$1.evaluate(TestRuleIgnoreAfterMaxFailures.java:60)
	at org.apache.lucene.tests.util.TestRuleIgnoreTestSuites$1.evaluate(TestRuleIgnoreTestSuites.java:47)
	at org.junit.rules.RunRules.evaluate(RunRules.java:20)
	at com.carrotsearch.randomizedtesting.rules.StatementAdapter.evaluate(StatementAdapter.java:36)
	at com.carrotsearch.randomizedtesting.ThreadLeakControl$StatementRunner.run(ThreadLeakControl.java:390)
	at com.carrotsearch.randomizedtesting.ThreadLeakControl.lambda$forkTimeoutingTask$0(ThreadLeakControl.java:850)
	at java.base/java.lang.Thread.run(Thread.java:1474)