You are viewing a plain text version of this content. The canonical link for it is here.
Posted to builds@beam.apache.org by Apache Jenkins Server <je...@builds.apache.org> on 2021/07/01 12:18:43 UTC

Build failed in Jenkins: beam_PostCommit_Java_ValidatesRunner_Flink_Java11 #1765

See <https://ci-beam.apache.org/job/beam_PostCommit_Java_ValidatesRunner_Flink_Java11/1765/display/redirect>

Changes:


------------------------------------------
[...truncated 2.02 MB...]
	at org.gradle.internal.event.AbstractBroadcastDispatch.dispatch(AbstractBroadcastDispatch.java:43)
	at org.gradle.internal.event.BroadcastDispatch$SingletonDispatch.dispatch(BroadcastDispatch.java:245)
	at org.gradle.internal.event.BroadcastDispatch$SingletonDispatch.dispatch(BroadcastDispatch.java:157)
	at org.gradle.internal.event.AbstractBroadcastDispatch.dispatch(AbstractBroadcastDispatch.java:61)
	at org.gradle.internal.event.BroadcastDispatch$CompositeDispatch.dispatch(BroadcastDispatch.java:346)
	at org.gradle.internal.event.BroadcastDispatch$CompositeDispatch.dispatch(BroadcastDispatch.java:249)
	at org.gradle.internal.event.ListenerBroadcast.dispatch(ListenerBroadcast.java:141)
	at org.gradle.internal.event.ListenerBroadcast.dispatch(ListenerBroadcast.java:37)
	at org.gradle.internal.dispatch.ProxyDispatchAdapter$DispatchingInvocationHandler.invoke(ProxyDispatchAdapter.java:94)
	at com.sun.proxy.$Proxy119.onOutput(Unknown Source)
	at org.gradle.api.internal.tasks.testing.results.TestListenerAdapter.output(TestListenerAdapter.java:56)
	at jdk.internal.reflect.GeneratedMethodAccessor753.invoke(Unknown Source)
	at jdk.internal.reflect.DelegatingMethodAccessorImpl.invoke(DelegatingMethodAccessorImpl.java:43)
	at java.lang.reflect.Method.invoke(Method.java:566)
	at org.gradle.internal.dispatch.ReflectionDispatch.dispatch(ReflectionDispatch.java:36)
	at org.gradle.internal.dispatch.ReflectionDispatch.dispatch(ReflectionDispatch.java:24)
	at org.gradle.internal.event.AbstractBroadcastDispatch.dispatch(AbstractBroadcastDispatch.java:43)
	at org.gradle.internal.event.BroadcastDispatch$SingletonDispatch.dispatch(BroadcastDispatch.java:245)
	at org.gradle.internal.event.BroadcastDispatch$SingletonDispatch.dispatch(BroadcastDispatch.java:157)
	at org.gradle.internal.event.AbstractBroadcastDispatch.dispatch(AbstractBroadcastDispatch.java:61)
	at org.gradle.internal.event.BroadcastDispatch$CompositeDispatch.dispatch(BroadcastDispatch.java:346)
	at org.gradle.internal.event.BroadcastDispatch$CompositeDispatch.dispatch(BroadcastDispatch.java:249)
	at org.gradle.internal.event.ListenerBroadcast.dispatch(ListenerBroadcast.java:141)
	at org.gradle.internal.event.ListenerBroadcast.dispatch(ListenerBroadcast.java:37)
	at org.gradle.internal.dispatch.ProxyDispatchAdapter$DispatchingInvocationHandler.invoke(ProxyDispatchAdapter.java:94)
	at com.sun.proxy.$Proxy120.output(Unknown Source)
	at org.gradle.api.internal.tasks.testing.results.StateTrackingTestResultProcessor.output(StateTrackingTestResultProcessor.java:112)
	at org.gradle.api.internal.tasks.testing.results.AttachParentTestResultProcessor.output(AttachParentTestResultProcessor.java:48)
	at jdk.internal.reflect.GeneratedMethodAccessor756.invoke(Unknown Source)
	at jdk.internal.reflect.DelegatingMethodAccessorImpl.invoke(DelegatingMethodAccessorImpl.java:43)
	at java.lang.reflect.Method.invoke(Method.java:566)
	at org.gradle.internal.dispatch.ReflectionDispatch.dispatch(ReflectionDispatch.java:36)
	at org.gradle.internal.dispatch.ReflectionDispatch.dispatch(ReflectionDispatch.java:24)
	at org.gradle.internal.dispatch.FailureHandlingDispatch.dispatch(FailureHandlingDispatch.java:30)
	at org.gradle.internal.dispatch.AsyncDispatch.dispatchMessages(AsyncDispatch.java:87)
	at org.gradle.internal.dispatch.AsyncDispatch.access$000(AsyncDispatch.java:36)
	at org.gradle.internal.dispatch.AsyncDispatch$1.run(AsyncDispatch.java:71)
	at org.gradle.internal.concurrent.InterruptibleRunnable.run(InterruptibleRunnable.java:42)
	at org.gradle.internal.operations.CurrentBuildOperationPreservingRunnable.run(CurrentBuildOperationPreservingRunnable.java:42)
	at org.gradle.internal.concurrent.ExecutorPolicy$CatchAndRecordFailures.onExecute(ExecutorPolicy.java:64)
	at org.gradle.internal.concurrent.ManagedExecutorImpl$1.run(ManagedExecutorImpl.java:48)
	at java.util.concurrent.ThreadPoolExecutor.runWorker(ThreadPoolExecutor.java:1128)
	at java.util.concurrent.ThreadPoolExecutor$Worker.run(ThreadPoolExecutor.java:628)
	at org.gradle.internal.concurrent.ThreadFactoryImpl$ManagedThreadRunnable.run(ThreadFactoryImpl.java:56)
	at java.lang.Thread.run(Thread.java:834)
Caused by: java.io.IOException: No space left on device
	at java.io.FileOutputStream.writeBytes(Native Method)
	at java.io.FileOutputStream.write(FileOutputStream.java:354)
	at com.esotericsoftware.kryo.io.Output.flush(Output.java:163)
	... 55 more

org.apache.beam.sdk.transforms.CombineTest$WindowingTests > testFixedWindowsCombineWithContext FAILED
    org.apache.beam.sdk.Pipeline$PipelineExecutionException at CombineTest.java:1102
        Caused by: java.util.concurrent.TimeoutException at PhysicalSlotRequestBulkCheckerImpl.java:86

275 tests completed, 8 failed, 2 skipped

> Task :runners:flink:1.13:validatesRunnerBatch FAILED

> Task :runners:flink:1.13:validatesRunnerStreamingCheckpointing
OpenJDK 64-Bit Server VM warning: Insufficient space for shared memory file:
   2711
Try using the -Djava.io.tmpdir= option to select an alternate temp location.

OpenJDK 64-Bit Server VM warning: Insufficient space for shared memory file:
   2713
Try using the -Djava.io.tmpdir= option to select an alternate temp location.

Error: Could not find or load main class worker.org.gradle.process.internal.worker.GradleWorkerMain
Caused by: java.lang.ClassNotFoundException: worker.org.gradle.process.internal.worker.GradleWorkerMain
Error: Could not find or load main class worker.org.gradle.process.internal.worker.GradleWorkerMain
Caused by: java.lang.ClassNotFoundException: worker.org.gradle.process.internal.worker.GradleWorkerMain
OpenJDK 64-Bit Server VM warning: Insufficient space for shared memory file:
   2770
Try using the -Djava.io.tmpdir= option to select an alternate temp location.

OpenJDK 64-Bit Server VM warning: Insufficient space for shared memory file:
   2773
Try using the -Djava.io.tmpdir= option to select an alternate temp location.

Error: Could not find or load main class worker.org.gradle.process.internal.worker.GradleWorkerMain
Caused by: java.lang.ClassNotFoundException: worker.org.gradle.process.internal.worker.GradleWorkerMain
Error: Could not find or load main class worker.org.gradle.process.internal.worker.GradleWorkerMain
Caused by: java.lang.ClassNotFoundException: worker.org.gradle.process.internal.worker.GradleWorkerMain
Process 'Gradle Test Executor 5' finished with non-zero exit value 1
org.gradle.process.internal.ExecException: Process 'Gradle Test Executor 5' finished with non-zero exit value 1
	at org.gradle.process.internal.DefaultExecHandle$ExecResultImpl.assertNormalExitValue(DefaultExecHandle.java:414)
	at org.gradle.process.internal.worker.DefaultWorkerProcess.onProcessStop(DefaultWorkerProcess.java:141)
	at org.gradle.process.internal.worker.DefaultWorkerProcess.access$000(DefaultWorkerProcess.java:42)
	at org.gradle.process.internal.worker.DefaultWorkerProcess$1.executionFinished(DefaultWorkerProcess.java:94)
	at jdk.internal.reflect.NativeMethodAccessorImpl.invoke0(Native Method)
	at jdk.internal.reflect.NativeMethodAccessorImpl.invoke(NativeMethodAccessorImpl.java:62)
	at jdk.internal.reflect.DelegatingMethodAccessorImpl.invoke(DelegatingMethodAccessorImpl.java:43)
	at java.lang.reflect.Method.invoke(Method.java:566)
	at org.gradle.internal.dispatch.ReflectionDispatch.dispatch(ReflectionDispatch.java:36)
	at org.gradle.internal.dispatch.ReflectionDispatch.dispatch(ReflectionDispatch.java:24)
	at org.gradle.internal.event.AbstractBroadcastDispatch.dispatch(AbstractBroadcastDispatch.java:43)
	at org.gradle.internal.event.BroadcastDispatch$SingletonDispatch.dispatch(BroadcastDispatch.java:245)
	at org.gradle.internal.event.BroadcastDispatch$SingletonDispatch.dispatch(BroadcastDispatch.java:157)
	at org.gradle.internal.event.ListenerBroadcast.dispatch(ListenerBroadcast.java:141)
	at org.gradle.internal.event.ListenerBroadcast.dispatch(ListenerBroadcast.java:37)
	at org.gradle.internal.dispatch.ProxyDispatchAdapter$DispatchingInvocationHandler.invoke(ProxyDispatchAdapter.java:94)
	at com.sun.proxy.$Proxy123.executionFinished(Unknown Source)
	at org.gradle.process.internal.DefaultExecHandle.setEndStateInfo(DefaultExecHandle.java:221)
	at org.gradle.process.internal.DefaultExecHandle.finished(DefaultExecHandle.java:354)
	at org.gradle.process.internal.ExecHandleRunner.completed(ExecHandleRunner.java:110)
	at org.gradle.process.internal.ExecHandleRunner.run(ExecHandleRunner.java:84)
	at org.gradle.internal.operations.CurrentBuildOperationPreservingRunnable.run(CurrentBuildOperationPreservingRunnable.java:42)
	at org.gradle.internal.concurrent.ExecutorPolicy$CatchAndRecordFailures.onExecute(ExecutorPolicy.java:64)
	at org.gradle.internal.concurrent.ManagedExecutorImpl$1.run(ManagedExecutorImpl.java:48)
	at java.util.concurrent.ThreadPoolExecutor.runWorker(ThreadPoolExecutor.java:1128)
	at java.util.concurrent.ThreadPoolExecutor$Worker.run(ThreadPoolExecutor.java:628)
	at org.gradle.internal.concurrent.ThreadFactoryImpl$ManagedThreadRunnable.run(ThreadFactoryImpl.java:56)
	at java.lang.Thread.run(Thread.java:834)
Process 'Gradle Test Executor 6' finished with non-zero exit value 1
org.gradle.process.internal.ExecException: Process 'Gradle Test Executor 6' finished with non-zero exit value 1
	at org.gradle.process.internal.DefaultExecHandle$ExecResultImpl.assertNormalExitValue(DefaultExecHandle.java:414)
	at org.gradle.process.internal.worker.DefaultWorkerProcess.onProcessStop(DefaultWorkerProcess.java:141)
	at org.gradle.process.internal.worker.DefaultWorkerProcess.access$000(DefaultWorkerProcess.java:42)
	at org.gradle.process.internal.worker.DefaultWorkerProcess$1.executionFinished(DefaultWorkerProcess.java:94)
	at jdk.internal.reflect.NativeMethodAccessorImpl.invoke0(Native Method)
	at jdk.internal.reflect.NativeMethodAccessorImpl.invoke(NativeMethodAccessorImpl.java:62)
	at jdk.internal.reflect.DelegatingMethodAccessorImpl.invoke(DelegatingMethodAccessorImpl.java:43)
	at java.lang.reflect.Method.invoke(Method.java:566)
	at org.gradle.internal.dispatch.ReflectionDispatch.dispatch(ReflectionDispatch.java:36)
	at org.gradle.internal.dispatch.ReflectionDispatch.dispatch(ReflectionDispatch.java:24)
	at org.gradle.internal.event.AbstractBroadcastDispatch.dispatch(AbstractBroadcastDispatch.java:43)
	at org.gradle.internal.event.BroadcastDispatch$SingletonDispatch.dispatch(BroadcastDispatch.java:245)
	at org.gradle.internal.event.BroadcastDispatch$SingletonDispatch.dispatch(BroadcastDispatch.java:157)
	at org.gradle.internal.event.ListenerBroadcast.dispatch(ListenerBroadcast.java:141)
	at org.gradle.internal.event.ListenerBroadcast.dispatch(ListenerBroadcast.java:37)
	at org.gradle.internal.dispatch.ProxyDispatchAdapter$DispatchingInvocationHandler.invoke(ProxyDispatchAdapter.java:94)
	at com.sun.proxy.$Proxy123.executionFinished(Unknown Source)
	at org.gradle.process.internal.DefaultExecHandle.setEndStateInfo(DefaultExecHandle.java:221)
	at org.gradle.process.internal.DefaultExecHandle.finished(DefaultExecHandle.java:354)
	at org.gradle.process.internal.ExecHandleRunner.completed(ExecHandleRunner.java:110)
	at org.gradle.process.internal.ExecHandleRunner.run(ExecHandleRunner.java:84)
	at org.gradle.internal.operations.CurrentBuildOperationPreservingRunnable.run(CurrentBuildOperationPreservingRunnable.java:42)
	at org.gradle.internal.concurrent.ExecutorPolicy$CatchAndRecordFailures.onExecute(ExecutorPolicy.java:64)
	at org.gradle.internal.concurrent.ManagedExecutorImpl$1.run(ManagedExecutorImpl.java:48)
	at java.util.concurrent.ThreadPoolExecutor.runWorker(ThreadPoolExecutor.java:1128)
	at java.util.concurrent.ThreadPoolExecutor$Worker.run(ThreadPoolExecutor.java:628)
	at org.gradle.internal.concurrent.ThreadFactoryImpl$ManagedThreadRunnable.run(ThreadFactoryImpl.java:56)
	at java.lang.Thread.run(Thread.java:834)
WARNING: An illegal reflective access operation has occurred
WARNING: Illegal reflective access by org.apache.flink.api.java.ClosureCleaner (file:/home/jenkins/.gradle/caches/modules-2/files-2.1/org.apache.flink/flink-core/1.13.1/3f3ef42acd70591992d3786e33972e0d16b404b0/flink-core-1.13.1.jar) to field java.lang.String.value
WARNING: Please consider reporting this to the maintainers of org.apache.flink.api.java.ClosureCleaner
WARNING: Use --illegal-access=warn to enable warnings of further illegal reflective access operations
WARNING: All illegal access operations will be denied in a future release
Could not stop org.gradle.internal.actor.internal.DefaultActorFactory$NonBlockingActor@44fa178b.
org.gradle.internal.dispatch.DispatchException: Could not dispatch message [MethodInvocation method: processTestClass(DefaultTestClassRunInfo(org.apache.beam.sdk.state.StateContextsTest))].
	at org.gradle.internal.dispatch.ExceptionTrackingFailureHandler.dispatchFailed(ExceptionTrackingFailureHandler.java:35)
	at org.gradle.internal.dispatch.FailureHandlingDispatch.dispatch(FailureHandlingDispatch.java:32)
	at org.gradle.internal.dispatch.AsyncDispatch.dispatchMessages(AsyncDispatch.java:87)
	at org.gradle.internal.dispatch.AsyncDispatch.access$000(AsyncDispatch.java:36)
	at org.gradle.internal.dispatch.AsyncDispatch$1.run(AsyncDispatch.java:71)
	at org.gradle.internal.concurrent.InterruptibleRunnable.run(InterruptibleRunnable.java:42)
	at org.gradle.internal.operations.CurrentBuildOperationPreservingRunnable.run(CurrentBuildOperationPreservingRunnable.java:42)
	at org.gradle.internal.concurrent.ExecutorPolicy$CatchAndRecordFailures.onExecute(ExecutorPolicy.java:64)
	at org.gradle.internal.concurrent.ManagedExecutorImpl$1.run(ManagedExecutorImpl.java:48)
	at java.util.concurrent.ThreadPoolExecutor.runWorker(ThreadPoolExecutor.java:1128)
	at java.util.concurrent.ThreadPoolExecutor$Worker.run(ThreadPoolExecutor.java:628)
	at org.gradle.internal.concurrent.ThreadFactoryImpl$ManagedThreadRunnable.run(ThreadFactoryImpl.java:56)
	at java.lang.Thread.run(Thread.java:834)
Caused by: org.gradle.process.internal.ExecException: Process 'Gradle Test Executor 4' finished with non-zero exit value 1
	at org.gradle.process.internal.DefaultExecHandle$ExecResultImpl.assertNormalExitValue(DefaultExecHandle.java:414)
	at org.gradle.process.internal.worker.DefaultWorkerProcess.onProcessStop(DefaultWorkerProcess.java:141)
	at org.gradle.process.internal.worker.DefaultWorkerProcess.access$000(DefaultWorkerProcess.java:42)
	at org.gradle.process.internal.worker.DefaultWorkerProcess$1.executionFinished(DefaultWorkerProcess.java:94)
	at jdk.internal.reflect.NativeMethodAccessorImpl.invoke0(Native Method)
	at jdk.internal.reflect.NativeMethodAccessorImpl.invoke(NativeMethodAccessorImpl.java:62)
	at jdk.internal.reflect.DelegatingMethodAccessorImpl.invoke(DelegatingMethodAccessorImpl.java:43)
	at java.lang.reflect.Method.invoke(Method.java:566)
	at org.gradle.internal.dispatch.ReflectionDispatch.dispatch(ReflectionDispatch.java:36)
	at org.gradle.internal.dispatch.ReflectionDispatch.dispatch(ReflectionDispatch.java:24)
	at org.gradle.internal.event.AbstractBroadcastDispatch.dispatch(AbstractBroadcastDispatch.java:43)
	at org.gradle.internal.event.BroadcastDispatch$SingletonDispatch.dispatch(BroadcastDispatch.java:245)
	at org.gradle.internal.event.BroadcastDispatch$SingletonDispatch.dispatch(BroadcastDispatch.java:157)
	at org.gradle.internal.event.ListenerBroadcast.dispatch(ListenerBroadcast.java:141)
	at org.gradle.internal.event.ListenerBroadcast.dispatch(ListenerBroadcast.java:37)
	at org.gradle.internal.dispatch.ProxyDispatchAdapter$DispatchingInvocationHandler.invoke(ProxyDispatchAdapter.java:94)
	at com.sun.proxy.$Proxy123.executionFinished(Unknown Source)
	at org.gradle.process.internal.DefaultExecHandle.setEndStateInfo(DefaultExecHandle.java:221)
	at org.gradle.process.internal.DefaultExecHandle.finished(DefaultExecHandle.java:354)
	at org.gradle.process.internal.ExecHandleRunner.completed(ExecHandleRunner.java:110)
	at org.gradle.process.internal.ExecHandleRunner.run(ExecHandleRunner.java:84)
	... 7 more

> Task :runners:flink:1.13:validatesRunnerStreamingCheckpointing FAILED

> Task :runners:flink:1.13:validatesRunnerStreaming
WARNING: An illegal reflective access operation has occurred
WARNING: Illegal reflective access by org.apache.flink.api.java.ClosureCleaner (file:/home/jenkins/.gradle/caches/modules-2/files-2.1/org.apache.flink/flink-core/1.13.1/3f3ef42acd70591992d3786e33972e0d16b404b0/flink-core-1.13.1.jar) to field java.lang.String.value
WARNING: Please consider reporting this to the maintainers of org.apache.flink.api.java.ClosureCleaner
WARNING: Use --illegal-access=warn to enable warnings of further illegal reflective access operations
WARNING: All illegal access operations will be denied in a future release
WARNING: An illegal reflective access operation has occurred
WARNING: Illegal reflective access by org.apache.flink.api.java.ClosureCleaner (file:/home/jenkins/.gradle/caches/modules-2/files-2.1/org.apache.flink/flink-core/1.13.1/3f3ef42acd70591992d3786e33972e0d16b404b0/flink-core-1.13.1.jar) to field java.lang.String.value
WARNING: Please consider reporting this to the maintainers of org.apache.flink.api.java.ClosureCleaner
WARNING: Use --illegal-access=warn to enable warnings of further illegal reflective access operations
WARNING: All illegal access operations will be denied in a future release

FAILURE: Build completed with 2 failures.

1: Task failed with an exception.
-----------
* What went wrong:
Execution failed for task ':runners:flink:1.13:validatesRunnerBatch'.
> java.io.IOException: No space left on device

* Try:
Run with --stacktrace option to get the stack trace. Run with --info or --debug option to get more log output. Run with --scan to get full insights.
==============================================================================

2: Task failed with an exception.
-----------
* What went wrong:
Execution failed for task ':runners:flink:1.13:validatesRunnerStreamingCheckpointing'.
> Process 'Gradle Test Executor 3' finished with non-zero exit value 1

* Try:
Run with --stacktrace option to get the stack trace. Run with --info or --debug option to get more log output. Run with --scan to get full insights.
==============================================================================

* Get more help at https://help.gradle.org

Deprecated Gradle features were used in this build, making it incompatible with Gradle 7.0.
Use '--warning-mode all' to show the individual deprecation warnings.
See https://docs.gradle.org/6.8.3/userguide/command_line_interface.html#sec:command_line_warnings

BUILD FAILED in 17m 40s
3 actionable tasks: 3 executed

A build scan cannot be produced as an error occurred spooling the build data.
Please report this problem via https://gradle.com/help/plugin and include the following via copy/paste:

----------
Gradle version: 6.8.3
Plugin version: 3.4.1

java.lang.IllegalStateException: Could not close the event spooler due to previous errors.
	at com.gradle.scan.plugin.internal.f.c.c.a(SourceFile:128)
	at com.gradle.scan.plugin.internal.q.a$a.a(SourceFile:31)
	at com.gradle.scan.plugin.internal.q.a$a.a(SourceFile:20)
	at com.gradle.scan.plugin.internal.q.a.c(SourceFile:67)
----------

Build step 'Invoke Gradle script' changed build result to FAILURE
Build step 'Invoke Gradle script' marked build as failure

---------------------------------------------------------------------
To unsubscribe, e-mail: builds-unsubscribe@beam.apache.org
For additional commands, e-mail: builds-help@beam.apache.org


Jenkins build is back to normal : beam_PostCommit_Java_ValidatesRunner_Flink_Java11 #1768

Posted by Apache Jenkins Server <je...@builds.apache.org>.
See <https://ci-beam.apache.org/job/beam_PostCommit_Java_ValidatesRunner_Flink_Java11/1768/display/redirect?page=changes>


---------------------------------------------------------------------
To unsubscribe, e-mail: builds-unsubscribe@beam.apache.org
For additional commands, e-mail: builds-help@beam.apache.org


Build failed in Jenkins: beam_PostCommit_Java_ValidatesRunner_Flink_Java11 #1767

Posted by Apache Jenkins Server <je...@builds.apache.org>.
See <https://ci-beam.apache.org/job/beam_PostCommit_Java_ValidatesRunner_Flink_Java11/1767/display/redirect?page=changes>

Changes:

[noreply] Update _index.md

[editgym] Add support for BigQuery data types aliases to BigQueryAvroUtils

[noreply] [BEAM-10955] Fix Flink Java Runner test flake: Could not find Flink job

[noreply] [BEAM-12548] Add examples of Equals and EqualsList to equals_test.go

[Luke Cwik] [BEAM-12422] Remove all optional logging libraries as Netty attempts to

[noreply] [BEAM-12076] Adds a Kafka external read transform for reading with


------------------------------------------
[...truncated 17.63 KB...]
> Task :sdks:java:core:processResources
> Task :sdks:java:core:generateTestAvroProtocol NO-SOURCE
> Task :sdks:java:core:generateTestAvroJava
> Task :sdks:java:core:generateTestGrammarSource NO-SOURCE
> Task :sdks:java:core:processTestResources
> Task :model:pipeline:extractIncludeProto
> Task :model:pipeline:extractProto
> Task :model:pipeline:generateProto FROM-CACHE
> Task :model:pipeline:compileJava FROM-CACHE
> Task :model:pipeline:processResources
> Task :model:pipeline:classes
> Task :model:pipeline:jar
> Task :model:fn-execution:extractIncludeProto
> Task :sdks:java:build-tools:compileJava
> Task :model:job-management:extractIncludeProto
> Task :sdks:java:build-tools:processResources
> Task :sdks:java:build-tools:classes
> Task :sdks:java:build-tools:jar
> Task :model:fn-execution:generateProto FROM-CACHE
> Task :model:job-management:generateProto FROM-CACHE
> Task :model:pipeline:shadowJar
> Task :model:job-management:compileJava
> Task :model:job-management:classes
> Task :model:job-management:shadowJar
> Task :model:fn-execution:compileJava
> Task :model:fn-execution:classes
> Task :model:fn-execution:shadowJar FROM-CACHE
> Task :sdks:java:core:compileJava
Note: Some input files use or override a deprecated API.
Note: Recompile with -Xlint:deprecation for details.
Note: Some input files use unchecked or unsafe operations.
Note: Recompile with -Xlint:unchecked for details.

> Task :sdks:java:core:classes
> Task :sdks:java:core:shadowJar
> Task :sdks:java:extensions:protobuf:extractIncludeProto
> Task :sdks:java:extensions:protobuf:generateProto NO-SOURCE
> Task :sdks:java:fn-execution:compileJava
> Task :sdks:java:core:compileTestJava
> Task :sdks:java:extensions:protobuf:compileJava

> Task :sdks:java:fn-execution:compileJava
Note: Some input files use or override a deprecated API.
Note: Recompile with -Xlint:deprecation for details.
Note: Some input files use unchecked or unsafe operations.
Note: Recompile with -Xlint:unchecked for details.

> Task :sdks:java:fn-execution:classes
> Task :sdks:java:fn-execution:jar

> Task :sdks:java:extensions:protobuf:compileJava
Note: Some input files use or override a deprecated API.
Note: Recompile with -Xlint:deprecation for details.
Note: Some input files use unchecked or unsafe operations.
Note: Recompile with -Xlint:unchecked for details.

> Task :sdks:java:extensions:protobuf:classes
> Task :sdks:java:extensions:protobuf:jar
> Task :runners:core-construction-java:compileJava

> Task :sdks:java:core:compileTestJava
Note: Some input files use or override a deprecated API.
Note: Recompile with -Xlint:deprecation for details.
Note: Some input files use unchecked or unsafe operations.
Note: Recompile with -Xlint:unchecked for details.

> Task :sdks:java:core:testClasses
> Task :sdks:java:core:shadowTestJar FROM-CACHE

> Task :runners:core-construction-java:compileJava
Note: Some input files use or override a deprecated API.
Note: Recompile with -Xlint:deprecation for details.
Note: Some input files use unchecked or unsafe operations.
Note: Recompile with -Xlint:unchecked for details.

> Task :runners:core-construction-java:classes
> Task :runners:core-construction-java:jar
> Task :runners:core-java:compileJava
Note: Some input files use or override a deprecated API.
Note: Recompile with -Xlint:deprecation for details.
Note: Some input files use unchecked or unsafe operations.
Note: Recompile with -Xlint:unchecked for details.

> Task :runners:core-java:classes
> Task :runners:core-java:jar

> Task :runners:core-java:compileTestJava
Note: Some input files use or override a deprecated API.
Note: Recompile with -Xlint:deprecation for details.
Note: Some input files use unchecked or unsafe operations.
Note: Recompile with -Xlint:unchecked for details.

> Task :runners:core-java:testClasses
> Task :runners:core-java:testJar

> Task :sdks:java:extensions:google-cloud-platform-core:compileJava
Note: Some input files use or override a deprecated API.
Note: Recompile with -Xlint:deprecation for details.

> Task :sdks:java:extensions:google-cloud-platform-core:classes
> Task :sdks:java:extensions:google-cloud-platform-core:jar
> Task :sdks:java:harness:compileJava
Note: Some input files use or override a deprecated API.
Note: Recompile with -Xlint:deprecation for details.
Note: Some input files use unchecked or unsafe operations.
Note: Recompile with -Xlint:unchecked for details.

> Task :sdks:java:harness:classes
> Task :sdks:java:harness:jar
> Task :sdks:java:harness:shadowJar
> Task :runners:java-fn-execution:compileJava
Note: Some input files use or override a deprecated API.
Note: Recompile with -Xlint:deprecation for details.
Note: Some input files use unchecked or unsafe operations.
Note: Recompile with -Xlint:unchecked for details.

> Task :runners:java-fn-execution:classes
> Task :runners:java-fn-execution:jar

> Task :sdks:java:expansion-service:compileJava
Note: <https://ci-beam.apache.org/job/beam_PostCommit_Java_ValidatesRunner_Flink_Java11/ws/src/sdks/java/expansion-service/src/main/java/org/apache/beam/sdk/expansion/service/ExpansionService.java> uses unchecked or unsafe operations.
Note: Recompile with -Xlint:unchecked for details.

> Task :sdks:java:expansion-service:classes
> Task :sdks:java:expansion-service:jar

> Task :runners:java-job-service:compileJava
Note: <https://ci-beam.apache.org/job/beam_PostCommit_Java_ValidatesRunner_Flink_Java11/ws/src/runners/java-job-service/src/main/java/org/apache/beam/runners/jobsubmission/PortablePipelineJarCreator.java> uses unchecked or unsafe operations.
Note: Recompile with -Xlint:unchecked for details.

> Task :runners:java-job-service:classes
> Task :runners:java-job-service:jar
> Task :sdks:java:io:google-cloud-platform:compileJava
> Task :runners:flink:1.13:compileJava
Note: Some input files use or override a deprecated API.
Note: Recompile with -Xlint:deprecation for details.
Note: Some input files use unchecked or unsafe operations.
Note: Recompile with -Xlint:unchecked for details.

> Task :runners:flink:1.13:classes
> Task :runners:flink:1.13:jar

> Task :sdks:java:io:google-cloud-platform:compileJava
Note: Some input files use or override a deprecated API.
Note: Recompile with -Xlint:deprecation for details.
Note: Some input files use unchecked or unsafe operations.
Note: Recompile with -Xlint:unchecked for details.

> Task :sdks:java:io:google-cloud-platform:classes
> Task :sdks:java:io:google-cloud-platform:jar

> Task :runners:flink:1.13:compileTestJava
Note: Some input files use or override a deprecated API.
Note: Recompile with -Xlint:deprecation for details.
Note: Some input files use unchecked or unsafe operations.
Note: Recompile with -Xlint:unchecked for details.

> Task :runners:flink:1.13:testClasses
> Task :runners:flink:1.13:testJar

Deprecated Gradle features were used in this build, making it incompatible with Gradle 7.0.
Use '--warning-mode all' to show the individual deprecation warnings.
See https://docs.gradle.org/6.8.3/userguide/command_line_interface.html#sec:command_line_warnings

BUILD SUCCESSFUL in 14m 51s
79 actionable tasks: 72 executed, 7 from cache

Publishing build scan...
https://gradle.com/s/pl7puuip7em3m

Build step 'Invoke Gradle script' changed build result to SUCCESS
[Gradle] - Launching build.
[src] $ <https://ci-beam.apache.org/job/beam_PostCommit_Java_ValidatesRunner_Flink_Java11/ws/src/gradlew> -x shadowJar -x shadowTestJar -x compileJava -x compileTestJava -x jar -x testJar -x classes -x testClasses -Dorg.gradle.java.home=/usr/lib/jvm/java-11-openjdk-amd64 --continue --max-workers=6 -Dorg.gradle.jvmargs=-Xms2g -Dorg.gradle.jvmargs=-Xmx4g -Dorg.gradle.vfs.watch=false -Pdocker-pull-licenses :runners:flink:1.13:validatesRunner
Starting a Gradle Daemon, 2 busy and 1 incompatible Daemons could not be reused, use --status for details
> Task :buildSrc:compileJava NO-SOURCE
> Task :buildSrc:compileGroovy FROM-CACHE
> Task :buildSrc:pluginDescriptors UP-TO-DATE
> Task :buildSrc:processResources UP-TO-DATE
> Task :buildSrc:classes UP-TO-DATE
> Task :buildSrc:jar
> Task :buildSrc:assemble
> Task :buildSrc:spotlessGroovy UP-TO-DATE
> Task :buildSrc:spotlessGroovyCheck UP-TO-DATE
> Task :buildSrc:spotlessGroovyGradle UP-TO-DATE
> Task :buildSrc:spotlessGroovyGradleCheck UP-TO-DATE
> Task :buildSrc:spotlessCheck UP-TO-DATE
> Task :buildSrc:pluginUnderTestMetadata
> Task :buildSrc:compileTestJava NO-SOURCE
> Task :buildSrc:compileTestGroovy NO-SOURCE
> Task :buildSrc:processTestResources NO-SOURCE
> Task :buildSrc:testClasses UP-TO-DATE
> Task :buildSrc:test NO-SOURCE
> Task :buildSrc:validatePlugins FROM-CACHE
> Task :buildSrc:check UP-TO-DATE
> Task :buildSrc:build
Configuration on demand is an incubating feature.
> Task :runners:flink:1.13:validatesRunnerBatch
> Task :runners:flink:1.13:validatesRunnerStreaming
> Task :runners:flink:1.13:validatesRunnerStreamingCheckpointing

> Task :runners:flink:1.13:validatesRunnerStreaming
WARNING: An illegal reflective access operation has occurred
WARNING: Illegal reflective access by org.apache.flink.api.java.ClosureCleaner (file:/home/jenkins/.gradle/caches/modules-2/files-2.1/org.apache.flink/flink-core/1.13.1/3f3ef42acd70591992d3786e33972e0d16b404b0/flink-core-1.13.1.jar) to field java.lang.String.value
WARNING: Please consider reporting this to the maintainers of org.apache.flink.api.java.ClosureCleaner
WARNING: Use --illegal-access=warn to enable warnings of further illegal reflective access operations
WARNING: All illegal access operations will be denied in a future release
WARNING: An illegal reflective access operation has occurred
WARNING: Illegal reflective access by org.apache.flink.api.java.ClosureCleaner (file:/home/jenkins/.gradle/caches/modules-2/files-2.1/org.apache.flink/flink-core/1.13.1/3f3ef42acd70591992d3786e33972e0d16b404b0/flink-core-1.13.1.jar) to field java.lang.String.value
WARNING: Please consider reporting this to the maintainers of org.apache.flink.api.java.ClosureCleaner
WARNING: Use --illegal-access=warn to enable warnings of further illegal reflective access operations
WARNING: All illegal access operations will be denied in a future release

org.apache.beam.sdk.transforms.ParDoLifecycleTest > testTeardownCalledAfterExceptionInProcessElementStateful FAILED
    java.lang.AssertionError at Assert.java:89

292 tests completed, 1 failed, 3 skipped

> Task :runners:flink:1.13:validatesRunnerStreaming FAILED

> Task :runners:flink:1.13:validatesRunnerStreamingCheckpointing
WARNING: An illegal reflective access operation has occurred
WARNING: Illegal reflective access by org.apache.flink.api.java.ClosureCleaner (file:/home/jenkins/.gradle/caches/modules-2/files-2.1/org.apache.flink/flink-core/1.13.1/3f3ef42acd70591992d3786e33972e0d16b404b0/flink-core-1.13.1.jar) to field java.lang.String.value
WARNING: Please consider reporting this to the maintainers of org.apache.flink.api.java.ClosureCleaner
WARNING: Use --illegal-access=warn to enable warnings of further illegal reflective access operations
WARNING: All illegal access operations will be denied in a future release

FAILURE: Build failed with an exception.

* What went wrong:
Execution failed for task ':runners:flink:1.13:validatesRunnerStreaming'.
> There were failing tests. See the report at: file://<https://ci-beam.apache.org/job/beam_PostCommit_Java_ValidatesRunner_Flink_Java11/ws/src/runners/flink/1.13/build/reports/tests/validatesRunnerStreaming/index.html>

* Try:
Run with --stacktrace option to get the stack trace. Run with --info or --debug option to get more log output. Run with --scan to get full insights.

* Get more help at https://help.gradle.org

Deprecated Gradle features were used in this build, making it incompatible with Gradle 7.0.
Use '--warning-mode all' to show the individual deprecation warnings.
See https://docs.gradle.org/6.8.3/userguide/command_line_interface.html#sec:command_line_warnings

BUILD FAILED in 20m 0s
3 actionable tasks: 3 executed

Publishing build scan...
https://gradle.com/s/gnddp7c47jbu2

Build step 'Invoke Gradle script' changed build result to FAILURE
Build step 'Invoke Gradle script' marked build as failure

---------------------------------------------------------------------
To unsubscribe, e-mail: builds-unsubscribe@beam.apache.org
For additional commands, e-mail: builds-help@beam.apache.org


Build failed in Jenkins: beam_PostCommit_Java_ValidatesRunner_Flink_Java11 #1766

Posted by Apache Jenkins Server <je...@builds.apache.org>.
See <https://ci-beam.apache.org/job/beam_PostCommit_Java_ValidatesRunner_Flink_Java11/1766/display/redirect?page=changes>

Changes:

[ajamato] [BEAM-11994] Update ShortIdMap's maps to only use valid keyable fields

[noreply] Add MatchContinuously PTransform to Python SDK (#15106)


------------------------------------------
[...truncated 5.56 KB...]
> Task :buildSrc:compileTestJava NO-SOURCE
> Task :buildSrc:compileTestGroovy NO-SOURCE
> Task :buildSrc:processTestResources NO-SOURCE
> Task :buildSrc:testClasses UP-TO-DATE
> Task :buildSrc:test NO-SOURCE
> Task :buildSrc:validatePlugins FROM-CACHE
> Task :buildSrc:check UP-TO-DATE
> Task :buildSrc:build
Configuration on demand is an incubating feature.
> Task :runners:flink:1.13:copyResourcesOverrides NO-SOURCE
> Task :sdks:java:core:createCheckerFrameworkManifest
> Task :sdks:java:expansion-service:createCheckerFrameworkManifest
> Task :model:job-management:createCheckerFrameworkManifest
> Task :sdks:java:core:generateAvroProtocol NO-SOURCE
> Task :runners:flink:1.13:copySourceOverrides
> Task :runners:core-construction-java:createCheckerFrameworkManifest
> Task :sdks:java:expansion-service:processResources NO-SOURCE
> Task :sdks:java:fn-execution:createCheckerFrameworkManifest
> Task :runners:core-java:createCheckerFrameworkManifest
> Task :runners:java-fn-execution:createCheckerFrameworkManifest
> Task :sdks:java:harness:createCheckerFrameworkManifest
> Task :model:pipeline:createCheckerFrameworkManifest
> Task :model:fn-execution:createCheckerFrameworkManifest
> Task :sdks:java:core:generateAvroJava NO-SOURCE
> Task :runners:java-job-service:createCheckerFrameworkManifest
> Task :sdks:java:extensions:protobuf:createCheckerFrameworkManifest
> Task :sdks:java:extensions:google-cloud-platform-core:createCheckerFrameworkManifest
> Task :runners:flink:1.13:copyTestResourcesOverrides NO-SOURCE
> Task :sdks:java:io:google-cloud-platform:createCheckerFrameworkManifest
> Task :runners:core-construction-java:processResources NO-SOURCE
> Task :sdks:java:build-tools:createCheckerFrameworkManifest
> Task :sdks:java:fn-execution:processResources NO-SOURCE
> Task :sdks:java:harness:processResources NO-SOURCE
> Task :runners:core-java:processResources NO-SOURCE
> Task :runners:java-fn-execution:processResources NO-SOURCE
> Task :sdks:java:extensions:google-cloud-platform-core:processResources NO-SOURCE
> Task :runners:java-job-service:processResources NO-SOURCE
> Task :sdks:java:io:google-cloud-platform:processResources NO-SOURCE
> Task :runners:core-java:processTestResources NO-SOURCE
> Task :model:job-management:extractProto
> Task :model:fn-execution:extractProto
> Task :sdks:java:extensions:protobuf:extractProto
> Task :sdks:java:extensions:protobuf:processResources NO-SOURCE
> Task :runners:flink:1.13:createCheckerFrameworkManifest
> Task :model:job-management:processResources
> Task :runners:flink:1.13:processResources
> Task :model:fn-execution:processResources
> Task :runners:flink:1.13:copyTestSourceOverrides
> Task :runners:flink:1.13:processTestResources
> Task :sdks:java:core:generateGrammarSource FROM-CACHE
> Task :sdks:java:build-tools:compileJava FROM-CACHE
> Task :sdks:java:build-tools:processResources
> Task :sdks:java:build-tools:classes
> Task :sdks:java:build-tools:jar
> Task :sdks:java:core:processResources
> Task :sdks:java:core:generateTestAvroProtocol NO-SOURCE
> Task :model:pipeline:extractIncludeProto
> Task :model:pipeline:extractProto
> Task :sdks:java:core:generateTestAvroJava
> Task :sdks:java:core:generateTestGrammarSource NO-SOURCE
> Task :sdks:java:core:processTestResources
> Task :model:pipeline:generateProto FROM-CACHE
> Task :model:pipeline:compileJava FROM-CACHE
> Task :model:pipeline:processResources
> Task :model:pipeline:classes
> Task :model:pipeline:jar
> Task :model:pipeline:shadowJar FROM-CACHE
> Task :model:job-management:extractIncludeProto
> Task :model:fn-execution:extractIncludeProto
> Task :model:job-management:generateProto FROM-CACHE
> Task :model:fn-execution:generateProto FROM-CACHE
> Task :model:job-management:compileJava FROM-CACHE
> Task :model:job-management:classes
> Task :model:fn-execution:compileJava FROM-CACHE
> Task :model:fn-execution:classes
> Task :model:job-management:shadowJar FROM-CACHE
> Task :model:fn-execution:shadowJar FROM-CACHE
> Task :sdks:java:core:compileJava FROM-CACHE
> Task :sdks:java:core:classes
> Task :sdks:java:core:shadowJar FROM-CACHE
> Task :sdks:java:extensions:protobuf:extractIncludeProto
> Task :sdks:java:extensions:protobuf:generateProto NO-SOURCE
> Task :sdks:java:fn-execution:compileJava FROM-CACHE
> Task :sdks:java:fn-execution:classes UP-TO-DATE
> Task :sdks:java:fn-execution:jar
> Task :runners:core-construction-java:compileJava FROM-CACHE
> Task :runners:core-construction-java:classes UP-TO-DATE
> Task :sdks:java:extensions:protobuf:compileJava FROM-CACHE
> Task :sdks:java:extensions:protobuf:classes UP-TO-DATE
> Task :sdks:java:extensions:protobuf:jar
> Task :runners:core-construction-java:jar
> Task :runners:core-java:compileJava FROM-CACHE
> Task :runners:core-java:classes UP-TO-DATE
> Task :sdks:java:core:compileTestJava FROM-CACHE
> Task :sdks:java:core:testClasses
> Task :sdks:java:core:shadowTestJar FROM-CACHE
> Task :runners:core-java:jar
> Task :sdks:java:extensions:google-cloud-platform-core:compileJava FROM-CACHE
> Task :sdks:java:extensions:google-cloud-platform-core:classes UP-TO-DATE
> Task :sdks:java:extensions:google-cloud-platform-core:jar
> Task :sdks:java:harness:compileJava FROM-CACHE
> Task :sdks:java:harness:classes UP-TO-DATE
> Task :sdks:java:harness:jar
> Task :sdks:java:harness:shadowJar FROM-CACHE
> Task :runners:java-fn-execution:compileJava FROM-CACHE
> Task :runners:java-fn-execution:classes UP-TO-DATE
> Task :runners:java-fn-execution:jar
> Task :sdks:java:expansion-service:compileJava FROM-CACHE
> Task :sdks:java:expansion-service:classes UP-TO-DATE
> Task :sdks:java:expansion-service:jar
> Task :runners:java-job-service:compileJava FROM-CACHE
> Task :runners:java-job-service:classes UP-TO-DATE
> Task :runners:java-job-service:jar
> Task :runners:flink:1.13:compileJava FROM-CACHE
> Task :runners:flink:1.13:classes
> Task :sdks:java:io:google-cloud-platform:compileJava FROM-CACHE
> Task :sdks:java:io:google-cloud-platform:classes UP-TO-DATE
> Task :runners:flink:1.13:jar
> Task :sdks:java:io:google-cloud-platform:jar

> Task :runners:core-java:compileTestJava
Note: Some input files use or override a deprecated API.
Note: Recompile with -Xlint:deprecation for details.
Note: Some input files use unchecked or unsafe operations.
Note: Recompile with -Xlint:unchecked for details.

> Task :runners:core-java:testClasses
> Task :runners:core-java:testJar

> Task :runners:flink:1.13:compileTestJava
Note: Some input files use or override a deprecated API.
Note: Recompile with -Xlint:deprecation for details.
Note: Some input files use unchecked or unsafe operations.
Note: Recompile with -Xlint:unchecked for details.

> Task :runners:flink:1.13:testClasses
> Task :runners:flink:1.13:testJar

Deprecated Gradle features were used in this build, making it incompatible with Gradle 7.0.
Use '--warning-mode all' to show the individual deprecation warnings.
See https://docs.gradle.org/6.8.3/userguide/command_line_interface.html#sec:command_line_warnings

BUILD SUCCESSFUL in 1m 22s
79 actionable tasks: 52 executed, 27 from cache

Publishing build scan...
https://gradle.com/s/6ifmxk6cwxdqg

Build step 'Invoke Gradle script' changed build result to SUCCESS
[Gradle] - Launching build.
[src] $ <https://ci-beam.apache.org/job/beam_PostCommit_Java_ValidatesRunner_Flink_Java11/ws/src/gradlew> -x shadowJar -x shadowTestJar -x compileJava -x compileTestJava -x jar -x testJar -x classes -x testClasses -Dorg.gradle.java.home=/usr/lib/jvm/java-11-openjdk-amd64 --continue --max-workers=6 -Dorg.gradle.jvmargs=-Xms2g -Dorg.gradle.jvmargs=-Xmx4g -Dorg.gradle.vfs.watch=false -Pdocker-pull-licenses :runners:flink:1.13:validatesRunner
Starting a Gradle Daemon, 3 busy and 1 incompatible Daemons could not be reused, use --status for details
> Task :buildSrc:compileJava NO-SOURCE
> Task :buildSrc:compileGroovy FROM-CACHE
> Task :buildSrc:pluginDescriptors UP-TO-DATE
> Task :buildSrc:processResources UP-TO-DATE
> Task :buildSrc:classes UP-TO-DATE
> Task :buildSrc:jar
> Task :buildSrc:assemble
> Task :buildSrc:spotlessGroovy UP-TO-DATE
> Task :buildSrc:spotlessGroovyCheck UP-TO-DATE
> Task :buildSrc:spotlessGroovyGradle UP-TO-DATE
> Task :buildSrc:spotlessGroovyGradleCheck UP-TO-DATE
> Task :buildSrc:spotlessCheck UP-TO-DATE
> Task :buildSrc:pluginUnderTestMetadata
> Task :buildSrc:compileTestJava NO-SOURCE
> Task :buildSrc:compileTestGroovy NO-SOURCE
> Task :buildSrc:processTestResources NO-SOURCE
> Task :buildSrc:testClasses UP-TO-DATE
> Task :buildSrc:test NO-SOURCE
> Task :buildSrc:validatePlugins FROM-CACHE
> Task :buildSrc:check UP-TO-DATE
> Task :buildSrc:build
Configuration on demand is an incubating feature.
> Task :runners:flink:1.13:validatesRunnerBatch
> Task :runners:flink:1.13:validatesRunnerStreaming
> Task :runners:flink:1.13:validatesRunnerStreamingCheckpointing

> Task :runners:flink:1.13:validatesRunnerBatch

org.apache.beam.sdk.transforms.ParDoLifecycleTest > testTeardownCalledAfterExceptionInProcessElementStateful FAILED
    java.lang.AssertionError at ParDoLifecycleTest.java:300

275 tests completed, 1 failed, 2 skipped

> Task :runners:flink:1.13:validatesRunnerBatch FAILED

> Task :runners:flink:1.13:validatesRunnerStreaming
WARNING: An illegal reflective access operation has occurred
WARNING: Illegal reflective access by org.apache.flink.api.java.ClosureCleaner (file:/home/jenkins/.gradle/caches/modules-2/files-2.1/org.apache.flink/flink-core/1.13.1/3f3ef42acd70591992d3786e33972e0d16b404b0/flink-core-1.13.1.jar) to field java.lang.String.value
WARNING: Please consider reporting this to the maintainers of org.apache.flink.api.java.ClosureCleaner
WARNING: Use --illegal-access=warn to enable warnings of further illegal reflective access operations
WARNING: All illegal access operations will be denied in a future release
WARNING: An illegal reflective access operation has occurred
WARNING: Illegal reflective access by org.apache.flink.api.java.ClosureCleaner (file:/home/jenkins/.gradle/caches/modules-2/files-2.1/org.apache.flink/flink-core/1.13.1/3f3ef42acd70591992d3786e33972e0d16b404b0/flink-core-1.13.1.jar) to field java.lang.String.value
WARNING: Please consider reporting this to the maintainers of org.apache.flink.api.java.ClosureCleaner
WARNING: Use --illegal-access=warn to enable warnings of further illegal reflective access operations
WARNING: All illegal access operations will be denied in a future release

org.apache.beam.sdk.transforms.ParDoLifecycleTest > testTeardownCalledAfterExceptionInProcessElement FAILED
    java.lang.AssertionError at ParDoLifecycleTest.java:300

292 tests completed, 1 failed, 3 skipped

> Task :runners:flink:1.13:validatesRunnerStreaming FAILED

> Task :runners:flink:1.13:validatesRunnerStreamingCheckpointing
WARNING: An illegal reflective access operation has occurred
WARNING: Illegal reflective access by org.apache.flink.api.java.ClosureCleaner (file:/home/jenkins/.gradle/caches/modules-2/files-2.1/org.apache.flink/flink-core/1.13.1/3f3ef42acd70591992d3786e33972e0d16b404b0/flink-core-1.13.1.jar) to field java.lang.String.value
WARNING: Please consider reporting this to the maintainers of org.apache.flink.api.java.ClosureCleaner
WARNING: Use --illegal-access=warn to enable warnings of further illegal reflective access operations
WARNING: All illegal access operations will be denied in a future release

FAILURE: Build completed with 2 failures.

1: Task failed with an exception.
-----------
* What went wrong:
Execution failed for task ':runners:flink:1.13:validatesRunnerBatch'.
> There were failing tests. See the report at: file://<https://ci-beam.apache.org/job/beam_PostCommit_Java_ValidatesRunner_Flink_Java11/ws/src/runners/flink/1.13/build/reports/tests/validatesRunnerBatch/index.html>

* Try:
Run with --stacktrace option to get the stack trace. Run with --info or --debug option to get more log output. Run with --scan to get full insights.
==============================================================================

2: Task failed with an exception.
-----------
* What went wrong:
Execution failed for task ':runners:flink:1.13:validatesRunnerStreaming'.
> There were failing tests. See the report at: file://<https://ci-beam.apache.org/job/beam_PostCommit_Java_ValidatesRunner_Flink_Java11/ws/src/runners/flink/1.13/build/reports/tests/validatesRunnerStreaming/index.html>

* Try:
Run with --stacktrace option to get the stack trace. Run with --info or --debug option to get more log output. Run with --scan to get full insights.
==============================================================================

* Get more help at https://help.gradle.org

Deprecated Gradle features were used in this build, making it incompatible with Gradle 7.0.
Use '--warning-mode all' to show the individual deprecation warnings.
See https://docs.gradle.org/6.8.3/userguide/command_line_interface.html#sec:command_line_warnings

BUILD FAILED in 43m 52s
3 actionable tasks: 3 executed

Publishing build scan...
https://gradle.com/s/ve765jhp6jny4

Build step 'Invoke Gradle script' changed build result to FAILURE
Build step 'Invoke Gradle script' marked build as failure

---------------------------------------------------------------------
To unsubscribe, e-mail: builds-unsubscribe@beam.apache.org
For additional commands, e-mail: builds-help@beam.apache.org