You are viewing a plain text version of this content. The canonical link for it is here.
Posted to dev@zookeeper.apache.org by Apache Jenkins Server <je...@builds.apache.org> on 2018/09/28 12:02:13 UTC
ZooKeeper_branch35_jdk8 - Build # 1133 - Failure
See https://builds.apache.org/job/ZooKeeper_branch35_jdk8/1133/
###################################################################################
########################## LAST 60 LINES OF THE CONSOLE ###########################
[...truncated 63.06 KB...]
[junit] Running org.apache.zookeeper.test.SessionInvalidationTest in thread 3
[junit] Running org.apache.zookeeper.test.ServerCnxnTest in thread 7
[junit] Tests run: 1, Failures: 0, Errors: 0, Skipped: 0, Time elapsed: 1.361 sec, Thread: 4, Class: org.apache.zookeeper.test.SaslSuperUserTest
[junit] Tests run: 1, Failures: 0, Errors: 0, Skipped: 0, Time elapsed: 1.056 sec, Thread: 3, Class: org.apache.zookeeper.test.SessionInvalidationTest
[junit] Running org.apache.zookeeper.test.SessionTest in thread 4
[junit] Running org.apache.zookeeper.test.SessionTimeoutTest in thread 3
[junit] Tests run: 1, Failures: 0, Errors: 0, Skipped: 0, Time elapsed: 3.69 sec, Thread: 7, Class: org.apache.zookeeper.test.ServerCnxnTest
[junit] Tests run: 4, Failures: 0, Errors: 0, Skipped: 0, Time elapsed: 1.533 sec, Thread: 3, Class: org.apache.zookeeper.test.SessionTimeoutTest
[junit] Running org.apache.zookeeper.test.SessionTrackerCheckTest in thread 7
[junit] Tests run: 2, Failures: 0, Errors: 0, Skipped: 0, Time elapsed: 0.132 sec, Thread: 7, Class: org.apache.zookeeper.test.SessionTrackerCheckTest
[junit] Running org.apache.zookeeper.test.SessionUpgradeTest in thread 3
[junit] Running org.apache.zookeeper.test.StandaloneTest in thread 7
[junit] Tests run: 4, Failures: 0, Errors: 0, Skipped: 0, Time elapsed: 2.954 sec, Thread: 7, Class: org.apache.zookeeper.test.StandaloneTest
[junit] Running org.apache.zookeeper.test.StatTest in thread 7
[junit] Tests run: 4, Failures: 0, Errors: 0, Skipped: 0, Time elapsed: 1.282 sec, Thread: 7, Class: org.apache.zookeeper.test.StatTest
[junit] Running org.apache.zookeeper.test.StaticHostProviderTest in thread 7
[junit] Tests run: 26, Failures: 0, Errors: 0, Skipped: 0, Time elapsed: 1.966 sec, Thread: 7, Class: org.apache.zookeeper.test.StaticHostProviderTest
[junit] Tests run: 5, Failures: 0, Errors: 0, Skipped: 0, Time elapsed: 12.969 sec, Thread: 4, Class: org.apache.zookeeper.test.SessionTest
[junit] Running org.apache.zookeeper.test.StringUtilTest in thread 7
[junit] Tests run: 1, Failures: 0, Errors: 0, Skipped: 0, Time elapsed: 0.099 sec, Thread: 7, Class: org.apache.zookeeper.test.StringUtilTest
[junit] Running org.apache.zookeeper.test.SyncCallTest in thread 4
[junit] Running org.apache.zookeeper.test.TruncateTest in thread 7
[junit] Tests run: 1, Failures: 0, Errors: 0, Skipped: 0, Time elapsed: 1.002 sec, Thread: 4, Class: org.apache.zookeeper.test.SyncCallTest
[junit] Tests run: 2, Failures: 0, Errors: 0, Skipped: 0, Time elapsed: 75.762 sec, Thread: 1, Class: org.apache.zookeeper.test.QuorumZxidSyncTest
[junit] Running org.apache.zookeeper.test.WatchEventWhenAutoResetTest in thread 4
[junit] Running org.apache.zookeeper.test.WatchedEventTest in thread 1
[junit] Tests run: 4, Failures: 0, Errors: 0, Skipped: 0, Time elapsed: 0.21 sec, Thread: 1, Class: org.apache.zookeeper.test.WatchedEventTest
[junit] Running org.apache.zookeeper.test.WatcherFuncTest in thread 1
[junit] Tests run: 6, Failures: 0, Errors: 0, Skipped: 0, Time elapsed: 2.356 sec, Thread: 1, Class: org.apache.zookeeper.test.WatcherFuncTest
[junit] Tests run: 3, Failures: 0, Errors: 0, Skipped: 0, Time elapsed: 7.739 sec, Thread: 7, Class: org.apache.zookeeper.test.TruncateTest
[junit] Running org.apache.zookeeper.test.WatcherTest in thread 1
[junit] Running org.apache.zookeeper.test.X509AuthTest in thread 7
[junit] Tests run: 3, Failures: 0, Errors: 0, Skipped: 0, Time elapsed: 0.194 sec, Thread: 7, Class: org.apache.zookeeper.test.X509AuthTest
[junit] Running org.apache.zookeeper.test.ZkDatabaseCorruptionTest in thread 7
[junit] Tests run: 4, Failures: 0, Errors: 0, Skipped: 0, Time elapsed: 23.442 sec, Thread: 3, Class: org.apache.zookeeper.test.SessionUpgradeTest
[junit] Running org.apache.zookeeper.test.ZooKeeperQuotaTest in thread 3
[junit] Tests run: 1, Failures: 0, Errors: 0, Skipped: 0, Time elapsed: 0.841 sec, Thread: 3, Class: org.apache.zookeeper.test.ZooKeeperQuotaTest
[junit] Running org.apache.jute.BinaryInputArchiveTest in thread 3
[junit] Tests run: 14, Failures: 0, Errors: 0, Skipped: 1, Time elapsed: 94.142 sec, Thread: 8, Class: org.apache.zookeeper.test.QuorumTest
[junit] Tests run: 1, Failures: 0, Errors: 0, Skipped: 0, Time elapsed: 0.12 sec, Thread: 3, Class: org.apache.jute.BinaryInputArchiveTest
[junit] Tests run: 2, Failures: 0, Errors: 0, Skipped: 0, Time elapsed: 11.599 sec, Thread: 7, Class: org.apache.zookeeper.test.ZkDatabaseCorruptionTest
[junit] Tests run: 4, Failures: 0, Errors: 0, Skipped: 0, Time elapsed: 24.931 sec, Thread: 4, Class: org.apache.zookeeper.test.WatchEventWhenAutoResetTest
[junit] Tests run: 8, Failures: 0, Errors: 0, Skipped: 0, Time elapsed: 31.809 sec, Thread: 1, Class: org.apache.zookeeper.test.WatcherTest
[junit] Tests run: 103, Failures: 0, Errors: 0, Skipped: 0, Time elapsed: 351.027 sec, Thread: 2, Class: org.apache.zookeeper.test.NettyNettySuiteTest
[junit] Tests run: 13, Failures: 0, Errors: 0, Skipped: 0, Time elapsed: 278.855 sec, Thread: 5, Class: org.apache.zookeeper.test.ReconfigTest
[junit] Tests run: 103, Failures: 0, Errors: 0, Skipped: 0, Time elapsed: 370.458 sec, Thread: 6, Class: org.apache.zookeeper.test.NioNettySuiteTest
fail.build.on.test.failure:
BUILD FAILED
/home/jenkins/jenkins-slave/workspace/ZooKeeper_branch35_jdk8/build.xml:1325: The following error occurred while executing this line:
/home/jenkins/jenkins-slave/workspace/ZooKeeper_branch35_jdk8/build.xml:1329: Tests failed!
Total time: 11 minutes 0 seconds
Build step 'Invoke Ant' marked build as failure
Archiving artifacts
Recording test results
Email was triggered for: Failure - Any
Sending email for trigger: Failure - Any
###################################################################################
############################## FAILED TESTS (if any) ##############################
1 tests failed.
FAILED: org.apache.zookeeper.server.quorum.ReconfigRecoveryTest.testCurrentServersAreObserversInNextConfig
Error Message:
waiting for server 3 being up
Stack Trace:
junit.framework.AssertionFailedError: waiting for server 3 being up
at org.apache.zookeeper.server.quorum.ReconfigRecoveryTest.testCurrentServersAreObserversInNextConfig(ReconfigRecoveryTest.java:223)
at org.apache.zookeeper.JUnit4ZKTestRunner$LoggedInvokeMethod.evaluate(JUnit4ZKTestRunner.java:79)