You are viewing a plain text version of this content. The canonical link for it is here.
Posted to mapreduce-dev@hadoop.apache.org by Apache Jenkins Server <je...@builds.apache.org> on 2012/11/20 14:21:58 UTC

Hadoop-Mapreduce-trunk - Build # 1263 - Still Failing

See https://builds.apache.org/job/Hadoop-Mapreduce-trunk/1263/

###################################################################################
########################## LAST 60 LINES OF THE CONSOLE ###########################
[...truncated 27923 lines...]
Running org.apache.hadoop.mapreduce.v2.app.webapp.TestAMWebServicesJobConf
Tests run: 4, Failures: 0, Errors: 0, Skipped: 0, Time elapsed: 4.228 sec
Running org.apache.hadoop.mapreduce.v2.app.webapp.TestAMWebServicesTasks
Tests run: 20, Failures: 0, Errors: 0, Skipped: 0, Time elapsed: 7.98 sec
Running org.apache.hadoop.mapreduce.v2.app.TestKill
Tests run: 4, Failures: 0, Errors: 0, Skipped: 0, Time elapsed: 7.421 sec
Running org.apache.hadoop.mapreduce.v2.app.TestStagingCleanup
Tests run: 4, Failures: 0, Errors: 0, Skipped: 0, Time elapsed: 11.958 sec
Running org.apache.hadoop.mapreduce.v2.app.launcher.TestContainerLauncherImpl
Tests run: 3, Failures: 0, Errors: 0, Skipped: 0, Time elapsed: 1.545 sec
Running org.apache.hadoop.mapreduce.v2.app.launcher.TestContainerLauncher
Tests run: 3, Failures: 0, Errors: 0, Skipped: 0, Time elapsed: 12.918 sec
Running org.apache.hadoop.mapreduce.jobhistory.TestJobHistoryEventHandler
Tests run: 5, Failures: 0, Errors: 0, Skipped: 0, Time elapsed: 10.081 sec

Results :

Tests run: 180, Failures: 0, Errors: 0, Skipped: 0

[INFO] ------------------------------------------------------------------------
[INFO] Reactor Summary:
[INFO] 
[INFO] hadoop-mapreduce-client ........................... SUCCESS [1.716s]
[INFO] hadoop-mapreduce-client-core ...................... SUCCESS [18.185s]
[INFO] hadoop-mapreduce-client-common .................... SUCCESS [22.069s]
[INFO] hadoop-mapreduce-client-shuffle ................... SUCCESS [1.624s]
[INFO] hadoop-mapreduce-client-app ....................... FAILURE [4:41.188s]
[INFO] hadoop-mapreduce-client-hs ........................ SKIPPED
[INFO] hadoop-mapreduce-client-jobclient ................. SKIPPED
[INFO] Apache Hadoop MapReduce Examples .................. SKIPPED
[INFO] hadoop-mapreduce .................................. SKIPPED
[INFO] ------------------------------------------------------------------------
[INFO] BUILD FAILURE
[INFO] ------------------------------------------------------------------------
[INFO] Total time: 5:25.332s
[INFO] Finished at: Tue Nov 20 13:21:51 UTC 2012
[INFO] Final Memory: 20M/196M
[INFO] ------------------------------------------------------------------------
[ERROR] Failed to execute goal org.apache.maven.plugins:maven-surefire-plugin:2.12.3:test (default-test) on project hadoop-mapreduce-client-app: ExecutionException; nested exception is java.util.concurrent.ExecutionException: java.lang.RuntimeException: The forked VM terminated without saying properly goodbye. VM crash or System.exit called ? -> [Help 1]
[ERROR] 
[ERROR] To see the full stack trace of the errors, re-run Maven with the -e switch.
[ERROR] Re-run Maven using the -X switch to enable full debug logging.
[ERROR] 
[ERROR] For more information about the errors and possible solutions, please read the following articles:
[ERROR] [Help 1] http://cwiki.apache.org/confluence/display/MAVEN/MojoExecutionException
[ERROR] 
[ERROR] After correcting the problems, you can resume the build with the command
[ERROR]   mvn <goals> -rf :hadoop-mapreduce-client-app
Build step 'Execute shell' marked build as failure
[FINDBUGS] Skipping publisher since build result is FAILURE
Archiving artifacts
Updating HDFS-4178
Updating YARN-219
Updating HADOOP-6616
Updating HDFS-4179
Updating YARN-129
Updating MAPREDUCE-4723
Email was triggered for: Failure
Sending email for trigger: Failure



###################################################################################
############################## FAILED TESTS (if any) ##############################
No tests ran.

Hadoop-Mapreduce-trunk - Build # 1270 - Still Failing

Posted by Apache Jenkins Server <je...@builds.apache.org>.
See https://builds.apache.org/job/Hadoop-Mapreduce-trunk/1270/

###################################################################################
########################## LAST 60 LINES OF THE CONSOLE ###########################
[...truncated 26810 lines...]
Tests run: 15, Failures: 0, Errors: 0, Skipped: 0, Time elapsed: 6.718 sec
Running org.apache.hadoop.mapreduce.v2.app.webapp.TestAMWebServicesJobConf
Tests run: 4, Failures: 0, Errors: 0, Skipped: 0, Time elapsed: 4.207 sec
Running org.apache.hadoop.mapreduce.v2.app.webapp.TestAMWebServicesTasks
Tests run: 20, Failures: 0, Errors: 0, Skipped: 0, Time elapsed: 7.99 sec
Running org.apache.hadoop.mapreduce.v2.app.TestKill
Tests run: 4, Failures: 0, Errors: 0, Skipped: 0, Time elapsed: 6.909 sec
Running org.apache.hadoop.mapreduce.v2.app.TestStagingCleanup
Tests run: 4, Failures: 0, Errors: 0, Skipped: 0, Time elapsed: 11.972 sec
Running org.apache.hadoop.mapreduce.v2.app.launcher.TestContainerLauncherImpl
Tests run: 3, Failures: 0, Errors: 0, Skipped: 0, Time elapsed: 1.545 sec
Running org.apache.hadoop.mapreduce.v2.app.launcher.TestContainerLauncher
Tests run: 3, Failures: 0, Errors: 0, Skipped: 0, Time elapsed: 12.913 sec
Running org.apache.hadoop.mapreduce.jobhistory.TestJobHistoryEventHandler
Tests run: 5, Failures: 0, Errors: 0, Skipped: 0, Time elapsed: 10.071 sec

Results :

Tests run: 180, Failures: 0, Errors: 0, Skipped: 0

[INFO] ------------------------------------------------------------------------
[INFO] Reactor Summary:
[INFO] 
[INFO] hadoop-mapreduce-client ........................... SUCCESS [1.693s]
[INFO] hadoop-mapreduce-client-core ...................... SUCCESS [18.171s]
[INFO] hadoop-mapreduce-client-common .................... SUCCESS [22.066s]
[INFO] hadoop-mapreduce-client-shuffle ................... SUCCESS [1.624s]
[INFO] hadoop-mapreduce-client-app ....................... FAILURE [4:40.020s]
[INFO] hadoop-mapreduce-client-hs ........................ SKIPPED
[INFO] hadoop-mapreduce-client-jobclient ................. SKIPPED
[INFO] Apache Hadoop MapReduce Examples .................. SKIPPED
[INFO] hadoop-mapreduce .................................. SKIPPED
[INFO] ------------------------------------------------------------------------
[INFO] BUILD FAILURE
[INFO] ------------------------------------------------------------------------
[INFO] Total time: 5:24.136s
[INFO] Finished at: Tue Nov 27 13:23:42 UTC 2012
[INFO] Final Memory: 20M/128M
[INFO] ------------------------------------------------------------------------
[ERROR] Failed to execute goal org.apache.maven.plugins:maven-surefire-plugin:2.12.3:test (default-test) on project hadoop-mapreduce-client-app: ExecutionException; nested exception is java.util.concurrent.ExecutionException: java.lang.RuntimeException: The forked VM terminated without saying properly goodbye. VM crash or System.exit called ? -> [Help 1]
[ERROR] 
[ERROR] To see the full stack trace of the errors, re-run Maven with the -e switch.
[ERROR] Re-run Maven using the -X switch to enable full debug logging.
[ERROR] 
[ERROR] For more information about the errors and possible solutions, please read the following articles:
[ERROR] [Help 1] http://cwiki.apache.org/confluence/display/MAVEN/MojoExecutionException
[ERROR] 
[ERROR] After correcting the problems, you can resume the build with the command
[ERROR]   mvn <goals> -rf :hadoop-mapreduce-client-app
Build step 'Execute shell' marked build as failure
[FINDBUGS] Skipping publisher since build result is FAILURE
Archiving artifacts
Updating MAPREDUCE-4764
Updating HADOOP-8992
Updating HADOOP-9093
Updating HADOOP-9038
Updating HDFS-4200
Email was triggered for: Failure
Sending email for trigger: Failure



###################################################################################
############################## FAILED TESTS (if any) ##############################
No tests ran.

Hadoop-Mapreduce-trunk - Build # 1269 - Still Failing

Posted by Apache Jenkins Server <je...@builds.apache.org>.
See https://builds.apache.org/job/Hadoop-Mapreduce-trunk/1269/

###################################################################################
########################## LAST 60 LINES OF THE CONSOLE ###########################
[...truncated 26784 lines...]
Running org.apache.hadoop.mapreduce.v2.app.webapp.TestAMWebServicesJobs
Tests run: 21, Failures: 0, Errors: 0, Skipped: 0, Time elapsed: 9.222 sec
Running org.apache.hadoop.mapreduce.v2.app.webapp.TestAMWebServices
Tests run: 11, Failures: 0, Errors: 0, Skipped: 0, Time elapsed: 6.052 sec
Running org.apache.hadoop.mapreduce.v2.app.webapp.TestAMWebServicesAttempts
Tests run: 15, Failures: 0, Errors: 0, Skipped: 0, Time elapsed: 7.621 sec
Running org.apache.hadoop.mapreduce.v2.app.webapp.TestAMWebServicesJobConf
Tests run: 4, Failures: 0, Errors: 0, Skipped: 0, Time elapsed: 4.224 sec
Running org.apache.hadoop.mapreduce.v2.app.webapp.TestAMWebServicesTasks
Tests run: 20, Failures: 0, Errors: 0, Skipped: 0, Time elapsed: 8.047 sec
Running org.apache.hadoop.mapreduce.v2.app.TestKill
Tests run: 4, Failures: 0, Errors: 0, Skipped: 0, Time elapsed: 7.41 sec
Running org.apache.hadoop.mapreduce.v2.app.TestStagingCleanup
Tests run: 4, Failures: 0, Errors: 0, Skipped: 0, Time elapsed: 11.98 sec
Running org.apache.hadoop.mapreduce.v2.app.launcher.TestContainerLauncherImpl
Tests run: 3, Failures: 0, Errors: 0, Skipped: 0, Time elapsed: 1.547 sec
Running org.apache.hadoop.mapreduce.v2.app.launcher.TestContainerLauncher
Tests run: 3, Failures: 0, Errors: 0, Skipped: 0, Time elapsed: 12.906 sec
Running org.apache.hadoop.mapreduce.jobhistory.TestJobHistoryEventHandler
Tests run: 5, Failures: 0, Errors: 0, Skipped: 0, Time elapsed: 10.074 sec

Results :

Tests run: 180, Failures: 0, Errors: 0, Skipped: 0

[INFO] ------------------------------------------------------------------------
[INFO] Reactor Summary:
[INFO] 
[INFO] hadoop-mapreduce-client ........................... SUCCESS [1.692s]
[INFO] hadoop-mapreduce-client-core ...................... SUCCESS [17.796s]
[INFO] hadoop-mapreduce-client-common .................... SUCCESS [21.906s]
[INFO] hadoop-mapreduce-client-shuffle ................... SUCCESS [1.634s]
[INFO] hadoop-mapreduce-client-app ....................... FAILURE [4:41.668s]
[INFO] hadoop-mapreduce-client-hs ........................ SKIPPED
[INFO] hadoop-mapreduce-client-jobclient ................. SKIPPED
[INFO] Apache Hadoop MapReduce Examples .................. SKIPPED
[INFO] hadoop-mapreduce .................................. SKIPPED
[INFO] ------------------------------------------------------------------------
[INFO] BUILD FAILURE
[INFO] ------------------------------------------------------------------------
[INFO] Total time: 5:25.241s
[INFO] Finished at: Mon Nov 26 13:23:32 UTC 2012
[INFO] Final Memory: 20M/254M
[INFO] ------------------------------------------------------------------------
[ERROR] Failed to execute goal org.apache.maven.plugins:maven-surefire-plugin:2.12.3:test (default-test) on project hadoop-mapreduce-client-app: ExecutionException; nested exception is java.util.concurrent.ExecutionException: java.lang.RuntimeException: The forked VM terminated without saying properly goodbye. VM crash or System.exit called ? -> [Help 1]
[ERROR] 
[ERROR] To see the full stack trace of the errors, re-run Maven with the -e switch.
[ERROR] Re-run Maven using the -X switch to enable full debug logging.
[ERROR] 
[ERROR] For more information about the errors and possible solutions, please read the following articles:
[ERROR] [Help 1] http://cwiki.apache.org/confluence/display/MAVEN/MojoExecutionException
[ERROR] 
[ERROR] After correcting the problems, you can resume the build with the command
[ERROR]   mvn <goals> -rf :hadoop-mapreduce-client-app
Build step 'Execute shell' marked build as failure
[FINDBUGS] Skipping publisher since build result is FAILURE
Archiving artifacts
Email was triggered for: Failure
Sending email for trigger: Failure



###################################################################################
############################## FAILED TESTS (if any) ##############################
No tests ran.

Hadoop-Mapreduce-trunk - Build # 1268 - Still Failing

Posted by Apache Jenkins Server <je...@builds.apache.org>.
See https://builds.apache.org/job/Hadoop-Mapreduce-trunk/1268/

###################################################################################
########################## LAST 60 LINES OF THE CONSOLE ###########################
[...truncated 27918 lines...]
Running org.apache.hadoop.mapreduce.v2.app.webapp.TestAMWebServicesJobs
Tests run: 21, Failures: 0, Errors: 0, Skipped: 0, Time elapsed: 9.396 sec
Running org.apache.hadoop.mapreduce.v2.app.webapp.TestAMWebServices
Tests run: 11, Failures: 0, Errors: 0, Skipped: 0, Time elapsed: 6.084 sec
Running org.apache.hadoop.mapreduce.v2.app.webapp.TestAMWebServicesAttempts
Tests run: 15, Failures: 0, Errors: 0, Skipped: 0, Time elapsed: 6.727 sec
Running org.apache.hadoop.mapreduce.v2.app.webapp.TestAMWebServicesJobConf
Tests run: 4, Failures: 0, Errors: 0, Skipped: 0, Time elapsed: 4.399 sec
Running org.apache.hadoop.mapreduce.v2.app.webapp.TestAMWebServicesTasks
Tests run: 20, Failures: 0, Errors: 0, Skipped: 0, Time elapsed: 8.009 sec
Running org.apache.hadoop.mapreduce.v2.app.TestKill
Tests run: 4, Failures: 0, Errors: 0, Skipped: 0, Time elapsed: 6.914 sec
Running org.apache.hadoop.mapreduce.v2.app.TestStagingCleanup
Tests run: 4, Failures: 0, Errors: 0, Skipped: 0, Time elapsed: 11.981 sec
Running org.apache.hadoop.mapreduce.v2.app.launcher.TestContainerLauncherImpl
Tests run: 3, Failures: 0, Errors: 0, Skipped: 0, Time elapsed: 1.55 sec
Running org.apache.hadoop.mapreduce.v2.app.launcher.TestContainerLauncher
Tests run: 3, Failures: 0, Errors: 0, Skipped: 0, Time elapsed: 12.927 sec
Running org.apache.hadoop.mapreduce.jobhistory.TestJobHistoryEventHandler
Tests run: 5, Failures: 0, Errors: 0, Skipped: 0, Time elapsed: 10.074 sec

Results :

Tests run: 180, Failures: 0, Errors: 0, Skipped: 0

[INFO] ------------------------------------------------------------------------
[INFO] Reactor Summary:
[INFO] 
[INFO] hadoop-mapreduce-client ........................... SUCCESS [1.688s]
[INFO] hadoop-mapreduce-client-core ...................... SUCCESS [18.237s]
[INFO] hadoop-mapreduce-client-common .................... SUCCESS [21.967s]
[INFO] hadoop-mapreduce-client-shuffle ................... SUCCESS [1.626s]
[INFO] hadoop-mapreduce-client-app ....................... FAILURE [4:43.005s]
[INFO] hadoop-mapreduce-client-hs ........................ SKIPPED
[INFO] hadoop-mapreduce-client-jobclient ................. SKIPPED
[INFO] Apache Hadoop MapReduce Examples .................. SKIPPED
[INFO] hadoop-mapreduce .................................. SKIPPED
[INFO] ------------------------------------------------------------------------
[INFO] BUILD FAILURE
[INFO] ------------------------------------------------------------------------
[INFO] Total time: 5:27.079s
[INFO] Finished at: Sun Nov 25 13:23:49 UTC 2012
[INFO] Final Memory: 20M/196M
[INFO] ------------------------------------------------------------------------
[ERROR] Failed to execute goal org.apache.maven.plugins:maven-surefire-plugin:2.12.3:test (default-test) on project hadoop-mapreduce-client-app: ExecutionException; nested exception is java.util.concurrent.ExecutionException: java.lang.RuntimeException: The forked VM terminated without saying properly goodbye. VM crash or System.exit called ? -> [Help 1]
[ERROR] 
[ERROR] To see the full stack trace of the errors, re-run Maven with the -e switch.
[ERROR] Re-run Maven using the -X switch to enable full debug logging.
[ERROR] 
[ERROR] For more information about the errors and possible solutions, please read the following articles:
[ERROR] [Help 1] http://cwiki.apache.org/confluence/display/MAVEN/MojoExecutionException
[ERROR] 
[ERROR] After correcting the problems, you can resume the build with the command
[ERROR]   mvn <goals> -rf :hadoop-mapreduce-client-app
Build step 'Execute shell' marked build as failure
[FINDBUGS] Skipping publisher since build result is FAILURE
Archiving artifacts
Email was triggered for: Failure
Sending email for trigger: Failure



###################################################################################
############################## FAILED TESTS (if any) ##############################
No tests ran.

Hadoop-Mapreduce-trunk - Build # 1267 - Still Failing

Posted by Apache Jenkins Server <je...@builds.apache.org>.
See https://builds.apache.org/job/Hadoop-Mapreduce-trunk/1267/

###################################################################################
########################## LAST 60 LINES OF THE CONSOLE ###########################
[...truncated 27926 lines...]
Running org.apache.hadoop.mapreduce.v2.app.webapp.TestAMWebServicesJobs
Tests run: 21, Failures: 0, Errors: 0, Skipped: 0, Time elapsed: 8.232 sec
Running org.apache.hadoop.mapreduce.v2.app.webapp.TestAMWebServices
Tests run: 11, Failures: 0, Errors: 0, Skipped: 0, Time elapsed: 5.502 sec
Running org.apache.hadoop.mapreduce.v2.app.webapp.TestAMWebServicesAttempts
Tests run: 15, Failures: 0, Errors: 0, Skipped: 0, Time elapsed: 7.573 sec
Running org.apache.hadoop.mapreduce.v2.app.webapp.TestAMWebServicesJobConf
Tests run: 4, Failures: 0, Errors: 0, Skipped: 0, Time elapsed: 4.382 sec
Running org.apache.hadoop.mapreduce.v2.app.webapp.TestAMWebServicesTasks
Tests run: 20, Failures: 0, Errors: 0, Skipped: 0, Time elapsed: 7.958 sec
Running org.apache.hadoop.mapreduce.v2.app.TestKill
Tests run: 4, Failures: 0, Errors: 0, Skipped: 0, Time elapsed: 7.418 sec
Running org.apache.hadoop.mapreduce.v2.app.TestStagingCleanup
Tests run: 4, Failures: 0, Errors: 0, Skipped: 0, Time elapsed: 11.969 sec
Running org.apache.hadoop.mapreduce.v2.app.launcher.TestContainerLauncherImpl
Tests run: 3, Failures: 0, Errors: 0, Skipped: 0, Time elapsed: 1.545 sec
Running org.apache.hadoop.mapreduce.v2.app.launcher.TestContainerLauncher
Tests run: 3, Failures: 0, Errors: 0, Skipped: 0, Time elapsed: 12.925 sec
Running org.apache.hadoop.mapreduce.jobhistory.TestJobHistoryEventHandler
Tests run: 5, Failures: 0, Errors: 0, Skipped: 0, Time elapsed: 10.072 sec

Results :

Tests run: 180, Failures: 0, Errors: 0, Skipped: 0

[INFO] ------------------------------------------------------------------------
[INFO] Reactor Summary:
[INFO] 
[INFO] hadoop-mapreduce-client ........................... SUCCESS [1.693s]
[INFO] hadoop-mapreduce-client-core ...................... SUCCESS [17.905s]
[INFO] hadoop-mapreduce-client-common .................... SUCCESS [21.981s]
[INFO] hadoop-mapreduce-client-shuffle ................... SUCCESS [1.638s]
[INFO] hadoop-mapreduce-client-app ....................... FAILURE [4:42.109s]
[INFO] hadoop-mapreduce-client-hs ........................ SKIPPED
[INFO] hadoop-mapreduce-client-jobclient ................. SKIPPED
[INFO] Apache Hadoop MapReduce Examples .................. SKIPPED
[INFO] hadoop-mapreduce .................................. SKIPPED
[INFO] ------------------------------------------------------------------------
[INFO] BUILD FAILURE
[INFO] ------------------------------------------------------------------------
[INFO] Total time: 5:25.885s
[INFO] Finished at: Sat Nov 24 13:23:10 UTC 2012
[INFO] Final Memory: 20M/196M
[INFO] ------------------------------------------------------------------------
[ERROR] Failed to execute goal org.apache.maven.plugins:maven-surefire-plugin:2.12.3:test (default-test) on project hadoop-mapreduce-client-app: ExecutionException; nested exception is java.util.concurrent.ExecutionException: java.lang.RuntimeException: The forked VM terminated without saying properly goodbye. VM crash or System.exit called ? -> [Help 1]
[ERROR] 
[ERROR] To see the full stack trace of the errors, re-run Maven with the -e switch.
[ERROR] Re-run Maven using the -X switch to enable full debug logging.
[ERROR] 
[ERROR] For more information about the errors and possible solutions, please read the following articles:
[ERROR] [Help 1] http://cwiki.apache.org/confluence/display/MAVEN/MojoExecutionException
[ERROR] 
[ERROR] After correcting the problems, you can resume the build with the command
[ERROR]   mvn <goals> -rf :hadoop-mapreduce-client-app
Build step 'Execute shell' marked build as failure
[FINDBUGS] Skipping publisher since build result is FAILURE
Archiving artifacts
Email was triggered for: Failure
Sending email for trigger: Failure



###################################################################################
############################## FAILED TESTS (if any) ##############################
No tests ran.

Hadoop-Mapreduce-trunk - Build # 1266 - Still Failing

Posted by Apache Jenkins Server <je...@builds.apache.org>.
See https://builds.apache.org/job/Hadoop-Mapreduce-trunk/1266/

###################################################################################
########################## LAST 60 LINES OF THE CONSOLE ###########################
[...truncated 26784 lines...]
Running org.apache.hadoop.mapreduce.v2.app.webapp.TestAMWebServicesJobs
Tests run: 21, Failures: 0, Errors: 0, Skipped: 0, Time elapsed: 8.174 sec
Running org.apache.hadoop.mapreduce.v2.app.webapp.TestAMWebServices
Tests run: 11, Failures: 0, Errors: 0, Skipped: 0, Time elapsed: 6.089 sec
Running org.apache.hadoop.mapreduce.v2.app.webapp.TestAMWebServicesAttempts
Tests run: 15, Failures: 0, Errors: 0, Skipped: 0, Time elapsed: 7.474 sec
Running org.apache.hadoop.mapreduce.v2.app.webapp.TestAMWebServicesJobConf
Tests run: 4, Failures: 0, Errors: 0, Skipped: 0, Time elapsed: 4.205 sec
Running org.apache.hadoop.mapreduce.v2.app.webapp.TestAMWebServicesTasks
Tests run: 20, Failures: 0, Errors: 0, Skipped: 0, Time elapsed: 7.957 sec
Running org.apache.hadoop.mapreduce.v2.app.TestKill
Tests run: 4, Failures: 0, Errors: 0, Skipped: 0, Time elapsed: 7.422 sec
Running org.apache.hadoop.mapreduce.v2.app.TestStagingCleanup
Tests run: 4, Failures: 0, Errors: 0, Skipped: 0, Time elapsed: 11.979 sec
Running org.apache.hadoop.mapreduce.v2.app.launcher.TestContainerLauncherImpl
Tests run: 3, Failures: 0, Errors: 0, Skipped: 0, Time elapsed: 1.541 sec
Running org.apache.hadoop.mapreduce.v2.app.launcher.TestContainerLauncher
Tests run: 3, Failures: 0, Errors: 0, Skipped: 0, Time elapsed: 12.903 sec
Running org.apache.hadoop.mapreduce.jobhistory.TestJobHistoryEventHandler
Tests run: 5, Failures: 0, Errors: 0, Skipped: 0, Time elapsed: 10.071 sec

Results :

Tests run: 180, Failures: 0, Errors: 0, Skipped: 0

[INFO] ------------------------------------------------------------------------
[INFO] Reactor Summary:
[INFO] 
[INFO] hadoop-mapreduce-client ........................... SUCCESS [1.692s]
[INFO] hadoop-mapreduce-client-core ...................... SUCCESS [18.010s]
[INFO] hadoop-mapreduce-client-common .................... SUCCESS [22.112s]
[INFO] hadoop-mapreduce-client-shuffle ................... SUCCESS [1.609s]
[INFO] hadoop-mapreduce-client-app ....................... FAILURE [4:42.088s]
[INFO] hadoop-mapreduce-client-hs ........................ SKIPPED
[INFO] hadoop-mapreduce-client-jobclient ................. SKIPPED
[INFO] Apache Hadoop MapReduce Examples .................. SKIPPED
[INFO] hadoop-mapreduce .................................. SKIPPED
[INFO] ------------------------------------------------------------------------
[INFO] BUILD FAILURE
[INFO] ------------------------------------------------------------------------
[INFO] Total time: 5:26.061s
[INFO] Finished at: Fri Nov 23 13:23:22 UTC 2012
[INFO] Final Memory: 21M/264M
[INFO] ------------------------------------------------------------------------
[ERROR] Failed to execute goal org.apache.maven.plugins:maven-surefire-plugin:2.12.3:test (default-test) on project hadoop-mapreduce-client-app: ExecutionException; nested exception is java.util.concurrent.ExecutionException: java.lang.RuntimeException: The forked VM terminated without saying properly goodbye. VM crash or System.exit called ? -> [Help 1]
[ERROR] 
[ERROR] To see the full stack trace of the errors, re-run Maven with the -e switch.
[ERROR] Re-run Maven using the -X switch to enable full debug logging.
[ERROR] 
[ERROR] For more information about the errors and possible solutions, please read the following articles:
[ERROR] [Help 1] http://cwiki.apache.org/confluence/display/MAVEN/MojoExecutionException
[ERROR] 
[ERROR] After correcting the problems, you can resume the build with the command
[ERROR]   mvn <goals> -rf :hadoop-mapreduce-client-app
Build step 'Execute shell' marked build as failure
[FINDBUGS] Skipping publisher since build result is FAILURE
Archiving artifacts
Email was triggered for: Failure
Sending email for trigger: Failure



###################################################################################
############################## FAILED TESTS (if any) ##############################
No tests ran.

Hadoop-Mapreduce-trunk - Build # 1265 - Still Failing

Posted by Apache Jenkins Server <je...@builds.apache.org>.
See https://builds.apache.org/job/Hadoop-Mapreduce-trunk/1265/

###################################################################################
########################## LAST 60 LINES OF THE CONSOLE ###########################
[...truncated 27921 lines...]
Running org.apache.hadoop.mapreduce.v2.app.webapp.TestAMWebServices
Tests run: 11, Failures: 0, Errors: 0, Skipped: 0, Time elapsed: 5.52 sec
Running org.apache.hadoop.mapreduce.v2.app.webapp.TestAMWebServicesAttempts
Tests run: 15, Failures: 0, Errors: 0, Skipped: 0, Time elapsed: 6.751 sec
Running org.apache.hadoop.mapreduce.v2.app.webapp.TestAMWebServicesJobConf
Tests run: 4, Failures: 0, Errors: 0, Skipped: 0, Time elapsed: 4.211 sec
Running org.apache.hadoop.mapreduce.v2.app.webapp.TestAMWebServicesTasks
Tests run: 20, Failures: 0, Errors: 0, Skipped: 0, Time elapsed: 8.007 sec
Running org.apache.hadoop.mapreduce.v2.app.TestKill
Tests run: 4, Failures: 0, Errors: 0, Skipped: 0, Time elapsed: 7.387 sec
Running org.apache.hadoop.mapreduce.v2.app.TestStagingCleanup
Tests run: 4, Failures: 0, Errors: 0, Skipped: 0, Time elapsed: 11.997 sec
Running org.apache.hadoop.mapreduce.v2.app.launcher.TestContainerLauncherImpl
Tests run: 3, Failures: 0, Errors: 0, Skipped: 0, Time elapsed: 1.546 sec
Running org.apache.hadoop.mapreduce.v2.app.launcher.TestContainerLauncher
Tests run: 3, Failures: 0, Errors: 0, Skipped: 0, Time elapsed: 12.937 sec
Running org.apache.hadoop.mapreduce.jobhistory.TestJobHistoryEventHandler
Tests run: 5, Failures: 0, Errors: 0, Skipped: 0, Time elapsed: 10.067 sec

Results :

Tests run: 180, Failures: 0, Errors: 0, Skipped: 0

[INFO] ------------------------------------------------------------------------
[INFO] Reactor Summary:
[INFO] 
[INFO] hadoop-mapreduce-client ........................... SUCCESS [1.692s]
[INFO] hadoop-mapreduce-client-core ...................... SUCCESS [18.158s]
[INFO] hadoop-mapreduce-client-common .................... SUCCESS [21.949s]
[INFO] hadoop-mapreduce-client-shuffle ................... SUCCESS [1.618s]
[INFO] hadoop-mapreduce-client-app ....................... FAILURE [4:41.611s]
[INFO] hadoop-mapreduce-client-hs ........................ SKIPPED
[INFO] hadoop-mapreduce-client-jobclient ................. SKIPPED
[INFO] Apache Hadoop MapReduce Examples .................. SKIPPED
[INFO] hadoop-mapreduce .................................. SKIPPED
[INFO] ------------------------------------------------------------------------
[INFO] BUILD FAILURE
[INFO] ------------------------------------------------------------------------
[INFO] Total time: 5:25.580s
[INFO] Finished at: Thu Nov 22 13:23:12 UTC 2012
[INFO] Final Memory: 21M/211M
[INFO] ------------------------------------------------------------------------
[ERROR] Failed to execute goal org.apache.maven.plugins:maven-surefire-plugin:2.12.3:test (default-test) on project hadoop-mapreduce-client-app: ExecutionException; nested exception is java.util.concurrent.ExecutionException: java.lang.RuntimeException: The forked VM terminated without saying properly goodbye. VM crash or System.exit called ? -> [Help 1]
[ERROR] 
[ERROR] To see the full stack trace of the errors, re-run Maven with the -e switch.
[ERROR] Re-run Maven using the -X switch to enable full debug logging.
[ERROR] 
[ERROR] For more information about the errors and possible solutions, please read the following articles:
[ERROR] [Help 1] http://cwiki.apache.org/confluence/display/MAVEN/MojoExecutionException
[ERROR] 
[ERROR] After correcting the problems, you can resume the build with the command
[ERROR]   mvn <goals> -rf :hadoop-mapreduce-client-app
Build step 'Execute shell' marked build as failure
[FINDBUGS] Skipping publisher since build result is FAILURE
Archiving artifacts
Updating MAPREDUCE-4811
Updating HDFS-4216
Email was triggered for: Failure
Sending email for trigger: Failure



###################################################################################
############################## FAILED TESTS (if any) ##############################
No tests ran.

Hadoop-Mapreduce-trunk - Build # 1264 - Still Failing

Posted by Apache Jenkins Server <je...@builds.apache.org>.
See https://builds.apache.org/job/Hadoop-Mapreduce-trunk/1264/

###################################################################################
########################## LAST 60 LINES OF THE CONSOLE ###########################
[...truncated 27930 lines...]
Tests run: 15, Failures: 0, Errors: 0, Skipped: 0, Time elapsed: 6.759 sec
Running org.apache.hadoop.mapreduce.v2.app.webapp.TestAMWebServicesJobConf
Tests run: 4, Failures: 0, Errors: 0, Skipped: 0, Time elapsed: 4.219 sec
Running org.apache.hadoop.mapreduce.v2.app.webapp.TestAMWebServicesTasks
Tests run: 20, Failures: 0, Errors: 0, Skipped: 0, Time elapsed: 7.966 sec
Running org.apache.hadoop.mapreduce.v2.app.TestKill
Tests run: 4, Failures: 0, Errors: 0, Skipped: 0, Time elapsed: 6.908 sec
Running org.apache.hadoop.mapreduce.v2.app.TestStagingCleanup
Tests run: 4, Failures: 0, Errors: 0, Skipped: 0, Time elapsed: 11.981 sec
Running org.apache.hadoop.mapreduce.v2.app.launcher.TestContainerLauncherImpl
Tests run: 3, Failures: 0, Errors: 0, Skipped: 0, Time elapsed: 1.544 sec
Running org.apache.hadoop.mapreduce.v2.app.launcher.TestContainerLauncher
Tests run: 3, Failures: 0, Errors: 0, Skipped: 0, Time elapsed: 12.887 sec
Running org.apache.hadoop.mapreduce.jobhistory.TestJobHistoryEventHandler
Tests run: 5, Failures: 0, Errors: 0, Skipped: 0, Time elapsed: 10.083 sec

Results :

Tests run: 180, Failures: 0, Errors: 0, Skipped: 0

[INFO] ------------------------------------------------------------------------
[INFO] Reactor Summary:
[INFO] 
[INFO] hadoop-mapreduce-client ........................... SUCCESS [3.125s]
[INFO] hadoop-mapreduce-client-core ...................... SUCCESS [17.871s]
[INFO] hadoop-mapreduce-client-common .................... SUCCESS [21.903s]
[INFO] hadoop-mapreduce-client-shuffle ................... SUCCESS [1.626s]
[INFO] hadoop-mapreduce-client-app ....................... FAILURE [4:42.801s]
[INFO] hadoop-mapreduce-client-hs ........................ SKIPPED
[INFO] hadoop-mapreduce-client-jobclient ................. SKIPPED
[INFO] Apache Hadoop MapReduce Examples .................. SKIPPED
[INFO] hadoop-mapreduce .................................. SKIPPED
[INFO] ------------------------------------------------------------------------
[INFO] BUILD FAILURE
[INFO] ------------------------------------------------------------------------
[INFO] Total time: 5:27.896s
[INFO] Finished at: Wed Nov 21 13:21:37 UTC 2012
[INFO] Final Memory: 20M/196M
[INFO] ------------------------------------------------------------------------
[ERROR] Failed to execute goal org.apache.maven.plugins:maven-surefire-plugin:2.12.3:test (default-test) on project hadoop-mapreduce-client-app: ExecutionException; nested exception is java.util.concurrent.ExecutionException: java.lang.RuntimeException: The forked VM terminated without saying properly goodbye. VM crash or System.exit called ? -> [Help 1]
[ERROR] 
[ERROR] To see the full stack trace of the errors, re-run Maven with the -e switch.
[ERROR] Re-run Maven using the -X switch to enable full debug logging.
[ERROR] 
[ERROR] For more information about the errors and possible solutions, please read the following articles:
[ERROR] [Help 1] http://cwiki.apache.org/confluence/display/MAVEN/MojoExecutionException
[ERROR] 
[ERROR] After correcting the problems, you can resume the build with the command
[ERROR]   mvn <goals> -rf :hadoop-mapreduce-client-app
Build step 'Execute shell' marked build as failure
[FINDBUGS] Skipping publisher since build result is FAILURE
Archiving artifacts
Updating HADOOP-9042
Updating HADOOP-9049
Updating HADOOP-9075
Updating HDFS-4215
Updating HADOOP-9072
Email was triggered for: Failure
Sending email for trigger: Failure



###################################################################################
############################## FAILED TESTS (if any) ##############################
No tests ran.