You are viewing a plain text version of this content. The canonical link for it is here.
Posted to dev@curator.apache.org by Apache Jenkins Server <je...@builds.apache.org> on 2017/07/21 03:10:23 UTC

Build failed in Jenkins: Curator #1069

See <https://builds.apache.org/job/Curator/1069/display/redirect?page=changes>

Changes:

[randgalt] Adding @Test to the class caused testApiPermutations to run. So, added a

------------------------------------------
[...truncated 1.30 MB...]
[INFO] 
[INFO] --- maven-remote-resources-plugin:1.5:process (default) @ curator-test-zk34 ---
[INFO] 
[INFO] --- maven-resources-plugin:2.7:resources (default-resources) @ curator-test-zk34 ---
[INFO] Using 'UTF-8' encoding to copy filtered resources.
[INFO] Copying 0 resource to META-INF
[INFO] Copying 3 resources
[INFO] 
[INFO] --- maven-compiler-plugin:3.2:compile (default-compile) @ curator-test-zk34 ---
[INFO] No sources to compile
[INFO] 
[INFO] >>> clirr-maven-plugin:2.8:check (default) > compile @ curator-test-zk34 >>>
[INFO] 
[INFO] --- maven-resources-plugin:2.7:copy-resources (copy-curator-test-classes) @ curator-test-zk34 ---
[INFO] Using 'UTF-8' encoding to copy filtered resources.
[INFO] Copying 4 resources
[INFO] 
[INFO] --- maven-remote-resources-plugin:1.5:process (default) @ curator-test-zk34 ---
[INFO] 
[INFO] --- maven-resources-plugin:2.7:resources (default-resources) @ curator-test-zk34 ---
[INFO] Using 'UTF-8' encoding to copy filtered resources.
[INFO] Copying 0 resource to META-INF
[INFO] Copying 3 resources
[INFO] Copying 3 resources
[INFO] 
[INFO] --- maven-compiler-plugin:3.2:compile (default-compile) @ curator-test-zk34 ---
[INFO] No sources to compile
[WARNING] Failed to getClass for org.codehaus.mojo.clirr.ClirrCheckMojo
[CHECKSTYLE] No report found for mojo check[INFO] 
[INFO] <<< clirr-maven-plugin:2.8:check (default) < compile @ curator-test-zk34 <<<

[INFO] 
[INFO] --- clirr-maven-plugin:2.8:check (default) @ curator-test-zk34 ---
[INFO] artifact org.apache.curator:curator-test-zk34: checking for updates from Nexus
[INFO] artifact org.apache.curator:curator-test-zk34: checking for updates from central
[INFO] Unable to find a previous version of the project in the repository
[INFO] Not generating Clirr report as there is no previous version of the library to compare against
[CHECKSTYLE] No report found for mojo check[INFO] 
[INFO] --- maven-bundle-plugin:3.2.0:manifest (bundle-manifest) @ curator-test-zk34 ---

[INFO] 
[INFO] --- maven-resources-plugin:2.7:testResources (default-testResources) @ curator-test-zk34 ---
[INFO] Using 'UTF-8' encoding to copy filtered resources.
[INFO] Copying 1 resource
[INFO] Copying 3 resources
[INFO] 
[INFO] --- maven-compiler-plugin:3.2:testCompile (default-testCompile) @ curator-test-zk34 ---
[INFO] Changes detected - recompiling the module!
[INFO] Compiling 6 source files to <https://builds.apache.org/job/Curator/ws/curator-test-zk34/target/test-classes>
[INFO] 
[INFO] --- maven-surefire-plugin:2.18.1:test (default-test) @ curator-test-zk34 ---
[INFO] Surefire report directory: <https://builds.apache.org/job/Curator/ws/curator-test-zk34/target/surefire-reports>

-------------------------------------------------------
 T E S T S
-------------------------------------------------------
Running org.apache.curator.test.TestCompatibility
Tests run: 5, Failures: 0, Errors: 0, Skipped: 0, Time elapsed: 6.11 sec - in org.apache.curator.test.TestCompatibility
Running org.apache.curator.framework.schema.TestSchema
Tests run: 0, Failures: 0, Errors: 0, Skipped: 0, Time elapsed: 0.222 sec - in org.apache.curator.framework.schema.TestSchema
Running org.apache.curator.framework.imps.TestCompression
Tests run: 3, Failures: 0, Errors: 0, Skipped: 0, Time elapsed: 4.122 sec - in org.apache.curator.framework.imps.TestCompression
Running org.apache.curator.framework.imps.TestReconfiguration
Tests run: 0, Failures: 0, Errors: 0, Skipped: 0, Time elapsed: 0.32 sec - in org.apache.curator.framework.imps.TestReconfiguration
Running org.apache.curator.framework.imps.TestRemoveWatches
Running org.apache.curator.framework.imps.TestCreate
Tests run: 6, Failures: 0, Errors: 0, Skipped: 0, Time elapsed: 10.297 sec - in org.apache.curator.framework.imps.TestCreate
Running org.apache.curator.framework.imps.TestFailedDeleteManager
Tests run: 6, Failures: 0, Errors: 0, Skipped: 0, Time elapsed: 123.481 sec - in org.apache.curator.framework.imps.TestFailedDeleteManager
Running org.apache.curator.framework.imps.TestWithCluster
Tests run: 2, Failures: 0, Errors: 0, Skipped: 0, Time elapsed: 196.686 sec - in org.apache.curator.framework.imps.TestWithCluster
Running org.apache.curator.framework.imps.TestExistsBuilder
Tests run: 2, Failures: 0, Errors: 0, Skipped: 0, Time elapsed: 4.034 sec - in org.apache.curator.framework.imps.TestExistsBuilder
Running org.apache.curator.framework.imps.TestBlockUntilConnected
Tests run: 6, Failures: 0, Errors: 0, Skipped: 0, Time elapsed: 24.318 sec - in org.apache.curator.framework.imps.TestBlockUntilConnected
Running org.apache.curator.framework.imps.TestReadOnly
Tests run: 2, Failures: 0, Errors: 0, Skipped: 0, Time elapsed: 68.745 sec - in org.apache.curator.framework.imps.TestReadOnly
Running org.apache.curator.framework.imps.TestTempFramework
Tests run: 2, Failures: 0, Errors: 0, Skipped: 0, Time elapsed: 4.939 sec - in org.apache.curator.framework.imps.TestTempFramework
Running org.apache.curator.framework.imps.TestCompressionInTransactionOld
Tests run: 4, Failures: 0, Errors: 0, Skipped: 0, Time elapsed: 5.163 sec - in org.apache.curator.framework.imps.TestCompressionInTransactionOld
Running org.apache.curator.framework.imps.TestEnsureContainers
Tests run: 2, Failures: 0, Errors: 0, Skipped: 0, Time elapsed: 2.991 sec - in org.apache.curator.framework.imps.TestEnsureContainers
Running org.apache.curator.framework.imps.TestCreateReturningStat
Tests run: 0, Failures: 0, Errors: 0, Skipped: 0, Time elapsed: 0.306 sec - in org.apache.curator.framework.imps.TestCreateReturningStat
Running org.apache.curator.framework.imps.TestTransactionsNew
Tests run: 6, Failures: 0, Errors: 0, Skipped: 0, Time elapsed: 9.252 sec - in org.apache.curator.framework.imps.TestTransactionsNew
Running org.apache.curator.framework.imps.TestCompressionInTransactionNew
Tests run: 4, Failures: 0, Errors: 0, Skipped: 0, Time elapsed: 5.259 sec - in org.apache.curator.framework.imps.TestCompressionInTransactionNew
Running org.apache.curator.framework.imps.TestFramework
Tests run: 34, Failures: 0, Errors: 0, Skipped: 0, Time elapsed: 156.87 sec - in org.apache.curator.framework.imps.TestFramework
Running org.apache.curator.framework.imps.TestNamespaceFacade
Tests run: 9, Failures: 0, Errors: 0, Skipped: 0, Time elapsed: 10.517 sec - in org.apache.curator.framework.imps.TestNamespaceFacade
Running org.apache.curator.framework.imps.TestCleanState
Tests run: 0, Failures: 0, Errors: 0, Skipped: 0, Time elapsed: 0.209 sec - in org.apache.curator.framework.imps.TestCleanState
Running org.apache.curator.framework.imps.TestNeverConnected
Tests run: 1, Failures: 0, Errors: 0, Skipped: 0, Time elapsed: 1.696 sec - in org.apache.curator.framework.imps.TestNeverConnected
Running org.apache.curator.framework.imps.TestFrameworkBackground
Tests run: 6, Failures: 0, Errors: 0, Skipped: 0, Time elapsed: 47.246 sec - in org.apache.curator.framework.imps.TestFrameworkBackground
Running org.apache.curator.framework.imps.TestFrameworkEdges
Tests run: 16, Failures: 0, Errors: 0, Skipped: 0, Time elapsed: 170.114 sec - in org.apache.curator.framework.imps.TestFrameworkEdges
Running org.apache.curator.framework.imps.TestEnabledSessionExpiredState
Tests run: 6, Failures: 0, Errors: 0, Skipped: 0, Time elapsed: 134.321 sec - in org.apache.curator.framework.imps.TestEnabledSessionExpiredState
Running org.apache.curator.framework.imps.TestMultiClient
Tests run: 1, Failures: 0, Errors: 0, Skipped: 0, Time elapsed: 1.892 sec - in org.apache.curator.framework.imps.TestMultiClient
Running org.apache.curator.framework.imps.TestTransactionsOld
Tests run: 4, Failures: 0, Errors: 0, Skipped: 0, Time elapsed: 5.216 sec - in org.apache.curator.framework.imps.TestTransactionsOld
Running org.apache.curator.framework.imps.TestTtlNodes
Tests run: 0, Failures: 0, Errors: 0, Skipped: 0, Time elapsed: 0.288 sec - in org.apache.curator.framework.imps.TestTtlNodes
Running org.apache.curator.framework.imps.TestWatcherIdentity
Tests run: 5, Failures: 0, Errors: 0, Skipped: 0, Time elapsed: 36.385 sec - in org.apache.curator.framework.imps.TestWatcherIdentity
Running org.apache.curator.framework.imps.TestWatcherRemovalManager
Tests run: 0, Failures: 0, Errors: 0, Skipped: 0, Time elapsed: 0.307 sec - in org.apache.curator.framework.imps.TestWatcherRemovalManager
Running org.apache.curator.framework.recipes.shared.TestSharedCount
Tests run: 8, Failures: 0, Errors: 0, Skipped: 0, Time elapsed: 57.217 sec - in org.apache.curator.framework.recipes.shared.TestSharedCount
Running org.apache.curator.framework.recipes.queue.TestSimpleDistributedQueue
Tests run: 14, Failures: 0, Errors: 0, Skipped: 0, Time elapsed: 94.477 sec - in org.apache.curator.framework.recipes.queue.TestSimpleDistributedQueue
Running org.apache.curator.framework.recipes.queue.TestDistributedQueue
Tests run: 11, Failures: 0, Errors: 0, Skipped: 0, Time elapsed: 272.039 sec - in org.apache.curator.framework.recipes.queue.TestDistributedQueue
Running org.apache.curator.framework.recipes.queue.TestDistributedIdQueue
Tests run: 3, Failures: 0, Errors: 0, Skipped: 0, Time elapsed: 7.272 sec - in org.apache.curator.framework.recipes.queue.TestDistributedIdQueue
Running org.apache.curator.framework.recipes.queue.TestQueueItem
Tests run: 0, Failures: 0, Errors: 0, Skipped: 0, Time elapsed: 0.221 sec - in org.apache.curator.framework.recipes.queue.TestQueueItem
Running org.apache.curator.framework.recipes.queue.TestDistributedDelayQueue
Tests run: 4, Failures: 0, Errors: 0, Skipped: 0, Time elapsed: 27.017 sec - in org.apache.curator.framework.recipes.queue.TestDistributedDelayQueue
Running org.apache.curator.framework.recipes.queue.TestQueueSharder
Tests run: 3, Failures: 0, Errors: 0, Skipped: 0, Time elapsed: 134.526 sec - in org.apache.curator.framework.recipes.queue.TestQueueSharder
Running org.apache.curator.framework.recipes.queue.TestDistributedPriorityQueue
Tests run: 4, Failures: 0, Errors: 0, Skipped: 0, Time elapsed: 21.587 sec - in org.apache.curator.framework.recipes.queue.TestDistributedPriorityQueue
Running org.apache.curator.framework.recipes.queue.TestBoundedDistributedQueue
Tests run: 2, Failures: 0, Errors: 0, Skipped: 0, Time elapsed: 91.289 sec - in org.apache.curator.framework.recipes.queue.TestBoundedDistributedQueue
Running org.apache.curator.framework.recipes.locks.TestInterProcessReadWriteLock
Tests run: 6, Failures: 0, Errors: 0, Skipped: 0, Time elapsed: 31.07 sec - in org.apache.curator.framework.recipes.locks.TestInterProcessReadWriteLock
Running org.apache.curator.framework.recipes.locks.TestInterProcessMultiMutex
Tests run: 11, Failures: 0, Errors: 0, Skipped: 0, Time elapsed: 74.016 sec - in org.apache.curator.framework.recipes.locks.TestInterProcessMultiMutex
Running org.apache.curator.framework.recipes.locks.TestInterProcessSemaphore
Tests run: 12, Failures: 0, Errors: 0, Skipped: 0, Time elapsed: 913.258 sec - in org.apache.curator.framework.recipes.locks.TestInterProcessSemaphore
Running org.apache.curator.framework.recipes.locks.TestInterProcessMutexBase
Tests run: 0, Failures: 0, Errors: 0, Skipped: 0, Time elapsed: 0.28 sec - in org.apache.curator.framework.recipes.locks.TestInterProcessMutexBase
Running org.apache.curator.framework.recipes.locks.TestReaper
Tests run: 16, Failures: 0, Errors: 0, Skipped: 0, Time elapsed: 299.458 sec - in org.apache.curator.framework.recipes.locks.TestReaper
Running org.apache.curator.framework.recipes.locks.TestLockCleanlinessWithFaults
Tests run: 1, Failures: 0, Errors: 0, Skipped: 0, Time elapsed: 1.928 sec - in org.apache.curator.framework.recipes.locks.TestLockCleanlinessWithFaults
Running org.apache.curator.framework.recipes.locks.TestInterProcessSemaphoreMutex

Results :

Tests run: 227, Failures: 0, Errors: 0, Skipped: 0

[JENKINS] Recording test results
[INFO] ------------------------------------------------------------------------
[INFO] Reactor Summary:
[INFO] 
[INFO] Apache Curator ..................................... SUCCESS [ 11.699 s]
[INFO] Curator Testing .................................... SUCCESS [01:03 min]
[INFO] Curator Client ..................................... SUCCESS [ 53.807 s]
[INFO] Curator Framework .................................. SUCCESS [37:33 min]
[INFO] Curator Recipes .................................... SUCCESS [  02:37 h]
[INFO] Curator Service Discovery .......................... SUCCESS [02:41 min]
[INFO] Curator Async ...................................... SUCCESS [11:01 min]
[INFO] Curator Examples ................................... SUCCESS [  6.051 s]
[INFO] Curator Service Discovery Server ................... SUCCESS [ 17.451 s]
[INFO] Curator RPC Proxy .................................. SUCCESS [ 15.009 s]
[INFO] curator-test-zk34 .................................. FAILURE [  01:00 h]
[INFO] ------------------------------------------------------------------------
[INFO] BUILD FAILURE
[INFO] ------------------------------------------------------------------------
[INFO] Total time: 04:32 h
[INFO] Finished at: 2017-07-21T03:09:55+00:00
[INFO] Final Memory: 49M/1768M
[INFO] ------------------------------------------------------------------------
Waiting for Jenkins to finish collecting data
[ERROR] Failed to execute goal org.apache.maven.plugins:maven-surefire-plugin:2.18.1:test (default-test) on project curator-test-zk34: ExecutionException: java.lang.RuntimeException: There was an error in the forked process
[ERROR] java.lang.ArrayStoreException: sun.reflect.annotation.TypeNotPresentExceptionProxy
[ERROR] at sun.reflect.annotation.AnnotationParser.parseClassArray(AnnotationParser.java:724)
[ERROR] at sun.reflect.annotation.AnnotationParser.parseArray(AnnotationParser.java:531)
[ERROR] at sun.reflect.annotation.AnnotationParser.parseMemberValue(AnnotationParser.java:355)
[ERROR] at sun.reflect.annotation.AnnotationParser.parseAnnotation2(AnnotationParser.java:286)
[ERROR] at sun.reflect.annotation.AnnotationParser.parseAnnotations2(AnnotationParser.java:120)
[ERROR] at sun.reflect.annotation.AnnotationParser.parseAnnotations(AnnotationParser.java:72)
[ERROR] at java.lang.reflect.Executable.declaredAnnotations(Executable.java:599)
[ERROR] at java.lang.reflect.Executable.declaredAnnotations(Executable.java:597)
[ERROR] at java.lang.reflect.Executable.getAnnotation(Executable.java:570)
[ERROR] at java.lang.reflect.Method.getAnnotation(Method.java:622)
[ERROR] at org.testng.internal.annotations.JDK15AnnotationFinder.findAnnotation(JDK15AnnotationFinder.java:111)
[ERROR] at org.testng.internal.TestNGClassFinder.<init>(TestNGClassFinder.java:77)
[ERROR] at org.testng.internal.TestNGClassFinder.<init>(TestNGClassFinder.java:40)
[ERROR] at org.testng.TestRunner.initMethods(TestRunner.java:403)
[ERROR] at org.testng.TestRunner.init(TestRunner.java:252)
[ERROR] at org.testng.TestRunner.init(TestRunner.java:222)
[ERROR] at org.testng.TestRunner.<init>(TestRunner.java:163)
[ERROR] at org.testng.SuiteRunner$DefaultTestRunnerFactory.newTestRunner(SuiteRunner.java:585)
[ERROR] at org.testng.SuiteRunner.init(SuiteRunner.java:189)
[ERROR] at org.testng.SuiteRunner.<init>(SuiteRunner.java:136)
[ERROR] at org.testng.TestNG.createSuiteRunner(TestNG.java:1375)
[ERROR] at org.testng.TestNG.createSuiteRunners(TestNG.java:1355)
[ERROR] at org.testng.TestNG.runSuitesLocally(TestNG.java:1209)
[ERROR] at org.testng.TestNG.runSuites(TestNG.java:1133)
[ERROR] at org.testng.TestNG.run(TestNG.java:1104)
[ERROR] at org.apache.maven.surefire.testng.TestNGExecutor.run(TestNGExecutor.java:115)
[ERROR] at org.apache.maven.surefire.testng.TestNGDirectoryTestSuite.executeSingleClass(TestNGDirectoryTestSuite.java:129)
[ERROR] at org.apache.maven.surefire.testng.TestNGDirectoryTestSuite.execute(TestNGDirectoryTestSuite.java:113)
[ERROR] at org.apache.maven.surefire.testng.TestNGProvider.invoke(TestNGProvider.java:111)
[ERROR] at org.apache.maven.surefire.booter.ForkedBooter.invokeProviderInSameClassLoader(ForkedBooter.java:203)
[ERROR] at org.apache.maven.surefire.booter.ForkedBooter.runSuitesInProcess(ForkedBooter.java:155)
[ERROR] at org.apache.maven.surefire.booter.ForkedBooter.main(ForkedBooter.java:103)
[ERROR] -> [Help 1]
[ERROR] 
[ERROR] To see the full stack trace of the errors, re-run Maven with the -e switch.
[ERROR] Re-run Maven using the -X switch to enable full debug logging.
[ERROR] 
[ERROR] For more information about the errors and possible solutions, please read the following articles:
[ERROR] [Help 1] http://cwiki.apache.org/confluence/display/MAVEN/MojoFailureException
[ERROR] 
[ERROR] After correcting the problems, you can resume the build with the command
[ERROR]   mvn <goals> -rf :curator-test-zk34
[JENKINS] Archiving <https://builds.apache.org/job/Curator/ws/pom.xml> to org.apache.curator/apache-curator/3.3.1-SNAPSHOT/apache-curator-3.3.1-SNAPSHOT.pom
[JENKINS] Archiving <https://builds.apache.org/job/Curator/ws/target/apache-curator-3.3.1-SNAPSHOT-site.xml> to org.apache.curator/apache-curator/3.3.1-SNAPSHOT/apache-curator-3.3.1-SNAPSHOT-site.xml
[Fast Archiver] No artifacts from Curator » Apache Curator #1068 to compare, so performing full copy of artifacts
[JENKINS] Archiving <https://builds.apache.org/job/Curator/ws/curator-x-rpc/pom.xml> to org.apache.curator/curator-x-rpc/3.3.1-SNAPSHOT/curator-x-rpc-3.3.1-SNAPSHOT.pom
[JENKINS] Archiving <https://builds.apache.org/job/Curator/ws/curator-x-rpc/target/curator-x-rpc-3.3.1-SNAPSHOT.jar> to org.apache.curator/curator-x-rpc/3.3.1-SNAPSHOT/curator-x-rpc-3.3.1-SNAPSHOT.jar
[JENKINS] Archiving <https://builds.apache.org/job/Curator/ws/curator-test/pom.xml> to org.apache.curator/curator-test/3.3.1-SNAPSHOT/curator-test-3.3.1-SNAPSHOT.pom
[JENKINS] Archiving <https://builds.apache.org/job/Curator/ws/curator-test/target/curator-test-3.3.1-SNAPSHOT.jar> to org.apache.curator/curator-test/3.3.1-SNAPSHOT/curator-test-3.3.1-SNAPSHOT.jar
[Fast Archiver] No artifacts from Curator » Curator Testing #1068 to compare, so performing full copy of artifacts
[JENKINS] Archiving <https://builds.apache.org/job/Curator/ws/curator-test-zk34/pom.xml> to org.apache.curator/curator-test-zk34/3.3.1-SNAPSHOT/curator-test-zk34-3.3.1-SNAPSHOT.pom
[Fast Archiver] No prior successful build to compare, so performing full copy of artifacts
[JENKINS] Archiving <https://builds.apache.org/job/Curator/ws/curator-x-async/pom.xml> to org.apache.curator/curator-x-async/3.3.1-SNAPSHOT/curator-x-async-3.3.1-SNAPSHOT.pom
[JENKINS] Archiving <https://builds.apache.org/job/Curator/ws/curator-x-async/target/curator-x-async-3.3.1-SNAPSHOT.jar> to org.apache.curator/curator-x-async/3.3.1-SNAPSHOT/curator-x-async-3.3.1-SNAPSHOT.jar
[JENKINS] Archiving <https://builds.apache.org/job/Curator/ws/curator-examples/pom.xml> to org.apache.curator/curator-examples/3.3.1-SNAPSHOT/curator-examples-3.3.1-SNAPSHOT.pom
[JENKINS] Archiving <https://builds.apache.org/job/Curator/ws/curator-examples/target/curator-examples-3.3.1-SNAPSHOT.jar> to org.apache.curator/curator-examples/3.3.1-SNAPSHOT/curator-examples-3.3.1-SNAPSHOT.jar
[JENKINS] Archiving <https://builds.apache.org/job/Curator/ws/curator-x-discovery/pom.xml> to org.apache.curator/curator-x-discovery/3.3.1-SNAPSHOT/curator-x-discovery-3.3.1-SNAPSHOT.pom
[JENKINS] Archiving <https://builds.apache.org/job/Curator/ws/curator-x-discovery/target/curator-x-discovery-3.3.1-SNAPSHOT.jar> to org.apache.curator/curator-x-discovery/3.3.1-SNAPSHOT/curator-x-discovery-3.3.1-SNAPSHOT.jar
[JENKINS] Archiving <https://builds.apache.org/job/Curator/ws/curator-recipes/pom.xml> to org.apache.curator/curator-recipes/3.3.1-SNAPSHOT/curator-recipes-3.3.1-SNAPSHOT.pom
[JENKINS] Archiving <https://builds.apache.org/job/Curator/ws/curator-recipes/target/curator-recipes-3.3.1-SNAPSHOT.jar> to org.apache.curator/curator-recipes/3.3.1-SNAPSHOT/curator-recipes-3.3.1-SNAPSHOT.jar
[JENKINS] Archiving <https://builds.apache.org/job/Curator/ws/curator-recipes/target/curator-recipes-3.3.1-SNAPSHOT-tests.jar> to org.apache.curator/curator-recipes/3.3.1-SNAPSHOT/curator-recipes-3.3.1-SNAPSHOT-tests.jar
[JENKINS] Archiving <https://builds.apache.org/job/Curator/ws/curator-x-discovery-server/pom.xml> to org.apache.curator/curator-x-discovery-server/3.3.1-SNAPSHOT/curator-x-discovery-server-3.3.1-SNAPSHOT.pom
[JENKINS] Archiving <https://builds.apache.org/job/Curator/ws/curator-x-discovery-server/target/curator-x-discovery-server-3.3.1-SNAPSHOT.jar> to org.apache.curator/curator-x-discovery-server/3.3.1-SNAPSHOT/curator-x-discovery-server-3.3.1-SNAPSHOT.jar
[JENKINS] Archiving <https://builds.apache.org/job/Curator/ws/curator-client/pom.xml> to org.apache.curator/curator-client/3.3.1-SNAPSHOT/curator-client-3.3.1-SNAPSHOT.pom
[JENKINS] Archiving <https://builds.apache.org/job/Curator/ws/curator-client/target/curator-client-3.3.1-SNAPSHOT.jar> to org.apache.curator/curator-client/3.3.1-SNAPSHOT/curator-client-3.3.1-SNAPSHOT.jar
[Fast Archiver] No artifacts from Curator » Curator Client #1068 to compare, so performing full copy of artifacts
[JENKINS] Archiving <https://builds.apache.org/job/Curator/ws/curator-framework/pom.xml> to org.apache.curator/curator-framework/3.3.1-SNAPSHOT/curator-framework-3.3.1-SNAPSHOT.pom
[JENKINS] Archiving <https://builds.apache.org/job/Curator/ws/curator-framework/target/curator-framework-3.3.1-SNAPSHOT.jar> to org.apache.curator/curator-framework/3.3.1-SNAPSHOT/curator-framework-3.3.1-SNAPSHOT.jar
[JENKINS] Archiving <https://builds.apache.org/job/Curator/ws/curator-framework/target/curator-framework-3.3.1-SNAPSHOT-tests.jar> to org.apache.curator/curator-framework/3.3.1-SNAPSHOT/curator-framework-3.3.1-SNAPSHOT-tests.jar
[Fast Archiver] No artifacts from Curator » Curator Framework #1068 to compare, so performing full copy of artifacts
Sending e-mails to: dev@curator.apache.org
Sending e-mails to: dev@curator.apache.org
Sending e-mails to: dev@curator.apache.org
Sending e-mails to: dev@curator.apache.org
channel stopped

Jenkins build is back to stable : Curator #1073

Posted by Apache Jenkins Server <je...@builds.apache.org>.
See <https://builds.apache.org/job/Curator/1073/display/redirect>


Jenkins build is unstable: Curator #1072

Posted by Apache Jenkins Server <je...@builds.apache.org>.
See <https://builds.apache.org/job/Curator/1072/display/redirect>


Build failed in Jenkins: Curator #1071

Posted by Apache Jenkins Server <je...@builds.apache.org>.
See <https://builds.apache.org/job/Curator/1071/display/redirect>

------------------------------------------
Started by user randgalt
[EnvInject] - Loading node environment variables.
Building remotely on qnode3 (ubuntu) in workspace <https://builds.apache.org/job/Curator/ws/>
Wiping out workspace first.
Cloning the remote Git repository
Cloning repository https://git-wip-us.apache.org/repos/asf/curator.git
 > git init <https://builds.apache.org/job/Curator/ws/> # timeout=10
Fetching upstream changes from https://git-wip-us.apache.org/repos/asf/curator.git
 > git --version # timeout=10
 > git fetch --tags --progress https://git-wip-us.apache.org/repos/asf/curator.git +refs/heads/*:refs/remotes/origin/*
 > git config remote.origin.url https://git-wip-us.apache.org/repos/asf/curator.git # timeout=10
 > git config --add remote.origin.fetch +refs/heads/*:refs/remotes/origin/* # timeout=10
 > git config remote.origin.url https://git-wip-us.apache.org/repos/asf/curator.git # timeout=10
Fetching upstream changes from https://git-wip-us.apache.org/repos/asf/curator.git
 > git fetch --tags --progress https://git-wip-us.apache.org/repos/asf/curator.git +refs/heads/*:refs/remotes/origin/*
 > git rev-parse origin/master^{commit} # timeout=10
Checking out Revision 95b70d2b4b04ca86194cbf54e9b5dc1869b36b3b (origin/master)
Commit message: "Squashed commit of the following:"
 > git config core.sparsecheckout # timeout=10
 > git checkout -f 95b70d2b4b04ca86194cbf54e9b5dc1869b36b3b
 > git rev-list 95b70d2b4b04ca86194cbf54e9b5dc1869b36b3b # timeout=10
Parsing POMs
Modules changed, recalculating dependency graph
Established TCP socket on 34387
maven32-agent.jar already up to date
maven32-interceptor.jar already up to date
maven3-interceptor-commons.jar already up to date
[Curator] $ /home/jenkins/tools/java/latest1.8/bin/java -Xmx2g -Xms256m -cp /home/jenkins/jenkins-slave/maven32-agent.jar:/home/jenkins/tools/maven/apache-maven-3.2.5/boot/plexus-classworlds-2.5.2.jar:/home/jenkins/tools/maven/apache-maven-3.2.5/conf/logging jenkins.maven3.agent.Maven32Main /home/jenkins/tools/maven/apache-maven-3.2.5 /home/jenkins/jenkins-slave/slave.jar /home/jenkins/jenkins-slave/maven32-interceptor.jar /home/jenkins/jenkins-slave/maven3-interceptor-commons.jar 34387
<===[JENKINS REMOTING CAPACITY]===>   channel started
Executing Maven:  -B -f <https://builds.apache.org/job/Curator/ws/pom.xml> -Dmaven.repo.local=/home/jenkins/jenkins-slave/maven-repositories/1 -Dtest=TestMigrationManager test
[INFO] Scanning for projects...
[INFO] ------------------------------------------------------------------------
[INFO] Reactor Build Order:
[INFO] 
[INFO] Apache Curator
[INFO] Curator Testing
[INFO] Curator Client
[INFO] Curator Framework
[INFO] Curator Recipes
[INFO] Curator Service Discovery
[INFO] Curator Async
[INFO] Curator Examples
[INFO] Curator Service Discovery Server
[INFO]                                                                         
[INFO] ------------------------------------------------------------------------
[INFO] Building Apache Curator 3.3.1-SNAPSHOT
[INFO] ------------------------------------------------------------------------
[INFO] Downloading: https://repo.maven.apache.org/maven2/com/mycila/maven-license-plugin/maven-license-plugin/1.9.0/maven-license-plugin-1.9.0.pom
[INFO] Downloaded: https://repo.maven.apache.org/maven2/com/mycila/maven-license-plugin/maven-license-plugin/1.9.0/maven-license-plugin-1.9.0.pom (11 KB at 21.5 KB/sec)
[INFO] Downloading: https://repo.maven.apache.org/maven2/com/mycila/parent-pom/5/parent-pom-5.pom
[INFO] Downloaded: https://repo.maven.apache.org/maven2/com/mycila/parent-pom/5/parent-pom-5.pom (9 KB at 438.9 KB/sec)
[INFO] Downloading: https://repo.maven.apache.org/maven2/com/mycila/maven-license-plugin/maven-license-plugin/1.9.0/maven-license-plugin-1.9.0.jar
[INFO] Downloaded: https://repo.maven.apache.org/maven2/com/mycila/maven-license-plugin/maven-license-plugin/1.9.0/maven-license-plugin-1.9.0.jar (54 KB at 1606.3 KB/sec)
[INFO] Downloading: https://repo.maven.apache.org/maven2/org/codehaus/mojo/clirr-maven-plugin/2.8/clirr-maven-plugin-2.8.pom
[INFO] Downloaded: https://repo.maven.apache.org/maven2/org/codehaus/mojo/clirr-maven-plugin/2.8/clirr-maven-plugin-2.8.pom (8 KB at 433.4 KB/sec)
[INFO] Downloading: https://repo.maven.apache.org/maven2/org/codehaus/mojo/clirr-maven-plugin/2.8/clirr-maven-plugin-2.8.jar
[INFO] Downloaded: https://repo.maven.apache.org/maven2/org/codehaus/mojo/clirr-maven-plugin/2.8/clirr-maven-plugin-2.8.jar (74 KB at 2717.1 KB/sec)
[INFO] 
[INFO] --- maven-remote-resources-plugin:1.5:process (default) @ apache-curator ---
[INFO] 
[INFO] >>> clirr-maven-plugin:2.8:check (default) > compile @ apache-curator >>>
[INFO] 
[INFO] --- maven-remote-resources-plugin:1.5:process (default) @ apache-curator ---
[WARNING] Failed to getClass for org.codehaus.mojo.clirr.ClirrCheckMojo
[CHECKSTYLE] No report found for mojo check[INFO] 
[INFO] <<< clirr-maven-plugin:2.8:check (default) < compile @ apache-curator <<<
[INFO] 
[INFO] --- clirr-maven-plugin:2.8:check (default) @ apache-curator ---

[INFO] Downloading: https://repo.maven.apache.org/maven2/org/apache/bcel/bcel/6.0/bcel-6.0.pom
[INFO] Downloaded: https://repo.maven.apache.org/maven2/org/apache/bcel/bcel/6.0/bcel-6.0.pom (19 KB at 912.5 KB/sec)
[INFO] Downloading: https://repo.maven.apache.org/maven2/org/apache/bcel/bcel/6.0/bcel-6.0.jar
[INFO] Downloaded: https://repo.maven.apache.org/maven2/org/apache/bcel/bcel/6.0/bcel-6.0.jar (656 KB at 7443.3 KB/sec)
[INFO] Not generating Clirr report as there are no classes generated by the project
[INFO] 
[CHECKSTYLE] No report found for mojo check[INFO] --- maven-bundle-plugin:3.2.0:manifest (bundle-manifest) @ apache-curator ---

[WARNING] Ignoring project type pom - supportedProjectTypes = [jar, war, bundle]
[INFO]                                                                         
[INFO] ------------------------------------------------------------------------
[INFO] Building Curator Testing 3.3.1-SNAPSHOT
[INFO] ------------------------------------------------------------------------
[INFO] Downloading: https://repo.maven.apache.org/maven2/org/apache/zookeeper/zookeeper/3.5.3-beta/zookeeper-3.5.3-beta.pom
[INFO] Downloaded: https://repo.maven.apache.org/maven2/org/apache/zookeeper/zookeeper/3.5.3-beta/zookeeper-3.5.3-beta.pom (5 KB at 326.3 KB/sec)
[INFO] Downloading: https://repo.maven.apache.org/maven2/org/apache/zookeeper/zookeeper/3.5.3-beta/zookeeper-3.5.3-beta.jar
[INFO] Downloaded: https://repo.maven.apache.org/maven2/org/apache/zookeeper/zookeeper/3.5.3-beta/zookeeper-3.5.3-beta.jar (1035 KB at 8339.1 KB/sec)
[INFO] 
[INFO] --- maven-remote-resources-plugin:1.5:process (default) @ curator-test ---
[INFO] 
[INFO] --- maven-resources-plugin:2.7:resources (default-resources) @ curator-test ---
[INFO] Using 'UTF-8' encoding to copy filtered resources.
[INFO] Copying 2 resources to META-INF
[INFO] Copying 3 resources
[INFO] 
[INFO] --- maven-compiler-plugin:3.2:compile (default-compile) @ curator-test ---
[INFO] Changes detected - recompiling the module!
[INFO] Compiling 17 source files to <https://builds.apache.org/job/Curator/ws/curator-test/target/classes>
[INFO] <https://builds.apache.org/job/Curator/ws/curator-test/src/main/java/org/apache/curator/test/WatchersDebug.java>: <https://builds.apache.org/job/Curator/ws/curator-test/src/main/java/org/apache/curator/test/WatchersDebug.java> uses unchecked or unsafe operations.
[INFO] <https://builds.apache.org/job/Curator/ws/curator-test/src/main/java/org/apache/curator/test/WatchersDebug.java>: Recompile with -Xlint:unchecked for details.
[INFO] 
[INFO] >>> clirr-maven-plugin:2.8:check (default) > compile @ curator-test >>>
[INFO] 
[INFO] --- maven-remote-resources-plugin:1.5:process (default) @ curator-test ---
[INFO] 
[INFO] --- maven-resources-plugin:2.7:resources (default-resources) @ curator-test ---
[INFO] Using 'UTF-8' encoding to copy filtered resources.
[INFO] Copying 2 resources to META-INF
[INFO] Copying 3 resources
[INFO] Copying 3 resources
[INFO] 
[INFO] --- maven-compiler-plugin:3.2:compile (default-compile) @ curator-test ---
[INFO] Nothing to compile - all classes are up to date
[WARNING] Failed to getClass for org.codehaus.mojo.clirr.ClirrCheckMojo
[CHECKSTYLE] No report found for mojo check[INFO] 
[INFO] <<< clirr-maven-plugin:2.8:check (default) < compile @ curator-test <<<
[INFO] 
[INFO] --- clirr-maven-plugin:2.8:check (default) @ curator-test ---
[INFO] artifact org.apache.curator:curator-test: checking for updates from Nexus

[INFO] artifact org.apache.curator:curator-test: checking for updates from central
[INFO] Comparing to version: 3.3.0
[INFO] Downloading: https://repo.maven.apache.org/maven2/org/apache/curator/curator-test/3.3.0/curator-test-3.3.0.jar
[INFO] Downloaded: https://repo.maven.apache.org/maven2/org/apache/curator/curator-test/3.3.0/curator-test-3.3.0.jar (2376 KB at 9389.8 KB/sec)
[INFO] Downloading: https://repo.maven.apache.org/maven2/org/apache/curator/curator-test/3.3.0/curator-test-3.3.0.pom
[INFO] Downloaded: https://repo.maven.apache.org/maven2/org/apache/curator/curator-test/3.3.0/curator-test-3.3.0.pom (4 KB at 261.0 KB/sec)
[INFO] Downloading: https://repo.maven.apache.org/maven2/org/apache/curator/apache-curator/3.3.0/apache-curator-3.3.0.pom
[INFO] Downloaded: https://repo.maven.apache.org/maven2/org/apache/curator/apache-curator/3.3.0/apache-curator-3.3.0.pom (33 KB at 1778.6 KB/sec)
[INFO] Downloading: https://repo.maven.apache.org/maven2/org/apache/zookeeper/zookeeper/3.5.1-alpha/zookeeper-3.5.1-alpha.pom
[INFO] Downloaded: https://repo.maven.apache.org/maven2/org/apache/zookeeper/zookeeper/3.5.1-alpha/zookeeper-3.5.1-alpha.pom (5 KB at 285.9 KB/sec)
[INFO] Downloading: https://repo.maven.apache.org/maven2/org/apache/zookeeper/zookeeper/3.5.1-alpha/zookeeper-3.5.1-alpha.jar
[INFO] Downloaded: https://repo.maven.apache.org/maven2/org/apache/zookeeper/zookeeper/3.5.1-alpha/zookeeper-3.5.1-alpha.jar (996 KB at 8658.7 KB/sec)
[ERROR] 7002: org.apache.curator.test.TestingZooKeeperMain: Method 'public org.apache.zookeeper.server.quorum.QuorumPeer getQuorumPeer()' has been removed
[ERROR] 5001: org.apache.curator.test.TestingZooKeeperServer: Removed org.apache.zookeeper.server.quorum.QuorumPeerMain from the list of superclasses
[ERROR] 7002: org.apache.curator.test.ZooKeeperMainFace: Method 'public org.apache.zookeeper.server.quorum.QuorumPeer getQuorumPeer()' has been removed
[INFO] Succeeded with 3 errors; 0 warnings; and 0 other changes.
[CHECKSTYLE] No report found for mojo check[INFO] 
[INFO] --- maven-bundle-plugin:3.2.0:manifest (bundle-manifest) @ curator-test ---

[INFO] 
[INFO] --- maven-resources-plugin:2.7:testResources (default-testResources) @ curator-test ---
[INFO] Using 'UTF-8' encoding to copy filtered resources.
[INFO] skip non existing resourceDirectory <https://builds.apache.org/job/Curator/ws/curator-test/src/test/resources>
[INFO] Copying 3 resources
[INFO] 
[INFO] --- maven-compiler-plugin:3.2:testCompile (default-testCompile) @ curator-test ---
[INFO] Changes detected - recompiling the module!
[INFO] Compiling 1 source file to <https://builds.apache.org/job/Curator/ws/curator-test/target/test-classes>
[INFO] 
[INFO] --- maven-surefire-plugin:2.18.1:test (default-test) @ curator-test ---
[JENKINS] Recording test results
[INFO] ------------------------------------------------------------------------
[INFO] Reactor Summary:
[INFO] 
[INFO] Apache Curator ..................................... SUCCESS [  5.302 s]
[INFO] Curator Testing .................................... FAILURE [  8.112 s]
[INFO] Curator Client ..................................... SKIPPED
[INFO] Curator Framework .................................. SKIPPED
[INFO] Curator Recipes .................................... SKIPPED
[INFO] Curator Service Discovery .......................... SKIPPED
[INFO] Curator Async ...................................... SKIPPED
[INFO] Curator Examples ................................... SKIPPED
[INFO] Curator Service Discovery Server ................... SKIPPED
[INFO] ------------------------------------------------------------------------
[INFO] BUILD FAILURE
[INFO] ------------------------------------------------------------------------
[INFO] Total time: 18.206 s
[INFO] Finished at: 2017-07-21T16:09:10+00:00
[INFO] Final Memory: 34M/516M
[INFO] ------------------------------------------------------------------------
[ERROR] Failed to execute goal org.apache.maven.plugins:maven-surefire-plugin:2.18.1:test (default-test) on project curator-test: No tests were executed!  (Set -DfailIfNoTests=false to ignore this error.) -> [Help 1]
[ERROR] 
[ERROR] To see the full stack trace of the errors, re-run Maven with the -e switch.
[ERROR] Re-run Maven using the -X switch to enable full debug logging.
[ERROR] 
[ERROR] For more information about the errors and possible solutions, please read the following articles:
[ERROR] [Help 1] http://cwiki.apache.org/confluence/display/MAVEN/MojoFailureException
[ERROR] 
[ERROR] After correcting the problems, you can resume the build with the command
[ERROR]   mvn <goals> -rf :curator-test
[JENKINS] Archiving <https://builds.apache.org/job/Curator/ws/pom.xml> to org.apache.curator/apache-curator/3.3.1-SNAPSHOT/apache-curator-3.3.1-SNAPSHOT.pom
[JENKINS] Archiving <https://builds.apache.org/job/Curator/ws/curator-test/pom.xml> to org.apache.curator/curator-test/3.3.1-SNAPSHOT/curator-test-3.3.1-SNAPSHOT.pom
[JENKINS] Archiving <https://builds.apache.org/job/Curator/ws/curator-x-async/pom.xml> to org.apache.curator/curator-x-async/3.3.1-SNAPSHOT/curator-x-async-3.3.1-SNAPSHOT.pom
[JENKINS] Archiving <https://builds.apache.org/job/Curator/ws/curator-examples/pom.xml> to org.apache.curator/curator-examples/3.3.1-SNAPSHOT/curator-examples-3.3.1-SNAPSHOT.pom
[JENKINS] Archiving <https://builds.apache.org/job/Curator/ws/curator-x-discovery/pom.xml> to org.apache.curator/curator-x-discovery/3.3.1-SNAPSHOT/curator-x-discovery-3.3.1-SNAPSHOT.pom
[JENKINS] Archiving <https://builds.apache.org/job/Curator/ws/curator-recipes/pom.xml> to org.apache.curator/curator-recipes/3.3.1-SNAPSHOT/curator-recipes-3.3.1-SNAPSHOT.pom
[JENKINS] Archiving <https://builds.apache.org/job/Curator/ws/curator-x-discovery-server/pom.xml> to org.apache.curator/curator-x-discovery-server/3.3.1-SNAPSHOT/curator-x-discovery-server-3.3.1-SNAPSHOT.pom
[JENKINS] Archiving <https://builds.apache.org/job/Curator/ws/curator-client/pom.xml> to org.apache.curator/curator-client/3.3.1-SNAPSHOT/curator-client-3.3.1-SNAPSHOT.pom
[JENKINS] Archiving <https://builds.apache.org/job/Curator/ws/curator-framework/pom.xml> to org.apache.curator/curator-framework/3.3.1-SNAPSHOT/curator-framework-3.3.1-SNAPSHOT.pom
Sending e-mails to: dev@curator.apache.org
channel stopped

Jenkins build is unstable: Curator #1070

Posted by Apache Jenkins Server <je...@builds.apache.org>.
See <https://builds.apache.org/job/Curator/1070/display/redirect?page=changes>