You are viewing a plain text version of this content. The canonical link for it is here.
Posted to dev@oodt.apache.org by Apache Jenkins Server <je...@builds.apache.org> on 2015/10/06 23:54:44 UTC
Build failed in Jenkins: oodt-trunk #2014
See <https://builds.apache.org/job/oodt-trunk/2014/>
------------------------------------------
[...truncated 1088 lines...]
Downloading: http://repo1.maven.org/maven2/org/apache/maven/maven-parent/7/maven-parent-7.pom
20K downloaded (maven-parent-7.pom)
Downloading: http://repo1.maven.org/maven2/org/apache/maven/plugins/maven-surefire-plugin/2.4/maven-surefire-plugin-2.4.jar
21K downloaded (maven-surefire-plugin-2.4.jar)
[INFO] [remote-resources:process {execution: default}]
Downloading: http://repo1.maven.org/maven2/commons-collections/commons-collections/2.1/commons-collections-2.1.pom
3K downloaded (commons-collections-2.1.pom)
Downloading: http://repo1.maven.org/maven2/commons-dbcp/commons-dbcp/1.2.1/commons-dbcp-1.2.1.pom
6K downloaded (commons-dbcp-1.2.1.pom)
Downloading: http://repo1.maven.org/maven2/commons-pool/commons-pool/1.2/commons-pool-1.2.pom
4K downloaded (commons-pool-1.2.pom)
Downloading: http://repo1.maven.org/maven2/xml-apis/xml-apis/2.0.2/xml-apis-2.0.2.pom
346b downloaded (xml-apis-2.0.2.pom)
Downloading: http://repo1.maven.org/maven2/xerces/xerces/2.0.2/xerces-2.0.2.pom
311b downloaded (xerces-2.0.2.pom)
Downloading: http://repo1.maven.org/maven2/xerces/xercesImpl/2.0.2/xercesImpl-2.0.2.pom
150b downloaded (xercesImpl-2.0.2.pom)
Downloading: http://repo1.maven.org/maven2/commons-lang/commons-lang/2.3/commons-lang-2.3.pom
10K downloaded (commons-lang-2.3.pom)
Downloading: http://repo1.maven.org/maven2/org/springframework/spring-core/2.5.4/spring-core-2.5.4.pom
2K downloaded (spring-core-2.5.4.pom)
Downloading: http://repo1.maven.org/maven2/org/springframework/spring-hibernate3/2.0.8/spring-hibernate3-2.0.8.pom
3K downloaded (spring-hibernate3-2.0.8.pom)
Downloading: http://repo1.maven.org/maven2/aopalliance/aopalliance/1.0/aopalliance-1.0.pom
363b downloaded (aopalliance-1.0.pom)
Downloading: http://repo1.maven.org/maven2/org/hibernate/hibernate/3.2.5.ga/hibernate-3.2.5.ga.pom
3K downloaded (hibernate-3.2.5.ga.pom)
Downloading: http://repo1.maven.org/maven2/net/sf/ehcache/ehcache/1.2.3/ehcache-1.2.3.pom
19K downloaded (ehcache-1.2.3.pom)
Downloading: http://repo1.maven.org/maven2/asm/asm-attrs/1.5.3/asm-attrs-1.5.3.pom
821b downloaded (asm-attrs-1.5.3.pom)
Downloading: http://repo1.maven.org/maven2/dom4j/dom4j/1.6.1/dom4j-1.6.1.pom
6K downloaded (dom4j-1.6.1.pom)
Downloading: http://repo1.maven.org/maven2/antlr/antlr/2.7.6/antlr-2.7.6.pom
230b downloaded (antlr-2.7.6.pom)
Downloading: http://repo1.maven.org/maven2/cglib/cglib/2.1_3/cglib-2.1_3.pom
373b downloaded (cglib-2.1_3.pom)
Downloading: http://repo1.maven.org/maven2/asm/asm/1.5.3/asm-1.5.3.pom
809b downloaded (asm-1.5.3.pom)
Downloading: http://repo1.maven.org/maven2/org/springframework/spring-beans/2.5.4/spring-beans-2.5.4.pom
2K downloaded (spring-beans-2.5.4.pom)
Downloading: http://repo1.maven.org/maven2/org/springframework/spring-context/2.5.4/spring-context-2.5.4.pom
3K downloaded (spring-context-2.5.4.pom)
Downloading: http://repo1.maven.org/maven2/org/springframework/spring-dao/2.0.8/spring-dao-2.0.8.pom
2K downloaded (spring-dao-2.0.8.pom)
Downloading: http://repo1.maven.org/maven2/org/springframework/spring-jdbc/2.0.8/spring-jdbc-2.0.8.pom
2K downloaded (spring-jdbc-2.0.8.pom)
Downloading: http://repo1.maven.org/maven2/xmlrpc/xmlrpc/2.0.1/xmlrpc-2.0.1.pom
146b downloaded (xmlrpc-2.0.1.pom)
Downloading: http://repo1.maven.org/maven2/dom4j/dom4j/1.6.1/dom4j-1.6.1.jar
Downloading: http://repo1.maven.org/maven2/commons-dbcp/commons-dbcp/1.2.1/commons-dbcp-1.2.1.jar
Downloading: http://repo1.maven.org/maven2/antlr/antlr/2.7.6/antlr-2.7.6.jar
Downloading: http://repo1.maven.org/maven2/org/springframework/spring-core/2.5.4/spring-core-2.5.4.jar
Downloading: http://repo1.maven.org/maven2/aopalliance/aopalliance/1.0/aopalliance-1.0.jar
4K downloaded (aopalliance-1.0.jar)
306K downloaded (dom4j-1.6.1.jar)
Downloading: http://repo1.maven.org/maven2/xmlrpc/xmlrpc/2.0.1/xmlrpc-2.0.1.jar
Downloading: http://repo1.maven.org/maven2/commons-pool/commons-pool/1.2/commons-pool-1.2.jar
41K downloaded (commons-pool-1.2.jar)
105K downloaded (commons-dbcp-1.2.1.jar)
Downloading: http://repo1.maven.org/maven2/org/hibernate/hibernate/3.2.5.ga/hibernate-3.2.5.ga.jar
Downloading: http://repo1.maven.org/maven2/commons-lang/commons-lang/2.3/commons-lang-2.3.jar
279K downloaded (spring-core-2.5.4.jar)
113K downloaded (xmlrpc-2.0.1.jar)
433K downloaded (antlr-2.7.6.jar)
Downloading: http://repo1.maven.org/maven2/commons-logging/commons-logging/1.0.3/commons-logging-1.0.3.jar
Downloading: http://repo1.maven.org/maven2/cglib/cglib/2.1_3/cglib-2.1_3.jar
Downloading: http://repo1.maven.org/maven2/net/sf/ehcache/ehcache/1.2.3/ehcache-1.2.3.jar
239K downloaded (commons-lang-2.3.jar)
30K downloaded (commons-logging-1.0.3.jar)
203K downloaded (ehcache-1.2.3.jar)
Downloading: http://repo1.maven.org/maven2/xml-apis/xml-apis/1.0.b2/xml-apis-1.0.b2.jar
Downloading: http://repo1.maven.org/maven2/asm/asm-attrs/1.5.3/asm-attrs-1.5.3.jar
2202K downloaded (hibernate-3.2.5.ga.jar)
Downloading: http://repo1.maven.org/maven2/commons-collections/commons-collections/2.1/commons-collections-2.1.jar
106K downloaded (xml-apis-1.0.b2.jar)
275K downloaded (cglib-2.1_3.jar)
16K downloaded (asm-attrs-1.5.3.jar)
Downloading: http://repo1.maven.org/maven2/org/springframework/spring-hibernate3/2.0.8/spring-hibernate3-2.0.8.jar
161K downloaded (commons-collections-2.1.jar)
Downloading: http://repo1.maven.org/maven2/asm/asm/1.5.3/asm-1.5.3.jar
104K downloaded (spring-hibernate3-2.0.8.jar)
25K downloaded (asm-1.5.3.jar)
Downloading: http://repo1.maven.org/maven2/org/springframework/spring-beans/2.5.4/spring-beans-2.5.4.jar
472K downloaded (spring-beans-2.5.4.jar)
Downloading: http://repo1.maven.org/maven2/org/springframework/spring-context/2.5.4/spring-context-2.5.4.jar
458K downloaded (spring-context-2.5.4.jar)
Downloading: http://repo1.maven.org/maven2/org/springframework/spring-dao/2.0.8/spring-dao-2.0.8.jar
127K downloaded (spring-dao-2.0.8.jar)
Downloading: http://repo1.maven.org/maven2/org/springframework/spring-jdbc/2.0.8/spring-jdbc-2.0.8.jar
221K downloaded (spring-jdbc-2.0.8.jar)
Downloading: http://repo1.maven.org/maven2/org/codehaus/plexus/plexus-interpolation/1.13/plexus-interpolation-1.13.pom
890b downloaded (plexus-interpolation-1.13.pom)
Downloading: http://repo1.maven.org/maven2/org/codehaus/plexus/plexus-utils/2.0.5/plexus-utils-2.0.5.jar
217K downloaded (plexus-utils-2.0.5.jar)
Downloading: http://repo1.maven.org/maven2/org/codehaus/plexus/plexus-interpolation/1.13/plexus-interpolation-1.13.jar
59K downloaded (plexus-interpolation-1.13.jar)
[INFO] [resources:resources {execution: default-resources}]
[INFO] Using 'UTF-8' encoding to copy filtered resources.
[INFO] Copying 1 resource to org/apache/oodt/commons
[INFO] Copying 1 resource to org/apache/oodt/commons/util
[INFO] Copying 3 resources
Downloading: http://repo1.maven.org/maven2/junit/junit/4.12/junit-4.12.pom
23K downloaded (junit-4.12.pom)
Downloading: http://repo1.maven.org/maven2/org/hamcrest/hamcrest-core/1.3/hamcrest-core-1.3.pom
766b downloaded (hamcrest-core-1.3.pom)
Downloading: http://repo1.maven.org/maven2/org/hamcrest/hamcrest-parent/1.3/hamcrest-parent-1.3.pom
1K downloaded (hamcrest-parent-1.3.pom)
Downloading: http://repo1.maven.org/maven2/org/apache/maven/maven-plugin-api/2.0.9/maven-plugin-api-2.0.9.pom
1K downloaded (maven-plugin-api-2.0.9.pom)
Downloading: http://repo1.maven.org/maven2/org/apache/maven/maven/2.0.9/maven-2.0.9.pom
18K downloaded (maven-2.0.9.pom)
Downloading: http://repo1.maven.org/maven2/org/apache/maven/maven-artifact/2.0.9/maven-artifact-2.0.9.pom
1K downloaded (maven-artifact-2.0.9.pom)
Downloading: http://repo1.maven.org/maven2/org/codehaus/plexus/plexus-utils/1.5.1/plexus-utils-1.5.1.pom
2K downloaded (plexus-utils-1.5.1.pom)
Downloading: http://repo1.maven.org/maven2/org/apache/maven/maven-core/2.0.9/maven-core-2.0.9.pom
7K downloaded (maven-core-2.0.9.pom)
Downloading: http://repo1.maven.org/maven2/org/apache/maven/maven-settings/2.0.9/maven-settings-2.0.9.pom
2K downloaded (maven-settings-2.0.9.pom)
Downloading: http://repo1.maven.org/maven2/org/apache/maven/maven-model/2.0.9/maven-model-2.0.9.pom
3K downloaded (maven-model-2.0.9.pom)
Downloading: http://repo1.maven.org/maven2/org/apache/maven/maven-plugin-parameter-documenter/2.0.9/maven-plugin-parameter-documenter-2.0.9.pom
1K downloaded (maven-plugin-parameter-documenter-2.0.9.pom)
Downloading: http://repo1.maven.org/maven2/org/apache/maven/wagon/wagon-webdav/1.0-beta-2/wagon-webdav-1.0-beta-2.pom
1K downloaded (wagon-webdav-1.0-beta-2.pom)
Downloading: http://repo1.maven.org/maven2/slide/slide-webdavlib/2.1/slide-webdavlib-2.1.pom
648b downloaded (slide-webdavlib-2.1.pom)
Downloading: http://repo1.maven.org/maven2/commons-httpclient/commons-httpclient/2.0.2/commons-httpclient-2.0.2.pom
6K downloaded (commons-httpclient-2.0.2.pom)
Downloading: http://repo1.maven.org/maven2/jdom/jdom/1.0/jdom-1.0.pom
1K downloaded (jdom-1.0.pom)
Downloading: http://repo1.maven.org/maven2/de/zeigermann/xml/xml-im-exporter/1.1/xml-im-exporter-1.1.pom
248b downloaded (xml-im-exporter-1.1.pom)
Downloading: http://repo1.maven.org/maven2/org/apache/maven/maven-profile/2.0.9/maven-profile-2.0.9.pom
2K downloaded (maven-profile-2.0.9.pom)
Downloading: http://repo1.maven.org/maven2/org/apache/maven/maven-repository-metadata/2.0.9/maven-repository-metadata-2.0.9.pom
1K downloaded (maven-repository-metadata-2.0.9.pom)
Downloading: http://repo1.maven.org/maven2/org/apache/maven/maven-error-diagnostics/2.0.9/maven-error-diagnostics-2.0.9.pom
1K downloaded (maven-error-diagnostics-2.0.9.pom)
Downloading: http://repo1.maven.org/maven2/org/apache/maven/maven-project/2.0.9/maven-project-2.0.9.pom
2K downloaded (maven-project-2.0.9.pom)
Downloading: http://repo1.maven.org/maven2/org/apache/maven/maven-artifact-manager/2.0.9/maven-artifact-manager-2.0.9.pom
2K downloaded (maven-artifact-manager-2.0.9.pom)
Downloading: http://repo1.maven.org/maven2/org/apache/maven/maven-plugin-registry/2.0.9/maven-plugin-registry-2.0.9.pom
1K downloaded (maven-plugin-registry-2.0.9.pom)
Downloading: http://repo1.maven.org/maven2/org/apache/maven/maven-plugin-descriptor/2.0.9/maven-plugin-descriptor-2.0.9.pom
2K downloaded (maven-plugin-descriptor-2.0.9.pom)
Downloading: http://repo1.maven.org/maven2/org/apache/maven/maven-monitor/2.0.9/maven-monitor-2.0.9.pom
1K downloaded (maven-monitor-2.0.9.pom)
Downloading: http://repo1.maven.org/maven2/org/apache/maven/maven-toolchain/1.0/maven-toolchain-1.0.pom
3K downloaded (maven-toolchain-1.0.pom)
Downloading: http://repo1.maven.org/maven2/org/apache/maven/shared/maven-shared-utils/0.1/maven-shared-utils-0.1.pom
3K downloaded (maven-shared-utils-0.1.pom)
Downloading: http://repo1.maven.org/maven2/org/apache/maven/shared/maven-shared-incremental/1.1/maven-shared-incremental-1.1.pom
4K downloaded (maven-shared-incremental-1.1.pom)
Downloading: http://repo1.maven.org/maven2/org/codehaus/plexus/plexus-compiler-api/2.2/plexus-compiler-api-2.2.pom
865b downloaded (plexus-compiler-api-2.2.pom)
Downloading: http://repo1.maven.org/maven2/org/codehaus/plexus/plexus-compiler/2.2/plexus-compiler-2.2.pom
3K downloaded (plexus-compiler-2.2.pom)
Downloading: http://repo1.maven.org/maven2/org/codehaus/plexus/plexus-components/1.3.1/plexus-components-1.3.1.pom
2K downloaded (plexus-components-1.3.1.pom)
Downloading: http://repo1.maven.org/maven2/org/codehaus/plexus/plexus-utils/3.0.8/plexus-utils-3.0.8.pom
3K downloaded (plexus-utils-3.0.8.pom)
Downloading: http://repo1.maven.org/maven2/org/codehaus/plexus/plexus-compiler-manager/2.2/plexus-compiler-manager-2.2.pom
690b downloaded (plexus-compiler-manager-2.2.pom)
Downloading: http://repo1.maven.org/maven2/org/codehaus/plexus/plexus-compiler-javac/2.2/plexus-compiler-javac-2.2.pom
769b downloaded (plexus-compiler-javac-2.2.pom)
Downloading: http://repo1.maven.org/maven2/org/codehaus/plexus/plexus-compilers/2.2/plexus-compilers-2.2.pom
1K downloaded (plexus-compilers-2.2.pom)
Downloading: http://repo1.maven.org/maven2/org/codehaus/plexus/plexus-utils/1.4.5/plexus-utils-1.4.5.pom
2K downloaded (plexus-utils-1.4.5.pom)
Downloading: http://repo1.maven.org/maven2/org/codehaus/plexus/plexus-classworlds/2.2.2/plexus-classworlds-2.2.2.pom
3K downloaded (plexus-classworlds-2.2.2.pom)
Downloading: http://repo1.maven.org/maven2/org/apache/xbean/xbean-reflect/3.4/xbean-reflect-3.4.pom
2K downloaded (xbean-reflect-3.4.pom)
Downloading: http://repo1.maven.org/maven2/org/apache/xbean/xbean/3.4/xbean-3.4.pom
18K downloaded (xbean-3.4.pom)
Downloading: http://repo1.maven.org/maven2/log4j/log4j/1.2.12/log4j-1.2.12.pom
145b downloaded (log4j-1.2.12.pom)
Downloading: http://repo1.maven.org/maven2/commons-logging/commons-logging-api/1.1/commons-logging-api-1.1.pom
5K downloaded (commons-logging-api-1.1.pom)
Downloading: http://repo1.maven.org/maven2/com/google/collections/google-collections/1.0/google-collections-1.0.pom
2K downloaded (google-collections-1.0.pom)
Downloading: http://repo1.maven.org/maven2/com/google/google/1/google-1.pom
1K downloaded (google-1.pom)
Downloading: http://repo1.maven.org/maven2/junit/junit/3.8.2/junit-3.8.2.pom
747b downloaded (junit-3.8.2.pom)
Downloading: http://repo1.maven.org/maven2/org/apache/maven/shared/maven-shared-utils/0.1/maven-shared-utils-0.1.jar
Downloading: http://repo1.maven.org/maven2/org/codehaus/plexus/plexus-component-annotations/1.5.5/plexus-component-annotations-1.5.5.jar
4K downloaded (plexus-component-annotations-1.5.5.jar)
Downloading: http://repo1.maven.org/maven2/org/codehaus/plexus/plexus-compiler-api/2.2/plexus-compiler-api-2.2.jar
24K downloaded (plexus-compiler-api-2.2.jar)
Downloading: http://repo1.maven.org/maven2/org/codehaus/plexus/plexus-compiler-manager/2.2/plexus-compiler-manager-2.2.jar
150K downloaded (maven-shared-utils-0.1.jar)
4K downloaded (plexus-compiler-manager-2.2.jar)
Downloading: http://repo1.maven.org/maven2/org/apache/maven/shared/maven-shared-incremental/1.1/maven-shared-incremental-1.1.jar
Downloading: http://repo1.maven.org/maven2/org/codehaus/plexus/plexus-compiler-javac/2.2/plexus-compiler-javac-2.2.jar
13K downloaded (maven-shared-incremental-1.1.jar)
18K downloaded (plexus-compiler-javac-2.2.jar)
[INFO] [compiler:compile {execution: default-compile}]
[INFO] Changes detected - recompiling the module!
[INFO] Compiling 86 source files to <https://builds.apache.org/job/oodt-trunk/ws/commons/target/classes>
[INFO] -------------------------------------------------------------
[WARNING] COMPILATION WARNING :
[INFO] -------------------------------------------------------------
[WARNING] <https://builds.apache.org/job/oodt-trunk/ws/commons/src/main/java/org/apache/oodt/commons/Configuration.java>: Some input files use or override a deprecated API.
[WARNING] <https://builds.apache.org/job/oodt-trunk/ws/commons/src/main/java/org/apache/oodt/commons/Configuration.java>: Recompile with -Xlint:deprecation for details.
[WARNING] <https://builds.apache.org/job/oodt-trunk/ws/commons/src/main/java/org/apache/oodt/commons/activity/StoredActivity.java>: Some input files use unchecked or unsafe operations.
[WARNING] <https://builds.apache.org/job/oodt-trunk/ws/commons/src/main/java/org/apache/oodt/commons/activity/StoredActivity.java>: Recompile with -Xlint:unchecked for details.
[INFO] 4 warnings
[INFO] -------------------------------------------------------------
[INFO] -------------------------------------------------------------
[ERROR] COMPILATION ERROR :
[INFO] -------------------------------------------------------------
[ERROR] <https://builds.apache.org/job/oodt-trunk/ws/commons/src/main/java/org/apache/oodt/commons/ConfiguredTestCase.java>:[21,23] package junit.framework does not exist
[ERROR] <https://builds.apache.org/job/oodt-trunk/ws/commons/src/main/java/org/apache/oodt/commons/ConfiguredTestCase.java>:[32,50] cannot find symbol
symbol: class TestCase
[ERROR] <https://builds.apache.org/job/oodt-trunk/ws/commons/src/main/java/org/apache/oodt/commons/ConfiguredTestCase.java>:[48,17] cannot find symbol
symbol: variable super
location: class org.apache.oodt.commons.ConfiguredTestCase
[INFO] 3 errors
[INFO] -------------------------------------------------------------
[INFO] ------------------------------------------------------------------------
[ERROR] BUILD FAILURE
[INFO] ------------------------------------------------------------------------
[INFO] Compilation failure
<https://builds.apache.org/job/oodt-trunk/ws/commons/src/main/java/org/apache/oodt/commons/ConfiguredTestCase.java>:[21,23] package junit.framework does not exist
<https://builds.apache.org/job/oodt-trunk/ws/commons/src/main/java/org/apache/oodt/commons/ConfiguredTestCase.java>:[32,50] cannot find symbol
symbol: class TestCase
<https://builds.apache.org/job/oodt-trunk/ws/commons/src/main/java/org/apache/oodt/commons/ConfiguredTestCase.java>:[48,17] cannot find symbol
symbol: variable super
location: class org.apache.oodt.commons.ConfiguredTestCase
[INFO] ------------------------------------------------------------------------
[INFO] For more information, run Maven with the -e switch
[INFO] ------------------------------------------------------------------------
[INFO] Total time: 1 minute 5 seconds
[INFO] Finished at: Tue Oct 06 21:55:09 UTC 2015
[INFO] Final Memory: 73M/727M
[INFO] ------------------------------------------------------------------------
Waiting for Jenkins to finish collecting data
[JENKINS] Archiving <https://builds.apache.org/job/oodt-trunk/ws/.repository/org/apache/oodt/oodt-core/0.11-SNAPSHOT/oodt-core-0.11-SNAPSHOT.pom> to org.apache.oodt/oodt-core/0.11-SNAPSHOT/oodt-core-0.11-SNAPSHOT.pom
[JENKINS] Archiving <https://builds.apache.org/job/oodt-trunk/ws/core/target/oodt-core-0.11-SNAPSHOT-site.xml> to org.apache.oodt/oodt-core/0.11-SNAPSHOT/oodt-core-0.11-SNAPSHOT-site.xml
<https://builds.apache.org/job/oodt-trunk/ws/.repository/org/apache/oodt/oodt-core/0.11-SNAPSHOT/oodt-core-0.11-SNAPSHOT.pom> is not inside <https://builds.apache.org/job/oodt-trunk/ws/core/;> will archive in a separate pass
[JENKINS] Archiving <https://builds.apache.org/job/oodt-trunk/ws/commons/pom.xml> to org.apache.oodt/oodt-commons/0.11-SNAPSHOT/oodt-commons-0.11-SNAPSHOT.pom
Sending e-mails to: dev@oodt.apache.org
channel stopped
Jenkins build is back to stable : oodt-trunk #2018
Posted by Apache Jenkins Server <je...@builds.apache.org>.
See <https://builds.apache.org/job/oodt-trunk/2018/changes>
Jenkins build is unstable: oodt-trunk #2017
Posted by Apache Jenkins Server <je...@builds.apache.org>.
See <https://builds.apache.org/job/oodt-trunk/2017/>
Re: Build failed in Jenkins: oodt-trunk #2016
Posted by Tom Barber <to...@meteorite.bi>.
Weird doesn't fail here.
I didn't realise it was wobbly until I moved jenkins from svn to git so
I'll clean up the build in the morning.
Tom
On 7 Oct 2015 00:17, "Apache Jenkins Server" <je...@builds.apache.org>
wrote:
> See <https://builds.apache.org/job/oodt-trunk/2016/changes>
>
> Changes:
>
> [tom] OODT-882 helps if I remove the dupes
>
> ------------------------------------------
> [...truncated 1434 lines...]
> Tests run: 5, Failures: 0, Errors: 0, Skipped: 0, Time elapsed: 0.232 sec
> Running org.apache.oodt.cas.workflow.structs.TestWorkflowInstance
> Tests run: 1, Failures: 0, Errors: 0, Skipped: 0, Time elapsed: 0.035 sec
>
> Results :
>
> Tests run: 71, Failures: 0, Errors: 0, Skipped: 0
>
> [JENKINS] Recording test results
> [INFO] [jar:jar {execution: default-jar}]
> [INFO] Building jar: <
> https://builds.apache.org/job/oodt-trunk/ws/workflow/target/cas-workflow-0.11-SNAPSHOT.jar
> >
> [INFO] Preparing javadoc:javadoc
> [WARNING] Removing: javadoc from forked lifecycle, to prevent recursive
> invocation.
> [INFO] No goals needed for project - skipping
> [WARNING] DEPRECATED [aggregate]: since 2.5. Use the goals
> <code>javadoc:aggregate</code> and <code>javadoc:test-aggregate</code>
> instead.
> [INFO] [javadoc:javadoc {execution: attach-javadocs}]
> [INFO] [assembly:single {execution: default}]
> [INFO] Reading assembly descriptor: src/main/assembly/assembly.xml
> [INFO] Processing DependencySet (output=lib)
> [INFO] Building tar : <
> https://builds.apache.org/job/oodt-trunk/ws/workflow/target/cas-workflow-0.11-SNAPSHOT-dist.tar.gz
> >
> [INFO] Processing DependencySet (output=lib)
> [INFO] Building zip: <
> https://builds.apache.org/job/oodt-trunk/ws/workflow/target/cas-workflow-0.11-SNAPSHOT-dist.zip
> >
> [INFO] [install:install {execution: default-install}]
> [INFO] Installing <
> https://builds.apache.org/job/oodt-trunk/ws/workflow/target/cas-workflow-0.11-SNAPSHOT.jar>
> to <
> https://builds.apache.org/job/oodt-trunk/ws/.repository/org/apache/oodt/cas-workflow/0.11-SNAPSHOT/cas-workflow-0.11-SNAPSHOT.jar
> >
> [INFO] Installing <
> https://builds.apache.org/job/oodt-trunk/ws/workflow/target/cas-workflow-0.11-SNAPSHOT-dist.tar.gz>
> to <
> https://builds.apache.org/job/oodt-trunk/ws/.repository/org/apache/oodt/cas-workflow/0.11-SNAPSHOT/cas-workflow-0.11-SNAPSHOT-dist.tar.gz
> >
> [INFO] Installing <
> https://builds.apache.org/job/oodt-trunk/ws/workflow/target/cas-workflow-0.11-SNAPSHOT-dist.zip>
> to <
> https://builds.apache.org/job/oodt-trunk/ws/.repository/org/apache/oodt/cas-workflow/0.11-SNAPSHOT/cas-workflow-0.11-SNAPSHOT-dist.zip
> >
> [INFO]
> ------------------------------------------------------------------------
> [INFO] Building Catalog and Archive Crawling Framework
> [INFO] task-segment: [install]
> [INFO]
> ------------------------------------------------------------------------
> [INFO] [remote-resources:process {execution: default}]
> [INFO] [resources:resources {execution: default-resources}]
> [INFO] Using 'UTF-8' encoding to copy filtered resources.
> [INFO] Copying 4 resources to org/apache/oodt/cas/crawl
> [INFO] Copying 3 resources
> [INFO] [compiler:compile {execution: default-compile}]
> [INFO] Nothing to compile - all classes are up to date
> [INFO] [resources:testResources {execution: default-testResources}]
> [INFO] Using 'UTF-8' encoding to copy filtered resources.
> [INFO] skip non existing resourceDirectory <
> https://builds.apache.org/job/oodt-trunk/ws/crawler/src/test/resources>
> [INFO] Copying 3 resources
> [INFO] [compiler:testCompile {execution: default-testCompile}]
> [INFO] Nothing to compile - all classes are up to date
> [INFO] [surefire:test {execution: default-test}]
> [INFO] Surefire report directory: <
> https://builds.apache.org/job/oodt-trunk/ws/crawler/target/surefire-reports
> >
>
> -------------------------------------------------------
> T E S T S
> -------------------------------------------------------
> Running
> org.apache.oodt.cas.crawl.cli.option.handler.TestCrawlerBeansPropHandler
> Tests run: 1, Failures: 0, Errors: 0, Skipped: 0, Time elapsed: 0.04 sec
> Running org.apache.oodt.cas.crawl.option.TestBooleanOptions
> Tests run: 1, Failures: 0, Errors: 0, Skipped: 0, Time elapsed: 0.038 sec
> Running
> org.apache.oodt.cas.crawl.typedetection.TestMimeExtractorConfigReader
> Tests run: 2, Failures: 0, Errors: 0, Skipped: 0, Time elapsed: 0.262 sec
> Running org.apache.oodt.cas.crawl.TestProductCrawler
> Tests run: 19, Failures: 0, Errors: 0, Skipped: 0, Time elapsed: 1.068 sec
>
> Results :
>
> Tests run: 23, Failures: 0, Errors: 0, Skipped: 0
>
> [JENKINS] Recording test results
> [INFO] [jar:jar {execution: default-jar}]
> [INFO] Building jar: <
> https://builds.apache.org/job/oodt-trunk/ws/crawler/target/cas-crawler-0.11-SNAPSHOT.jar
> >
> [INFO] Preparing javadoc:javadoc
> [WARNING] Removing: javadoc from forked lifecycle, to prevent recursive
> invocation.
> [INFO] No goals needed for project - skipping
> [WARNING] DEPRECATED [aggregate]: since 2.5. Use the goals
> <code>javadoc:aggregate</code> and <code>javadoc:test-aggregate</code>
> instead.
> [INFO] [javadoc:javadoc {execution: attach-javadocs}]
> [INFO] [assembly:single {execution: default}]
> [INFO] Reading assembly descriptor: src/main/assembly/assembly.xml
> [INFO] Processing DependencySet (output=lib)
> [INFO] Building tar : <
> https://builds.apache.org/job/oodt-trunk/ws/crawler/target/cas-crawler-0.11-SNAPSHOT-dist.tar.gz
> >
> [INFO] Processing DependencySet (output=lib)
> [INFO] Building zip: <
> https://builds.apache.org/job/oodt-trunk/ws/crawler/target/cas-crawler-0.11-SNAPSHOT-dist.zip
> >
> [INFO] [install:install {execution: default-install}]
> [INFO] Installing <
> https://builds.apache.org/job/oodt-trunk/ws/crawler/target/cas-crawler-0.11-SNAPSHOT.jar>
> to <
> https://builds.apache.org/job/oodt-trunk/ws/.repository/org/apache/oodt/cas-crawler/0.11-SNAPSHOT/cas-crawler-0.11-SNAPSHOT.jar
> >
> [INFO] Installing <
> https://builds.apache.org/job/oodt-trunk/ws/crawler/target/cas-crawler-0.11-SNAPSHOT-dist.tar.gz>
> to <
> https://builds.apache.org/job/oodt-trunk/ws/.repository/org/apache/oodt/cas-crawler/0.11-SNAPSHOT/cas-crawler-0.11-SNAPSHOT-dist.tar.gz
> >
> [INFO] Installing <
> https://builds.apache.org/job/oodt-trunk/ws/crawler/target/cas-crawler-0.11-SNAPSHOT-dist.zip>
> to <
> https://builds.apache.org/job/oodt-trunk/ws/.repository/org/apache/oodt/cas-crawler/0.11-SNAPSHOT/cas-crawler-0.11-SNAPSHOT-dist.zip
> >
> [INFO]
> ------------------------------------------------------------------------
> [INFO] Building CAS Curation Web Services
> [INFO] task-segment: [install]
> [INFO]
> ------------------------------------------------------------------------
> [INFO] [remote-resources:process {execution: default}]
> [WARNING] POM for 'org.javassist:javassist:pom:3.16.1-GA:compile' is
> invalid.
>
> Its dependencies (if any) will NOT be available to the current build.
> [WARNING] Invalid project model for artifact
> [javassist:org.javassist:3.16.1-GA]. It will be ignored by the remote
> resources Mojo.
> [INFO] [resources:resources {execution: default-resources}]
> [INFO] Using 'UTF-8' encoding to copy filtered resources.
> [INFO] skip non existing resourceDirectory <
> https://builds.apache.org/job/oodt-trunk/ws/curator/services/src/main/resources
> >
> [INFO] Copying 0 resource
> [INFO] Copying 3 resources
> [WARNING] POM for 'org.javassist:javassist:pom:3.16.1-GA:compile' is
> invalid.
>
> Its dependencies (if any) will NOT be available to the current build.
> [INFO] [compiler:compile {execution: default-compile}]
> [INFO] Nothing to compile - all classes are up to date
> [INFO] [resources:testResources {execution: default-testResources}]
> [INFO] Using 'UTF-8' encoding to copy filtered resources.
> [INFO] skip non existing resourceDirectory <
> https://builds.apache.org/job/oodt-trunk/ws/curator/services/src/test/java
> >
> [INFO] Copying 3 resources
> [INFO] [compiler:testCompile {execution: default-testCompile}]
> [INFO] No sources to compile
> [INFO] [surefire:test {execution: default-test}]
> [JENKINS] Recording test results
> [INFO] [war:war {execution: default-war}]
> [INFO] Packaging webapp
> [INFO]
> ------------------------------------------------------------------------
> [ERROR] FATAL ERROR
> [INFO]
> ------------------------------------------------------------------------
> [INFO] Cannot construct org.apache.maven.plugin.war.util.WebappStructure
> as it does not have a no-args constructor
> ---- Debugging information ----
> message : Cannot construct
> org.apache.maven.plugin.war.util.WebappStructure as it does not have a
> no-args constructor
> cause-exception :
> com.thoughtworks.xstream.converters.reflection.ObjectAccessException
> cause-message : Cannot construct
> org.apache.maven.plugin.war.util.WebappStructure as it does not have a
> no-args constructor
> class : org.apache.maven.plugin.war.util.WebappStructure
> required-type : org.apache.maven.plugin.war.util.WebappStructure
> path : /webapp-structure
> line number : 1
> -------------------------------
> [INFO]
> ------------------------------------------------------------------------
> [INFO] Trace
> com.thoughtworks.xstream.converters.ConversionException: Cannot construct
> org.apache.maven.plugin.war.util.WebappStructure as it does not have a
> no-args constructor
> ---- Debugging information ----
> message : Cannot construct
> org.apache.maven.plugin.war.util.WebappStructure as it does not have a
> no-args constructor
> cause-exception :
> com.thoughtworks.xstream.converters.reflection.ObjectAccessException
> cause-message : Cannot construct
> org.apache.maven.plugin.war.util.WebappStructure as it does not have a
> no-args constructor
> class : org.apache.maven.plugin.war.util.WebappStructure
> required-type : org.apache.maven.plugin.war.util.WebappStructure
> path : /webapp-structure
> line number : 1
> -------------------------------
> at
> com.thoughtworks.xstream.core.TreeUnmarshaller.convert(TreeUnmarshaller.java:63)
> at
> com.thoughtworks.xstream.core.AbstractReferenceUnmarshaller.convert(AbstractReferenceUnmarshaller.java:45)
> at
> com.thoughtworks.xstream.core.TreeUnmarshaller.convertAnother(TreeUnmarshaller.java:46)
> at
> com.thoughtworks.xstream.core.TreeUnmarshaller.start(TreeUnmarshaller.java:117)
> at
> com.thoughtworks.xstream.core.ReferenceByXPathMarshallingStrategy.unmarshal(ReferenceByXPathMarshallingStrategy.java:29)
> at com.thoughtworks.xstream.XStream.unmarshal(XStream.java:846)
> at com.thoughtworks.xstream.XStream.unmarshal(XStream.java:833)
> at com.thoughtworks.xstream.XStream.fromXML(XStream.java:781)
> at
> org.apache.maven.plugin.war.util.WebappStructureSerializer.fromXml(WebappStructureSerializer.java:73)
> at
> org.apache.maven.plugin.war.AbstractWarMojo.buildWebapp(AbstractWarMojo.java:404)
> at
> org.apache.maven.plugin.war.AbstractWarMojo.buildExplodedWebapp(AbstractWarMojo.java:375)
> at
> org.apache.maven.plugin.war.WarMojo.performPackaging(WarMojo.java:181)
> at org.apache.maven.plugin.war.WarMojo.execute(WarMojo.java:143)
> at
> org.apache.maven.plugin.DefaultPluginManager.executeMojo(DefaultPluginManager.java:490)
> at
> hudson.maven.agent.PluginManagerInterceptor.executeMojo(PluginManagerInterceptor.java:182)
> at
> org.apache.maven.lifecycle.DefaultLifecycleExecutor.executeGoals(DefaultLifecycleExecutor.java:694)
> at
> org.apache.maven.lifecycle.DefaultLifecycleExecutor.executeGoalWithLifecycle(DefaultLifecycleExecutor.java:556)
> at
> org.apache.maven.lifecycle.DefaultLifecycleExecutor.executeGoal(DefaultLifecycleExecutor.java:535)
> at
> org.apache.maven.lifecycle.DefaultLifecycleExecutor.executeGoalAndHandleFailures(DefaultLifecycleExecutor.java:387)
> at
> org.apache.maven.lifecycle.DefaultLifecycleExecutor.executeTaskSegments(DefaultLifecycleExecutor.java:348)
> at
> org.apache.maven.lifecycle.DefaultLifecycleExecutor.execute(DefaultLifecycleExecutor.java:180)
> at
> org.apache.maven.lifecycle.LifecycleExecutorInterceptor.execute(LifecycleExecutorInterceptor.java:65)
> at org.apache.maven.DefaultMaven.doExecute(DefaultMaven.java:328)
> at org.apache.maven.DefaultMaven.execute(DefaultMaven.java:138)
> at org.apache.maven.cli.MavenCli.main(MavenCli.java:362)
> at sun.reflect.NativeMethodAccessorImpl.invoke0(Native Method)
> at
> sun.reflect.NativeMethodAccessorImpl.invoke(NativeMethodAccessorImpl.java:57)
> at
> sun.reflect.DelegatingMethodAccessorImpl.invoke(DelegatingMethodAccessorImpl.java:43)
> at java.lang.reflect.Method.invoke(Method.java:606)
> at
> org.codehaus.classworlds.Launcher.launchEnhanced(Launcher.java:315)
> at org.codehaus.classworlds.Launcher.launch(Launcher.java:255)
> at hudson.maven.agent.Main.launch(Main.java:205)
> at hudson.maven.MavenBuilder.call(MavenBuilder.java:154)
> at hudson.maven.Maven2Builder.call(Maven2Builder.java:79)
> at hudson.maven.Maven2Builder.call(Maven2Builder.java:55)
> at hudson.remoting.UserRequest.perform(UserRequest.java:121)
> at hudson.remoting.UserRequest.perform(UserRequest.java:49)
> at hudson.remoting.Request$2.run(Request.java:326)
> at
> hudson.remoting.InterceptingExecutorService$1.call(InterceptingExecutorService.java:68)
> at java.util.concurrent.FutureTask.run(FutureTask.java:262)
> at
> java.util.concurrent.ThreadPoolExecutor.runWorker(ThreadPoolExecutor.java:1145)
> at
> java.util.concurrent.ThreadPoolExecutor$Worker.run(ThreadPoolExecutor.java:615)
> at java.lang.Thread.run(Thread.java:745)
> Caused by:
> com.thoughtworks.xstream.converters.reflection.ObjectAccessException:
> Cannot construct org.apache.maven.plugin.war.util.WebappStructure as it
> does not have a no-args constructor
> at
> com.thoughtworks.xstream.converters.reflection.PureJavaReflectionProvider.newInstance(PureJavaReflectionProvider.java:59)
> at
> com.thoughtworks.xstream.converters.reflection.AbstractReflectionConverter.instantiateNewInstance(AbstractReflectionConverter.java:257)
> at
> com.thoughtworks.xstream.converters.reflection.AbstractReflectionConverter.unmarshal(AbstractReflectionConverter.java:124)
> at
> com.thoughtworks.xstream.core.TreeUnmarshaller.convert(TreeUnmarshaller.java:56)
> ... 42 more
> [INFO]
> ------------------------------------------------------------------------
> [INFO] Total time: 3 minutes 56 seconds
> [INFO] Finished at: Tue Oct 06 23:16:20 UTC 2015
> [INFO] Final Memory: 96M/758M
> [INFO]
> ------------------------------------------------------------------------
> [JENKINS] Archiving <
> https://builds.apache.org/job/oodt-trunk/ws/sso/pom.xml> to
> org.apache.oodt/oodt-sso/0.11-SNAPSHOT/oodt-sso-0.11-SNAPSHOT.pom
> [JENKINS] Archiving <
> https://builds.apache.org/job/oodt-trunk/ws/sso/target/oodt-sso-0.11-SNAPSHOT.jar>
> to org.apache.oodt/oodt-sso/0.11-SNAPSHOT/oodt-sso-0.11-SNAPSHOT.jar
> [JENKINS] Archiving <
> https://builds.apache.org/job/oodt-trunk/ws/protocol/ftp/pom.xml> to
> org.apache.oodt/cas-protocol-ftp/0.11-SNAPSHOT/cas-protocol-ftp-0.11-SNAPSHOT.pom
> [JENKINS] Archiving <
> https://builds.apache.org/job/oodt-trunk/ws/protocol/ftp/target/cas-protocol-ftp-0.11-SNAPSHOT.jar>
> to
> org.apache.oodt/cas-protocol-ftp/0.11-SNAPSHOT/cas-protocol-ftp-0.11-SNAPSHOT.jar
> [JENKINS] Archiving <
> https://builds.apache.org/job/oodt-trunk/ws/metadata/pom.xml> to
> org.apache.oodt/cas-metadata/0.11-SNAPSHOT/cas-metadata-0.11-SNAPSHOT.pom
> [JENKINS] Archiving <
> https://builds.apache.org/job/oodt-trunk/ws/metadata/target/cas-metadata-0.11-SNAPSHOT.jar>
> to org.apache.oodt/cas-metadata/0.11-SNAPSHOT/cas-metadata-0.11-SNAPSHOT.jar
> Compressed 121.91 KB of artifacts by 52.5% relative to #2015
> [JENKINS] Archiving <
> https://builds.apache.org/job/oodt-trunk/ws/.repository/org/apache/oodt/oodt-core/0.11-SNAPSHOT/oodt-core-0.11-SNAPSHOT.pom>
> to org.apache.oodt/oodt-core/0.11-SNAPSHOT/oodt-core-0.11-SNAPSHOT.pom
> [JENKINS] Archiving <
> https://builds.apache.org/job/oodt-trunk/ws/core/target/oodt-core-0.11-SNAPSHOT-site.xml>
> to org.apache.oodt/oodt-core/0.11-SNAPSHOT/oodt-core-0.11-SNAPSHOT-site.xml
> <
> https://builds.apache.org/job/oodt-trunk/ws/.repository/org/apache/oodt/oodt-core/0.11-SNAPSHOT/oodt-core-0.11-SNAPSHOT.pom>
> is not inside <https://builds.apache.org/job/oodt-trunk/ws/core/;> will
> archive in a separate pass
> [JENKINS] Archiving <
> https://builds.apache.org/job/oodt-trunk/ws/protocol/http/pom.xml> to
> org.apache.oodt/cas-protocol-http/0.11-SNAPSHOT/cas-protocol-http-0.11-SNAPSHOT.pom
> [JENKINS] Archiving <
> https://builds.apache.org/job/oodt-trunk/ws/protocol/http/target/cas-protocol-http-0.11-SNAPSHOT.jar>
> to
> org.apache.oodt/cas-protocol-http/0.11-SNAPSHOT/cas-protocol-http-0.11-SNAPSHOT.jar
> [JENKINS] Archiving <
> https://builds.apache.org/job/oodt-trunk/ws/curator/services/pom.xml> to
> org.apache.oodt/curator-services/0.11-SNAPSHOT/curator-services-0.11-SNAPSHOT.pom
> [JENKINS] Archiving <
> https://builds.apache.org/job/oodt-trunk/ws/crawler/pom.xml> to
> org.apache.oodt/cas-crawler/0.11-SNAPSHOT/cas-crawler-0.11-SNAPSHOT.pom
> [JENKINS] Archiving <
> https://builds.apache.org/job/oodt-trunk/ws/crawler/target/cas-crawler-0.11-SNAPSHOT.jar>
> to org.apache.oodt/cas-crawler/0.11-SNAPSHOT/cas-crawler-0.11-SNAPSHOT.jar
> [JENKINS] Archiving <
> https://builds.apache.org/job/oodt-trunk/ws/crawler/target/cas-crawler-0.11-SNAPSHOT-dist.tar.gz>
> to
> org.apache.oodt/cas-crawler/0.11-SNAPSHOT/cas-crawler-0.11-SNAPSHOT-dist.tar.gz
> [JENKINS] Archiving <
> https://builds.apache.org/job/oodt-trunk/ws/crawler/target/cas-crawler-0.11-SNAPSHOT-dist.zip>
> to
> org.apache.oodt/cas-crawler/0.11-SNAPSHOT/cas-crawler-0.11-SNAPSHOT-dist.zip
> Compressed 112.97 MB of artifacts by 48.0% relative to #2015
> [JENKINS] Archiving <
> https://builds.apache.org/job/oodt-trunk/ws/protocol/api/pom.xml> to
> org.apache.oodt/cas-protocol-api/0.11-SNAPSHOT/cas-protocol-api-0.11-SNAPSHOT.pom
> [JENKINS] Archiving <
> https://builds.apache.org/job/oodt-trunk/ws/protocol/api/target/cas-protocol-api-0.11-SNAPSHOT.jar>
> to
> org.apache.oodt/cas-protocol-api/0.11-SNAPSHOT/cas-protocol-api-0.11-SNAPSHOT.jar
> [JENKINS] Archiving <
> https://builds.apache.org/job/oodt-trunk/ws/protocol/api/target/cas-protocol-api-0.11-SNAPSHOT-dist.tar.gz>
> to
> org.apache.oodt/cas-protocol-api/0.11-SNAPSHOT/cas-protocol-api-0.11-SNAPSHOT-dist.tar.gz
> [JENKINS] Archiving <
> https://builds.apache.org/job/oodt-trunk/ws/protocol/api/target/cas-protocol-api-0.11-SNAPSHOT-dist.zip>
> to
> org.apache.oodt/cas-protocol-api/0.11-SNAPSHOT/cas-protocol-api-0.11-SNAPSHOT-dist.zip
> Compressed 19.47 MB of artifacts by 47.3% relative to #2015
> [JENKINS] Archiving <
> https://builds.apache.org/job/oodt-trunk/ws/filemgr/pom.xml> to
> org.apache.oodt/cas-filemgr/0.11-SNAPSHOT/cas-filemgr-0.11-SNAPSHOT.pom
> [JENKINS] Archiving <
> https://builds.apache.org/job/oodt-trunk/ws/filemgr/target/cas-filemgr-0.11-SNAPSHOT.jar>
> to org.apache.oodt/cas-filemgr/0.11-SNAPSHOT/cas-filemgr-0.11-SNAPSHOT.jar
> [JENKINS] Archiving <
> https://builds.apache.org/job/oodt-trunk/ws/filemgr/target/cas-filemgr-0.11-SNAPSHOT-dist.tar.gz>
> to
> org.apache.oodt/cas-filemgr/0.11-SNAPSHOT/cas-filemgr-0.11-SNAPSHOT-dist.tar.gz
> [JENKINS] Archiving <
> https://builds.apache.org/job/oodt-trunk/ws/filemgr/target/cas-filemgr-0.11-SNAPSHOT-dist.zip>
> to
> org.apache.oodt/cas-filemgr/0.11-SNAPSHOT/cas-filemgr-0.11-SNAPSHOT-dist.zip
> Compressed 110.45 MB of artifacts by 60.8% relative to #2015
> [JENKINS] Archiving <
> https://builds.apache.org/job/oodt-trunk/ws/cli/pom.xml> to
> org.apache.oodt/cas-cli/0.11-SNAPSHOT/cas-cli-0.11-SNAPSHOT.pom
> [JENKINS] Archiving <
> https://builds.apache.org/job/oodt-trunk/ws/cli/target/cas-cli-0.11-SNAPSHOT.jar>
> to org.apache.oodt/cas-cli/0.11-SNAPSHOT/cas-cli-0.11-SNAPSHOT.jar
> [JENKINS] Archiving <
> https://builds.apache.org/job/oodt-trunk/ws/cli/target/cas-cli-0.11-SNAPSHOT-dist.tar.gz>
> to org.apache.oodt/cas-cli/0.11-SNAPSHOT/cas-cli-0.11-SNAPSHOT-dist.tar.gz
> [JENKINS] Archiving <
> https://builds.apache.org/job/oodt-trunk/ws/cli/target/cas-cli-0.11-SNAPSHOT-dist.zip>
> to org.apache.oodt/cas-cli/0.11-SNAPSHOT/cas-cli-0.11-SNAPSHOT-dist.zip
> Compressed 13.45 MB of artifacts by 56.2% relative to #2015
> [JENKINS] Archiving <
> https://builds.apache.org/job/oodt-trunk/ws/xmlquery/pom.xml> to
> org.apache.oodt/oodt-xmlquery/0.11-SNAPSHOT/oodt-xmlquery-0.11-SNAPSHOT.pom
> [JENKINS] Archiving <
> https://builds.apache.org/job/oodt-trunk/ws/xmlquery/target/oodt-xmlquery-0.11-SNAPSHOT.jar>
> to
> org.apache.oodt/oodt-xmlquery/0.11-SNAPSHOT/oodt-xmlquery-0.11-SNAPSHOT.jar
> [JENKINS] Archiving <
> https://builds.apache.org/job/oodt-trunk/ws/protocol/imaps/pom.xml> to
> org.apache.oodt/cas-protocol-imaps/0.11-SNAPSHOT/cas-protocol-imaps-0.11-SNAPSHOT.pom
> [JENKINS] Archiving <
> https://builds.apache.org/job/oodt-trunk/ws/protocol/imaps/target/cas-protocol-imaps-0.11-SNAPSHOT.jar>
> to
> org.apache.oodt/cas-protocol-imaps/0.11-SNAPSHOT/cas-protocol-imaps-0.11-SNAPSHOT.jar
> [JENKINS] Archiving <
> https://builds.apache.org/job/oodt-trunk/ws/commons/pom.xml> to
> org.apache.oodt/oodt-commons/0.11-SNAPSHOT/oodt-commons-0.11-SNAPSHOT.pom
> [JENKINS] Archiving <
> https://builds.apache.org/job/oodt-trunk/ws/commons/target/oodt-commons-0.11-SNAPSHOT.jar>
> to org.apache.oodt/oodt-commons/0.11-SNAPSHOT/oodt-commons-0.11-SNAPSHOT.jar
> Compressed 209.65 KB of artifacts by 61.1% relative to #2015
> [JENKINS] Archiving <
> https://builds.apache.org/job/oodt-trunk/ws/protocol/sftp/pom.xml> to
> org.apache.oodt/cas-protocol-sftp/0.11-SNAPSHOT/cas-protocol-sftp-0.11-SNAPSHOT.pom
> [JENKINS] Archiving <
> https://builds.apache.org/job/oodt-trunk/ws/protocol/sftp/target/cas-protocol-sftp-0.11-SNAPSHOT.jar>
> to
> org.apache.oodt/cas-protocol-sftp/0.11-SNAPSHOT/cas-protocol-sftp-0.11-SNAPSHOT.jar
> [JENKINS] Archiving <
> https://builds.apache.org/job/oodt-trunk/ws/pcs/input/pom.xml> to
> org.apache.oodt/pcs-input/0.11-SNAPSHOT/pcs-input-0.11-SNAPSHOT.pom
> [JENKINS] Archiving <
> https://builds.apache.org/job/oodt-trunk/ws/pcs/input/target/pcs-input-0.11-SNAPSHOT.jar>
> to org.apache.oodt/pcs-input/0.11-SNAPSHOT/pcs-input-0.11-SNAPSHOT.jar
> [JENKINS] Archiving <
> https://builds.apache.org/job/oodt-trunk/ws/resource/pom.xml> to
> org.apache.oodt/cas-resource/0.11-SNAPSHOT/cas-resource-0.11-SNAPSHOT.pom
> [JENKINS] Archiving <
> https://builds.apache.org/job/oodt-trunk/ws/resource/target/cas-resource-0.11-SNAPSHOT.jar>
> to org.apache.oodt/cas-resource/0.11-SNAPSHOT/cas-resource-0.11-SNAPSHOT.jar
> [JENKINS] Archiving <
> https://builds.apache.org/job/oodt-trunk/ws/resource/target/cas-resource-0.11-SNAPSHOT-dist.tar.gz>
> to
> org.apache.oodt/cas-resource/0.11-SNAPSHOT/cas-resource-0.11-SNAPSHOT-dist.tar.gz
> [JENKINS] Archiving <
> https://builds.apache.org/job/oodt-trunk/ws/resource/target/cas-resource-0.11-SNAPSHOT-dist.zip>
> to
> org.apache.oodt/cas-resource/0.11-SNAPSHOT/cas-resource-0.11-SNAPSHOT-dist.zip
> Compressed 22.24 MB of artifacts by 63.4% relative to #2015
> [JENKINS] Archiving <
> https://builds.apache.org/job/oodt-trunk/ws/catalog/pom.xml> to
> org.apache.oodt/cas-catalog/0.11-SNAPSHOT/cas-catalog-0.11-SNAPSHOT.pom
> [JENKINS] Archiving <
> https://builds.apache.org/job/oodt-trunk/ws/catalog/target/cas-catalog-0.11-SNAPSHOT.jar>
> to org.apache.oodt/cas-catalog/0.11-SNAPSHOT/cas-catalog-0.11-SNAPSHOT.jar
> [JENKINS] Archiving <
> https://builds.apache.org/job/oodt-trunk/ws/catalog/target/cas-catalog-0.11-SNAPSHOT-dist.tar.gz>
> to
> org.apache.oodt/cas-catalog/0.11-SNAPSHOT/cas-catalog-0.11-SNAPSHOT-dist.tar.gz
> [JENKINS] Archiving <
> https://builds.apache.org/job/oodt-trunk/ws/catalog/target/cas-catalog-0.11-SNAPSHOT-dist.zip>
> to
> org.apache.oodt/cas-catalog/0.11-SNAPSHOT/cas-catalog-0.11-SNAPSHOT-dist.zip
> Compressed 22.41 MB of artifacts by 55.9% relative to #2015
> [JENKINS] Archiving <
> https://builds.apache.org/job/oodt-trunk/ws/workflow/pom.xml> to
> org.apache.oodt/cas-workflow/0.11-SNAPSHOT/cas-workflow-0.11-SNAPSHOT.pom
> [JENKINS] Archiving <
> https://builds.apache.org/job/oodt-trunk/ws/workflow/target/cas-workflow-0.11-SNAPSHOT.jar>
> to org.apache.oodt/cas-workflow/0.11-SNAPSHOT/cas-workflow-0.11-SNAPSHOT.jar
> [JENKINS] Archiving <
> https://builds.apache.org/job/oodt-trunk/ws/workflow/target/cas-workflow-0.11-SNAPSHOT-dist.tar.gz>
> to
> org.apache.oodt/cas-workflow/0.11-SNAPSHOT/cas-workflow-0.11-SNAPSHOT-dist.tar.gz
> [JENKINS] Archiving <
> https://builds.apache.org/job/oodt-trunk/ws/workflow/target/cas-workflow-0.11-SNAPSHOT-dist.zip>
> to
> org.apache.oodt/cas-workflow/0.11-SNAPSHOT/cas-workflow-0.11-SNAPSHOT-dist.zip
> Compressed 25.46 MB of artifacts by 63.2% relative to #2015
> Sending e-mails to: dev@oodt.apache.org
> channel stopped
>
Build failed in Jenkins: oodt-trunk #2016
Posted by Apache Jenkins Server <je...@builds.apache.org>.
See <https://builds.apache.org/job/oodt-trunk/2016/changes>
Changes:
[tom] OODT-882 helps if I remove the dupes
------------------------------------------
[...truncated 1434 lines...]
Tests run: 5, Failures: 0, Errors: 0, Skipped: 0, Time elapsed: 0.232 sec
Running org.apache.oodt.cas.workflow.structs.TestWorkflowInstance
Tests run: 1, Failures: 0, Errors: 0, Skipped: 0, Time elapsed: 0.035 sec
Results :
Tests run: 71, Failures: 0, Errors: 0, Skipped: 0
[JENKINS] Recording test results
[INFO] [jar:jar {execution: default-jar}]
[INFO] Building jar: <https://builds.apache.org/job/oodt-trunk/ws/workflow/target/cas-workflow-0.11-SNAPSHOT.jar>
[INFO] Preparing javadoc:javadoc
[WARNING] Removing: javadoc from forked lifecycle, to prevent recursive invocation.
[INFO] No goals needed for project - skipping
[WARNING] DEPRECATED [aggregate]: since 2.5. Use the goals <code>javadoc:aggregate</code> and <code>javadoc:test-aggregate</code> instead.
[INFO] [javadoc:javadoc {execution: attach-javadocs}]
[INFO] [assembly:single {execution: default}]
[INFO] Reading assembly descriptor: src/main/assembly/assembly.xml
[INFO] Processing DependencySet (output=lib)
[INFO] Building tar : <https://builds.apache.org/job/oodt-trunk/ws/workflow/target/cas-workflow-0.11-SNAPSHOT-dist.tar.gz>
[INFO] Processing DependencySet (output=lib)
[INFO] Building zip: <https://builds.apache.org/job/oodt-trunk/ws/workflow/target/cas-workflow-0.11-SNAPSHOT-dist.zip>
[INFO] [install:install {execution: default-install}]
[INFO] Installing <https://builds.apache.org/job/oodt-trunk/ws/workflow/target/cas-workflow-0.11-SNAPSHOT.jar> to <https://builds.apache.org/job/oodt-trunk/ws/.repository/org/apache/oodt/cas-workflow/0.11-SNAPSHOT/cas-workflow-0.11-SNAPSHOT.jar>
[INFO] Installing <https://builds.apache.org/job/oodt-trunk/ws/workflow/target/cas-workflow-0.11-SNAPSHOT-dist.tar.gz> to <https://builds.apache.org/job/oodt-trunk/ws/.repository/org/apache/oodt/cas-workflow/0.11-SNAPSHOT/cas-workflow-0.11-SNAPSHOT-dist.tar.gz>
[INFO] Installing <https://builds.apache.org/job/oodt-trunk/ws/workflow/target/cas-workflow-0.11-SNAPSHOT-dist.zip> to <https://builds.apache.org/job/oodt-trunk/ws/.repository/org/apache/oodt/cas-workflow/0.11-SNAPSHOT/cas-workflow-0.11-SNAPSHOT-dist.zip>
[INFO] ------------------------------------------------------------------------
[INFO] Building Catalog and Archive Crawling Framework
[INFO] task-segment: [install]
[INFO] ------------------------------------------------------------------------
[INFO] [remote-resources:process {execution: default}]
[INFO] [resources:resources {execution: default-resources}]
[INFO] Using 'UTF-8' encoding to copy filtered resources.
[INFO] Copying 4 resources to org/apache/oodt/cas/crawl
[INFO] Copying 3 resources
[INFO] [compiler:compile {execution: default-compile}]
[INFO] Nothing to compile - all classes are up to date
[INFO] [resources:testResources {execution: default-testResources}]
[INFO] Using 'UTF-8' encoding to copy filtered resources.
[INFO] skip non existing resourceDirectory <https://builds.apache.org/job/oodt-trunk/ws/crawler/src/test/resources>
[INFO] Copying 3 resources
[INFO] [compiler:testCompile {execution: default-testCompile}]
[INFO] Nothing to compile - all classes are up to date
[INFO] [surefire:test {execution: default-test}]
[INFO] Surefire report directory: <https://builds.apache.org/job/oodt-trunk/ws/crawler/target/surefire-reports>
-------------------------------------------------------
T E S T S
-------------------------------------------------------
Running org.apache.oodt.cas.crawl.cli.option.handler.TestCrawlerBeansPropHandler
Tests run: 1, Failures: 0, Errors: 0, Skipped: 0, Time elapsed: 0.04 sec
Running org.apache.oodt.cas.crawl.option.TestBooleanOptions
Tests run: 1, Failures: 0, Errors: 0, Skipped: 0, Time elapsed: 0.038 sec
Running org.apache.oodt.cas.crawl.typedetection.TestMimeExtractorConfigReader
Tests run: 2, Failures: 0, Errors: 0, Skipped: 0, Time elapsed: 0.262 sec
Running org.apache.oodt.cas.crawl.TestProductCrawler
Tests run: 19, Failures: 0, Errors: 0, Skipped: 0, Time elapsed: 1.068 sec
Results :
Tests run: 23, Failures: 0, Errors: 0, Skipped: 0
[JENKINS] Recording test results
[INFO] [jar:jar {execution: default-jar}]
[INFO] Building jar: <https://builds.apache.org/job/oodt-trunk/ws/crawler/target/cas-crawler-0.11-SNAPSHOT.jar>
[INFO] Preparing javadoc:javadoc
[WARNING] Removing: javadoc from forked lifecycle, to prevent recursive invocation.
[INFO] No goals needed for project - skipping
[WARNING] DEPRECATED [aggregate]: since 2.5. Use the goals <code>javadoc:aggregate</code> and <code>javadoc:test-aggregate</code> instead.
[INFO] [javadoc:javadoc {execution: attach-javadocs}]
[INFO] [assembly:single {execution: default}]
[INFO] Reading assembly descriptor: src/main/assembly/assembly.xml
[INFO] Processing DependencySet (output=lib)
[INFO] Building tar : <https://builds.apache.org/job/oodt-trunk/ws/crawler/target/cas-crawler-0.11-SNAPSHOT-dist.tar.gz>
[INFO] Processing DependencySet (output=lib)
[INFO] Building zip: <https://builds.apache.org/job/oodt-trunk/ws/crawler/target/cas-crawler-0.11-SNAPSHOT-dist.zip>
[INFO] [install:install {execution: default-install}]
[INFO] Installing <https://builds.apache.org/job/oodt-trunk/ws/crawler/target/cas-crawler-0.11-SNAPSHOT.jar> to <https://builds.apache.org/job/oodt-trunk/ws/.repository/org/apache/oodt/cas-crawler/0.11-SNAPSHOT/cas-crawler-0.11-SNAPSHOT.jar>
[INFO] Installing <https://builds.apache.org/job/oodt-trunk/ws/crawler/target/cas-crawler-0.11-SNAPSHOT-dist.tar.gz> to <https://builds.apache.org/job/oodt-trunk/ws/.repository/org/apache/oodt/cas-crawler/0.11-SNAPSHOT/cas-crawler-0.11-SNAPSHOT-dist.tar.gz>
[INFO] Installing <https://builds.apache.org/job/oodt-trunk/ws/crawler/target/cas-crawler-0.11-SNAPSHOT-dist.zip> to <https://builds.apache.org/job/oodt-trunk/ws/.repository/org/apache/oodt/cas-crawler/0.11-SNAPSHOT/cas-crawler-0.11-SNAPSHOT-dist.zip>
[INFO] ------------------------------------------------------------------------
[INFO] Building CAS Curation Web Services
[INFO] task-segment: [install]
[INFO] ------------------------------------------------------------------------
[INFO] [remote-resources:process {execution: default}]
[WARNING] POM for 'org.javassist:javassist:pom:3.16.1-GA:compile' is invalid.
Its dependencies (if any) will NOT be available to the current build.
[WARNING] Invalid project model for artifact [javassist:org.javassist:3.16.1-GA]. It will be ignored by the remote resources Mojo.
[INFO] [resources:resources {execution: default-resources}]
[INFO] Using 'UTF-8' encoding to copy filtered resources.
[INFO] skip non existing resourceDirectory <https://builds.apache.org/job/oodt-trunk/ws/curator/services/src/main/resources>
[INFO] Copying 0 resource
[INFO] Copying 3 resources
[WARNING] POM for 'org.javassist:javassist:pom:3.16.1-GA:compile' is invalid.
Its dependencies (if any) will NOT be available to the current build.
[INFO] [compiler:compile {execution: default-compile}]
[INFO] Nothing to compile - all classes are up to date
[INFO] [resources:testResources {execution: default-testResources}]
[INFO] Using 'UTF-8' encoding to copy filtered resources.
[INFO] skip non existing resourceDirectory <https://builds.apache.org/job/oodt-trunk/ws/curator/services/src/test/java>
[INFO] Copying 3 resources
[INFO] [compiler:testCompile {execution: default-testCompile}]
[INFO] No sources to compile
[INFO] [surefire:test {execution: default-test}]
[JENKINS] Recording test results
[INFO] [war:war {execution: default-war}]
[INFO] Packaging webapp
[INFO] ------------------------------------------------------------------------
[ERROR] FATAL ERROR
[INFO] ------------------------------------------------------------------------
[INFO] Cannot construct org.apache.maven.plugin.war.util.WebappStructure as it does not have a no-args constructor
---- Debugging information ----
message : Cannot construct org.apache.maven.plugin.war.util.WebappStructure as it does not have a no-args constructor
cause-exception : com.thoughtworks.xstream.converters.reflection.ObjectAccessException
cause-message : Cannot construct org.apache.maven.plugin.war.util.WebappStructure as it does not have a no-args constructor
class : org.apache.maven.plugin.war.util.WebappStructure
required-type : org.apache.maven.plugin.war.util.WebappStructure
path : /webapp-structure
line number : 1
-------------------------------
[INFO] ------------------------------------------------------------------------
[INFO] Trace
com.thoughtworks.xstream.converters.ConversionException: Cannot construct org.apache.maven.plugin.war.util.WebappStructure as it does not have a no-args constructor
---- Debugging information ----
message : Cannot construct org.apache.maven.plugin.war.util.WebappStructure as it does not have a no-args constructor
cause-exception : com.thoughtworks.xstream.converters.reflection.ObjectAccessException
cause-message : Cannot construct org.apache.maven.plugin.war.util.WebappStructure as it does not have a no-args constructor
class : org.apache.maven.plugin.war.util.WebappStructure
required-type : org.apache.maven.plugin.war.util.WebappStructure
path : /webapp-structure
line number : 1
-------------------------------
at com.thoughtworks.xstream.core.TreeUnmarshaller.convert(TreeUnmarshaller.java:63)
at com.thoughtworks.xstream.core.AbstractReferenceUnmarshaller.convert(AbstractReferenceUnmarshaller.java:45)
at com.thoughtworks.xstream.core.TreeUnmarshaller.convertAnother(TreeUnmarshaller.java:46)
at com.thoughtworks.xstream.core.TreeUnmarshaller.start(TreeUnmarshaller.java:117)
at com.thoughtworks.xstream.core.ReferenceByXPathMarshallingStrategy.unmarshal(ReferenceByXPathMarshallingStrategy.java:29)
at com.thoughtworks.xstream.XStream.unmarshal(XStream.java:846)
at com.thoughtworks.xstream.XStream.unmarshal(XStream.java:833)
at com.thoughtworks.xstream.XStream.fromXML(XStream.java:781)
at org.apache.maven.plugin.war.util.WebappStructureSerializer.fromXml(WebappStructureSerializer.java:73)
at org.apache.maven.plugin.war.AbstractWarMojo.buildWebapp(AbstractWarMojo.java:404)
at org.apache.maven.plugin.war.AbstractWarMojo.buildExplodedWebapp(AbstractWarMojo.java:375)
at org.apache.maven.plugin.war.WarMojo.performPackaging(WarMojo.java:181)
at org.apache.maven.plugin.war.WarMojo.execute(WarMojo.java:143)
at org.apache.maven.plugin.DefaultPluginManager.executeMojo(DefaultPluginManager.java:490)
at hudson.maven.agent.PluginManagerInterceptor.executeMojo(PluginManagerInterceptor.java:182)
at org.apache.maven.lifecycle.DefaultLifecycleExecutor.executeGoals(DefaultLifecycleExecutor.java:694)
at org.apache.maven.lifecycle.DefaultLifecycleExecutor.executeGoalWithLifecycle(DefaultLifecycleExecutor.java:556)
at org.apache.maven.lifecycle.DefaultLifecycleExecutor.executeGoal(DefaultLifecycleExecutor.java:535)
at org.apache.maven.lifecycle.DefaultLifecycleExecutor.executeGoalAndHandleFailures(DefaultLifecycleExecutor.java:387)
at org.apache.maven.lifecycle.DefaultLifecycleExecutor.executeTaskSegments(DefaultLifecycleExecutor.java:348)
at org.apache.maven.lifecycle.DefaultLifecycleExecutor.execute(DefaultLifecycleExecutor.java:180)
at org.apache.maven.lifecycle.LifecycleExecutorInterceptor.execute(LifecycleExecutorInterceptor.java:65)
at org.apache.maven.DefaultMaven.doExecute(DefaultMaven.java:328)
at org.apache.maven.DefaultMaven.execute(DefaultMaven.java:138)
at org.apache.maven.cli.MavenCli.main(MavenCli.java:362)
at sun.reflect.NativeMethodAccessorImpl.invoke0(Native Method)
at sun.reflect.NativeMethodAccessorImpl.invoke(NativeMethodAccessorImpl.java:57)
at sun.reflect.DelegatingMethodAccessorImpl.invoke(DelegatingMethodAccessorImpl.java:43)
at java.lang.reflect.Method.invoke(Method.java:606)
at org.codehaus.classworlds.Launcher.launchEnhanced(Launcher.java:315)
at org.codehaus.classworlds.Launcher.launch(Launcher.java:255)
at hudson.maven.agent.Main.launch(Main.java:205)
at hudson.maven.MavenBuilder.call(MavenBuilder.java:154)
at hudson.maven.Maven2Builder.call(Maven2Builder.java:79)
at hudson.maven.Maven2Builder.call(Maven2Builder.java:55)
at hudson.remoting.UserRequest.perform(UserRequest.java:121)
at hudson.remoting.UserRequest.perform(UserRequest.java:49)
at hudson.remoting.Request$2.run(Request.java:326)
at hudson.remoting.InterceptingExecutorService$1.call(InterceptingExecutorService.java:68)
at java.util.concurrent.FutureTask.run(FutureTask.java:262)
at java.util.concurrent.ThreadPoolExecutor.runWorker(ThreadPoolExecutor.java:1145)
at java.util.concurrent.ThreadPoolExecutor$Worker.run(ThreadPoolExecutor.java:615)
at java.lang.Thread.run(Thread.java:745)
Caused by: com.thoughtworks.xstream.converters.reflection.ObjectAccessException: Cannot construct org.apache.maven.plugin.war.util.WebappStructure as it does not have a no-args constructor
at com.thoughtworks.xstream.converters.reflection.PureJavaReflectionProvider.newInstance(PureJavaReflectionProvider.java:59)
at com.thoughtworks.xstream.converters.reflection.AbstractReflectionConverter.instantiateNewInstance(AbstractReflectionConverter.java:257)
at com.thoughtworks.xstream.converters.reflection.AbstractReflectionConverter.unmarshal(AbstractReflectionConverter.java:124)
at com.thoughtworks.xstream.core.TreeUnmarshaller.convert(TreeUnmarshaller.java:56)
... 42 more
[INFO] ------------------------------------------------------------------------
[INFO] Total time: 3 minutes 56 seconds
[INFO] Finished at: Tue Oct 06 23:16:20 UTC 2015
[INFO] Final Memory: 96M/758M
[INFO] ------------------------------------------------------------------------
[JENKINS] Archiving <https://builds.apache.org/job/oodt-trunk/ws/sso/pom.xml> to org.apache.oodt/oodt-sso/0.11-SNAPSHOT/oodt-sso-0.11-SNAPSHOT.pom
[JENKINS] Archiving <https://builds.apache.org/job/oodt-trunk/ws/sso/target/oodt-sso-0.11-SNAPSHOT.jar> to org.apache.oodt/oodt-sso/0.11-SNAPSHOT/oodt-sso-0.11-SNAPSHOT.jar
[JENKINS] Archiving <https://builds.apache.org/job/oodt-trunk/ws/protocol/ftp/pom.xml> to org.apache.oodt/cas-protocol-ftp/0.11-SNAPSHOT/cas-protocol-ftp-0.11-SNAPSHOT.pom
[JENKINS] Archiving <https://builds.apache.org/job/oodt-trunk/ws/protocol/ftp/target/cas-protocol-ftp-0.11-SNAPSHOT.jar> to org.apache.oodt/cas-protocol-ftp/0.11-SNAPSHOT/cas-protocol-ftp-0.11-SNAPSHOT.jar
[JENKINS] Archiving <https://builds.apache.org/job/oodt-trunk/ws/metadata/pom.xml> to org.apache.oodt/cas-metadata/0.11-SNAPSHOT/cas-metadata-0.11-SNAPSHOT.pom
[JENKINS] Archiving <https://builds.apache.org/job/oodt-trunk/ws/metadata/target/cas-metadata-0.11-SNAPSHOT.jar> to org.apache.oodt/cas-metadata/0.11-SNAPSHOT/cas-metadata-0.11-SNAPSHOT.jar
Compressed 121.91 KB of artifacts by 52.5% relative to #2015
[JENKINS] Archiving <https://builds.apache.org/job/oodt-trunk/ws/.repository/org/apache/oodt/oodt-core/0.11-SNAPSHOT/oodt-core-0.11-SNAPSHOT.pom> to org.apache.oodt/oodt-core/0.11-SNAPSHOT/oodt-core-0.11-SNAPSHOT.pom
[JENKINS] Archiving <https://builds.apache.org/job/oodt-trunk/ws/core/target/oodt-core-0.11-SNAPSHOT-site.xml> to org.apache.oodt/oodt-core/0.11-SNAPSHOT/oodt-core-0.11-SNAPSHOT-site.xml
<https://builds.apache.org/job/oodt-trunk/ws/.repository/org/apache/oodt/oodt-core/0.11-SNAPSHOT/oodt-core-0.11-SNAPSHOT.pom> is not inside <https://builds.apache.org/job/oodt-trunk/ws/core/;> will archive in a separate pass
[JENKINS] Archiving <https://builds.apache.org/job/oodt-trunk/ws/protocol/http/pom.xml> to org.apache.oodt/cas-protocol-http/0.11-SNAPSHOT/cas-protocol-http-0.11-SNAPSHOT.pom
[JENKINS] Archiving <https://builds.apache.org/job/oodt-trunk/ws/protocol/http/target/cas-protocol-http-0.11-SNAPSHOT.jar> to org.apache.oodt/cas-protocol-http/0.11-SNAPSHOT/cas-protocol-http-0.11-SNAPSHOT.jar
[JENKINS] Archiving <https://builds.apache.org/job/oodt-trunk/ws/curator/services/pom.xml> to org.apache.oodt/curator-services/0.11-SNAPSHOT/curator-services-0.11-SNAPSHOT.pom
[JENKINS] Archiving <https://builds.apache.org/job/oodt-trunk/ws/crawler/pom.xml> to org.apache.oodt/cas-crawler/0.11-SNAPSHOT/cas-crawler-0.11-SNAPSHOT.pom
[JENKINS] Archiving <https://builds.apache.org/job/oodt-trunk/ws/crawler/target/cas-crawler-0.11-SNAPSHOT.jar> to org.apache.oodt/cas-crawler/0.11-SNAPSHOT/cas-crawler-0.11-SNAPSHOT.jar
[JENKINS] Archiving <https://builds.apache.org/job/oodt-trunk/ws/crawler/target/cas-crawler-0.11-SNAPSHOT-dist.tar.gz> to org.apache.oodt/cas-crawler/0.11-SNAPSHOT/cas-crawler-0.11-SNAPSHOT-dist.tar.gz
[JENKINS] Archiving <https://builds.apache.org/job/oodt-trunk/ws/crawler/target/cas-crawler-0.11-SNAPSHOT-dist.zip> to org.apache.oodt/cas-crawler/0.11-SNAPSHOT/cas-crawler-0.11-SNAPSHOT-dist.zip
Compressed 112.97 MB of artifacts by 48.0% relative to #2015
[JENKINS] Archiving <https://builds.apache.org/job/oodt-trunk/ws/protocol/api/pom.xml> to org.apache.oodt/cas-protocol-api/0.11-SNAPSHOT/cas-protocol-api-0.11-SNAPSHOT.pom
[JENKINS] Archiving <https://builds.apache.org/job/oodt-trunk/ws/protocol/api/target/cas-protocol-api-0.11-SNAPSHOT.jar> to org.apache.oodt/cas-protocol-api/0.11-SNAPSHOT/cas-protocol-api-0.11-SNAPSHOT.jar
[JENKINS] Archiving <https://builds.apache.org/job/oodt-trunk/ws/protocol/api/target/cas-protocol-api-0.11-SNAPSHOT-dist.tar.gz> to org.apache.oodt/cas-protocol-api/0.11-SNAPSHOT/cas-protocol-api-0.11-SNAPSHOT-dist.tar.gz
[JENKINS] Archiving <https://builds.apache.org/job/oodt-trunk/ws/protocol/api/target/cas-protocol-api-0.11-SNAPSHOT-dist.zip> to org.apache.oodt/cas-protocol-api/0.11-SNAPSHOT/cas-protocol-api-0.11-SNAPSHOT-dist.zip
Compressed 19.47 MB of artifacts by 47.3% relative to #2015
[JENKINS] Archiving <https://builds.apache.org/job/oodt-trunk/ws/filemgr/pom.xml> to org.apache.oodt/cas-filemgr/0.11-SNAPSHOT/cas-filemgr-0.11-SNAPSHOT.pom
[JENKINS] Archiving <https://builds.apache.org/job/oodt-trunk/ws/filemgr/target/cas-filemgr-0.11-SNAPSHOT.jar> to org.apache.oodt/cas-filemgr/0.11-SNAPSHOT/cas-filemgr-0.11-SNAPSHOT.jar
[JENKINS] Archiving <https://builds.apache.org/job/oodt-trunk/ws/filemgr/target/cas-filemgr-0.11-SNAPSHOT-dist.tar.gz> to org.apache.oodt/cas-filemgr/0.11-SNAPSHOT/cas-filemgr-0.11-SNAPSHOT-dist.tar.gz
[JENKINS] Archiving <https://builds.apache.org/job/oodt-trunk/ws/filemgr/target/cas-filemgr-0.11-SNAPSHOT-dist.zip> to org.apache.oodt/cas-filemgr/0.11-SNAPSHOT/cas-filemgr-0.11-SNAPSHOT-dist.zip
Compressed 110.45 MB of artifacts by 60.8% relative to #2015
[JENKINS] Archiving <https://builds.apache.org/job/oodt-trunk/ws/cli/pom.xml> to org.apache.oodt/cas-cli/0.11-SNAPSHOT/cas-cli-0.11-SNAPSHOT.pom
[JENKINS] Archiving <https://builds.apache.org/job/oodt-trunk/ws/cli/target/cas-cli-0.11-SNAPSHOT.jar> to org.apache.oodt/cas-cli/0.11-SNAPSHOT/cas-cli-0.11-SNAPSHOT.jar
[JENKINS] Archiving <https://builds.apache.org/job/oodt-trunk/ws/cli/target/cas-cli-0.11-SNAPSHOT-dist.tar.gz> to org.apache.oodt/cas-cli/0.11-SNAPSHOT/cas-cli-0.11-SNAPSHOT-dist.tar.gz
[JENKINS] Archiving <https://builds.apache.org/job/oodt-trunk/ws/cli/target/cas-cli-0.11-SNAPSHOT-dist.zip> to org.apache.oodt/cas-cli/0.11-SNAPSHOT/cas-cli-0.11-SNAPSHOT-dist.zip
Compressed 13.45 MB of artifacts by 56.2% relative to #2015
[JENKINS] Archiving <https://builds.apache.org/job/oodt-trunk/ws/xmlquery/pom.xml> to org.apache.oodt/oodt-xmlquery/0.11-SNAPSHOT/oodt-xmlquery-0.11-SNAPSHOT.pom
[JENKINS] Archiving <https://builds.apache.org/job/oodt-trunk/ws/xmlquery/target/oodt-xmlquery-0.11-SNAPSHOT.jar> to org.apache.oodt/oodt-xmlquery/0.11-SNAPSHOT/oodt-xmlquery-0.11-SNAPSHOT.jar
[JENKINS] Archiving <https://builds.apache.org/job/oodt-trunk/ws/protocol/imaps/pom.xml> to org.apache.oodt/cas-protocol-imaps/0.11-SNAPSHOT/cas-protocol-imaps-0.11-SNAPSHOT.pom
[JENKINS] Archiving <https://builds.apache.org/job/oodt-trunk/ws/protocol/imaps/target/cas-protocol-imaps-0.11-SNAPSHOT.jar> to org.apache.oodt/cas-protocol-imaps/0.11-SNAPSHOT/cas-protocol-imaps-0.11-SNAPSHOT.jar
[JENKINS] Archiving <https://builds.apache.org/job/oodt-trunk/ws/commons/pom.xml> to org.apache.oodt/oodt-commons/0.11-SNAPSHOT/oodt-commons-0.11-SNAPSHOT.pom
[JENKINS] Archiving <https://builds.apache.org/job/oodt-trunk/ws/commons/target/oodt-commons-0.11-SNAPSHOT.jar> to org.apache.oodt/oodt-commons/0.11-SNAPSHOT/oodt-commons-0.11-SNAPSHOT.jar
Compressed 209.65 KB of artifacts by 61.1% relative to #2015
[JENKINS] Archiving <https://builds.apache.org/job/oodt-trunk/ws/protocol/sftp/pom.xml> to org.apache.oodt/cas-protocol-sftp/0.11-SNAPSHOT/cas-protocol-sftp-0.11-SNAPSHOT.pom
[JENKINS] Archiving <https://builds.apache.org/job/oodt-trunk/ws/protocol/sftp/target/cas-protocol-sftp-0.11-SNAPSHOT.jar> to org.apache.oodt/cas-protocol-sftp/0.11-SNAPSHOT/cas-protocol-sftp-0.11-SNAPSHOT.jar
[JENKINS] Archiving <https://builds.apache.org/job/oodt-trunk/ws/pcs/input/pom.xml> to org.apache.oodt/pcs-input/0.11-SNAPSHOT/pcs-input-0.11-SNAPSHOT.pom
[JENKINS] Archiving <https://builds.apache.org/job/oodt-trunk/ws/pcs/input/target/pcs-input-0.11-SNAPSHOT.jar> to org.apache.oodt/pcs-input/0.11-SNAPSHOT/pcs-input-0.11-SNAPSHOT.jar
[JENKINS] Archiving <https://builds.apache.org/job/oodt-trunk/ws/resource/pom.xml> to org.apache.oodt/cas-resource/0.11-SNAPSHOT/cas-resource-0.11-SNAPSHOT.pom
[JENKINS] Archiving <https://builds.apache.org/job/oodt-trunk/ws/resource/target/cas-resource-0.11-SNAPSHOT.jar> to org.apache.oodt/cas-resource/0.11-SNAPSHOT/cas-resource-0.11-SNAPSHOT.jar
[JENKINS] Archiving <https://builds.apache.org/job/oodt-trunk/ws/resource/target/cas-resource-0.11-SNAPSHOT-dist.tar.gz> to org.apache.oodt/cas-resource/0.11-SNAPSHOT/cas-resource-0.11-SNAPSHOT-dist.tar.gz
[JENKINS] Archiving <https://builds.apache.org/job/oodt-trunk/ws/resource/target/cas-resource-0.11-SNAPSHOT-dist.zip> to org.apache.oodt/cas-resource/0.11-SNAPSHOT/cas-resource-0.11-SNAPSHOT-dist.zip
Compressed 22.24 MB of artifacts by 63.4% relative to #2015
[JENKINS] Archiving <https://builds.apache.org/job/oodt-trunk/ws/catalog/pom.xml> to org.apache.oodt/cas-catalog/0.11-SNAPSHOT/cas-catalog-0.11-SNAPSHOT.pom
[JENKINS] Archiving <https://builds.apache.org/job/oodt-trunk/ws/catalog/target/cas-catalog-0.11-SNAPSHOT.jar> to org.apache.oodt/cas-catalog/0.11-SNAPSHOT/cas-catalog-0.11-SNAPSHOT.jar
[JENKINS] Archiving <https://builds.apache.org/job/oodt-trunk/ws/catalog/target/cas-catalog-0.11-SNAPSHOT-dist.tar.gz> to org.apache.oodt/cas-catalog/0.11-SNAPSHOT/cas-catalog-0.11-SNAPSHOT-dist.tar.gz
[JENKINS] Archiving <https://builds.apache.org/job/oodt-trunk/ws/catalog/target/cas-catalog-0.11-SNAPSHOT-dist.zip> to org.apache.oodt/cas-catalog/0.11-SNAPSHOT/cas-catalog-0.11-SNAPSHOT-dist.zip
Compressed 22.41 MB of artifacts by 55.9% relative to #2015
[JENKINS] Archiving <https://builds.apache.org/job/oodt-trunk/ws/workflow/pom.xml> to org.apache.oodt/cas-workflow/0.11-SNAPSHOT/cas-workflow-0.11-SNAPSHOT.pom
[JENKINS] Archiving <https://builds.apache.org/job/oodt-trunk/ws/workflow/target/cas-workflow-0.11-SNAPSHOT.jar> to org.apache.oodt/cas-workflow/0.11-SNAPSHOT/cas-workflow-0.11-SNAPSHOT.jar
[JENKINS] Archiving <https://builds.apache.org/job/oodt-trunk/ws/workflow/target/cas-workflow-0.11-SNAPSHOT-dist.tar.gz> to org.apache.oodt/cas-workflow/0.11-SNAPSHOT/cas-workflow-0.11-SNAPSHOT-dist.tar.gz
[JENKINS] Archiving <https://builds.apache.org/job/oodt-trunk/ws/workflow/target/cas-workflow-0.11-SNAPSHOT-dist.zip> to org.apache.oodt/cas-workflow/0.11-SNAPSHOT/cas-workflow-0.11-SNAPSHOT-dist.zip
Compressed 25.46 MB of artifacts by 63.2% relative to #2015
Sending e-mails to: dev@oodt.apache.org
channel stopped
Jenkins build is unstable: oodt-trunk #2015
Posted by Apache Jenkins Server <je...@builds.apache.org>.
See <https://builds.apache.org/job/oodt-trunk/2015/changes>