You are viewing a plain text version of this content. The canonical link for it is here.
Posted to dev@lucene.apache.org by Apache Hudson Server <hu...@hudson.zones.apache.org> on 2009/08/24 04:14:38 UTC

Build failed in Hudson: Lucene-trunk #927

See http://hudson.zones.apache.org/hudson/job/Lucene-trunk/927/changes

Changes:

[uschindler] Fix small initialization bug in TermAttributeImpl.copyTo()

[uschindler] Fix small initialization bug in Token.copyTo()

[uschindler] LUCENE-1825: Another one :(

[uschindler] LUCENE-1825: Additional incorrect getAttribute usage

[rmuir] LUCENE-1826: the new tokenizer constructors should not allow deprecated charsets

[uschindler] Cleanup on tearDown to really reset the TokenStream API to the default

[uschindler] Change also the default LuceneTestCase to override runBare() instead of runTest(). This enables tests, to also monitor failures in random during setUp() and tearDown().

[buschmi] LUCENE-1826: Add constructors that take AttributeSource and AttributeFactory to all Tokenizer implementations.

[markrmiller] using entry set is faster than looping on key set when you use map.get(key) in loop

------------------------------------------
[...truncated 3983 lines...]

clover:

compile-core:

jar-core:
      [jar] Building jar: http://hudson.zones.apache.org/hudson/job/Lucene-trunk/ws/trunk/build/contrib/analyzers/common/lucene-analyzers-2.9-SNAPSHOT.jar 

default:

smartcn:
     [echo] Building smartcn...

javacc-uptodate-check:

javacc-notice:

jflex-uptodate-check:

jflex-notice:

common.init:

build-lucene:

build-lucene-tests:

init:

clover.setup:

clover.info:

clover:

compile-core:

jar-core:
      [jar] Building jar: http://hudson.zones.apache.org/hudson/job/Lucene-trunk/ws/trunk/build/contrib/analyzers/smartcn/lucene-smartcn-2.9-SNAPSHOT.jar 

default:

default:

javacc-uptodate-check:

javacc-notice:

jflex-uptodate-check:

jflex-notice:

common.init:

build-lucene:

build-lucene-tests:

init:

clover.setup:

clover.info:

clover:

common.compile-core:

compile-core:

compile:

check-files:

init:

clover.setup:

clover.info:

clover:

compile-core:

common.compile-test:
    [mkdir] Created dir: http://hudson.zones.apache.org/hudson/job/Lucene-trunk/ws/trunk/build/contrib/benchmark/classes/test 
    [javac] Compiling 12 source files to http://hudson.zones.apache.org/hudson/job/Lucene-trunk/ws/trunk/build/contrib/benchmark/classes/test 
    [javac] Note: Some input files use or override a deprecated API.
    [javac] Note: Recompile with -Xlint:deprecation for details.
     [copy] Copying 2 files to http://hudson.zones.apache.org/hudson/job/Lucene-trunk/ws/trunk/build/contrib/benchmark/classes/test 

build-artifacts-and-tests:
     [echo] Building collation...

javacc-uptodate-check:

javacc-notice:

jflex-uptodate-check:

jflex-notice:

common.init:

compile-misc:
     [echo] Building misc...

javacc-uptodate-check:

javacc-notice:

jflex-uptodate-check:

jflex-notice:

common.init:

build-lucene:

build-lucene-tests:

init:

clover.setup:

clover.info:

clover:

compile-core:
    [mkdir] Created dir: http://hudson.zones.apache.org/hudson/job/Lucene-trunk/ws/trunk/build/contrib/misc/classes/java 
    [javac] Compiling 17 source files to http://hudson.zones.apache.org/hudson/job/Lucene-trunk/ws/trunk/build/contrib/misc/classes/java 
    [javac] Note: Some input files use or override a deprecated API.
    [javac] Note: Recompile with -Xlint:deprecation for details.

compile:

init:

clover.setup:

clover.info:

clover:

compile-core:
    [mkdir] Created dir: http://hudson.zones.apache.org/hudson/job/Lucene-trunk/ws/trunk/build/contrib/collation/classes/java 
    [javac] Compiling 4 source files to http://hudson.zones.apache.org/hudson/job/Lucene-trunk/ws/trunk/build/contrib/collation/classes/java 

jar-core:
      [jar] Building jar: http://hudson.zones.apache.org/hudson/job/Lucene-trunk/ws/trunk/build/contrib/collation/lucene-collation-2.9-SNAPSHOT.jar 

jar:

compile-test:
     [echo] Building collation...

javacc-uptodate-check:

javacc-notice:

jflex-uptodate-check:

jflex-notice:

common.init:

compile-misc:
     [echo] Building misc...

javacc-uptodate-check:

javacc-notice:

jflex-uptodate-check:

jflex-notice:

common.init:

build-lucene:

build-lucene-tests:

init:

clover.setup:

clover.info:

clover:

compile-core:

compile:

init:

clover.setup:

clover.info:

clover:

compile-core:

common.compile-test:
    [mkdir] Created dir: http://hudson.zones.apache.org/hudson/job/Lucene-trunk/ws/trunk/build/contrib/collation/classes/test 
    [javac] Compiling 5 source files to http://hudson.zones.apache.org/hudson/job/Lucene-trunk/ws/trunk/build/contrib/collation/classes/test 
    [javac] Note: http://hudson.zones.apache.org/hudson/job/Lucene-trunk/ws/trunk/contrib/collation/src/test/org/apache/lucene/collation/CollationTestBase.java  uses or overrides a deprecated API.
    [javac] Note: Recompile with -Xlint:deprecation for details.

build-artifacts-and-tests:

bdb:
     [echo] Building bdb...

javacc-uptodate-check:

javacc-notice:

jflex-uptodate-check:

jflex-notice:

common.init:

build-lucene:

build-lucene-tests:

contrib-build.init:

get-db-jar:
    [mkdir] Created dir: http://hudson.zones.apache.org/hudson/job/Lucene-trunk/ws/trunk/contrib/db/bdb/lib 
      [get] Getting: http://downloads.osafoundation.org/db/db-4.7.25.jar
      [get] To: http://hudson.zones.apache.org/hudson/job/Lucene-trunk/ws/trunk/contrib/db/bdb/lib/db-4.7.25.jar 
      [get] Error getting http://downloads.osafoundation.org/db/db-4.7.25.jar to http://hudson.zones.apache.org/hudson/job/Lucene-trunk/ws/trunk/contrib/db/bdb/lib/db-4.7.25.jar 

BUILD FAILED
http://hudson.zones.apache.org/hudson/job/Lucene-trunk/ws/trunk/build.xml :639: The following error occurred while executing this line:
http://hudson.zones.apache.org/hudson/job/Lucene-trunk/ws/trunk/build.xml :629: The following error occurred while executing this line:
http://hudson.zones.apache.org/hudson/job/Lucene-trunk/ws/trunk/contrib/db/build.xml :29: The following error occurred while executing this line:
http://hudson.zones.apache.org/hudson/job/Lucene-trunk/ws/trunk/contrib/db/bdb/build.xml :36: java.net.UnknownHostException: downloads.osafoundation.org

Total time: 4 minutes 57 seconds
Publishing Javadoc
Recording test results
Publishing Clover coverage report...


---------------------------------------------------------------------
To unsubscribe, e-mail: java-dev-unsubscribe@lucene.apache.org
For additional commands, e-mail: java-dev-help@lucene.apache.org


Re: Hudson build is back to normal: Lucene-trunk #929

Posted by Simon Willnauer <si...@googlemail.com>.
:)

there we go!

On Wed, Aug 26, 2009 at 11:24 AM, Michael
McCandless<lu...@mikemccandless.com> wrote:
> Yay!
>
> Mike
>
> On Wed, Aug 26, 2009 at 1:24 AM, Apache Hudson
> Server<hu...@hudson.zones.apache.org> wrote:
>> See http://hudson.zones.apache.org/hudson/job/Lucene-trunk/929/changes
>>
>>
>>
>> ---------------------------------------------------------------------
>> To unsubscribe, e-mail: java-dev-unsubscribe@lucene.apache.org
>> For additional commands, e-mail: java-dev-help@lucene.apache.org
>>
>>
>
> ---------------------------------------------------------------------
> To unsubscribe, e-mail: java-dev-unsubscribe@lucene.apache.org
> For additional commands, e-mail: java-dev-help@lucene.apache.org
>
>

---------------------------------------------------------------------
To unsubscribe, e-mail: java-dev-unsubscribe@lucene.apache.org
For additional commands, e-mail: java-dev-help@lucene.apache.org


Re: Hudson build is back to normal: Lucene-trunk #929

Posted by Michael McCandless <lu...@mikemccandless.com>.
Yay!

Mike

On Wed, Aug 26, 2009 at 1:24 AM, Apache Hudson
Server<hu...@hudson.zones.apache.org> wrote:
> See http://hudson.zones.apache.org/hudson/job/Lucene-trunk/929/changes
>
>
>
> ---------------------------------------------------------------------
> To unsubscribe, e-mail: java-dev-unsubscribe@lucene.apache.org
> For additional commands, e-mail: java-dev-help@lucene.apache.org
>
>

---------------------------------------------------------------------
To unsubscribe, e-mail: java-dev-unsubscribe@lucene.apache.org
For additional commands, e-mail: java-dev-help@lucene.apache.org


Hudson build is back to normal: Lucene-trunk #929

Posted by Apache Hudson Server <hu...@hudson.zones.apache.org>.
See http://hudson.zones.apache.org/hudson/job/Lucene-trunk/929/changes



---------------------------------------------------------------------
To unsubscribe, e-mail: java-dev-unsubscribe@lucene.apache.org
For additional commands, e-mail: java-dev-help@lucene.apache.org


Re: Build failed in Hudson: Lucene-trunk #928

Posted by Michael McCandless <lu...@mikemccandless.com>.
Hmm though I'm able to download the JAR directly, through my home ISP.
 Also, fetching it from people.apache.org works fine.  And fetching
via telnet from hudson.zones.apache.org also looks to work fine.
Something strange is going on...

Or perhaps downloads.osafoundation.org was down but is now up.  Let's
see if it fails again on the next build...

Mike

On Tue, Aug 25, 2009 at 5:32 AM, Michael
McCandless<lu...@mikemccandless.com> wrote:
> downloads.osafoundation.org is still down.
>
> Mike
>
> On Mon, Aug 24, 2009 at 10:15 PM, Apache Hudson
> Server<hu...@hudson.zones.apache.org> wrote:
>> See http://hudson.zones.apache.org/hudson/job/Lucene-trunk/928/changes
>>
>> Changes:
>>
>> [uschindler] Sorry for the last commit, this is the better solution. As the offset attribute was normally already added before in the indexing process, the addAttribute is at no cost. And the additional if-clause is prevented (I missed a second one in the previous commit). Now only payloads are conditional to attribute existence.
>>
>> [uschindler] Prevent a NPE, when OffsetAttribute is not available.
>>
>> [gsingers] javadoc addition directing users where to start with this class
>>
>> [markrmiller] this whole bit is somewhat rough - some quick improvements here, but needs more
>>
>> [markrmiller] javadoc fix
>>
>> [uschindler] LUCENE-1843: Update contrib tests to conform to onlyUseNewAPI; refactored assertAnalyzesTo and others into the new BaseTokenStreamTestCase class; Rewrote TestMappingCharFilter to use the new assert functions, too; performance improvements of Token.copyTo(); new impl of SingleTokenTokenStream
>>
>> [markrmiller] LUCENE-1837: Remove Searcher from Weight#explain - partial revert of LUCENE-1771
>>
>> [uschindler] LUCENE-1846: Fix more Locale problems
>>
>> ------------------------------------------
>> [...truncated 3980 lines...]
>>
>> clover:
>>
>> compile-core:
>>
>> jar-core:
>>      [jar] Building jar: http://hudson.zones.apache.org/hudson/job/Lucene-trunk/ws/trunk/build/contrib/analyzers/common/lucene-analyzers-2.9-SNAPSHOT.jar
>>
>> default:
>>
>> smartcn:
>>     [echo] Building smartcn...
>>
>> javacc-uptodate-check:
>>
>> javacc-notice:
>>
>> jflex-uptodate-check:
>>
>> jflex-notice:
>>
>> common.init:
>>
>> build-lucene:
>>
>> build-lucene-tests:
>>
>> init:
>>
>> clover.setup:
>>
>> clover.info:
>>
>> clover:
>>
>> compile-core:
>>
>> jar-core:
>>      [jar] Building jar: http://hudson.zones.apache.org/hudson/job/Lucene-trunk/ws/trunk/build/contrib/analyzers/smartcn/lucene-smartcn-2.9-SNAPSHOT.jar
>>
>> default:
>>
>> default:
>>
>> javacc-uptodate-check:
>>
>> javacc-notice:
>>
>> jflex-uptodate-check:
>>
>> jflex-notice:
>>
>> common.init:
>>
>> build-lucene:
>>
>> build-lucene-tests:
>>
>> init:
>>
>> clover.setup:
>>
>> clover.info:
>>
>> clover:
>>
>> common.compile-core:
>>
>> compile-core:
>>
>> compile:
>>
>> check-files:
>>
>> init:
>>
>> clover.setup:
>>
>> clover.info:
>>
>> clover:
>>
>> compile-core:
>>
>> common.compile-test:
>>    [mkdir] Created dir: http://hudson.zones.apache.org/hudson/job/Lucene-trunk/ws/trunk/build/contrib/benchmark/classes/test
>>    [javac] Compiling 12 source files to http://hudson.zones.apache.org/hudson/job/Lucene-trunk/ws/trunk/build/contrib/benchmark/classes/test
>>    [javac] Note: Some input files use or override a deprecated API.
>>    [javac] Note: Recompile with -Xlint:deprecation for details.
>>     [copy] Copying 2 files to http://hudson.zones.apache.org/hudson/job/Lucene-trunk/ws/trunk/build/contrib/benchmark/classes/test
>>
>> build-artifacts-and-tests:
>>     [echo] Building collation...
>>
>> javacc-uptodate-check:
>>
>> javacc-notice:
>>
>> jflex-uptodate-check:
>>
>> jflex-notice:
>>
>> common.init:
>>
>> compile-misc:
>>     [echo] Building misc...
>>
>> javacc-uptodate-check:
>>
>> javacc-notice:
>>
>> jflex-uptodate-check:
>>
>> jflex-notice:
>>
>> common.init:
>>
>> build-lucene:
>>
>> build-lucene-tests:
>>
>> init:
>>
>> clover.setup:
>>
>> clover.info:
>>
>> clover:
>>
>> compile-core:
>>    [mkdir] Created dir: http://hudson.zones.apache.org/hudson/job/Lucene-trunk/ws/trunk/build/contrib/misc/classes/java
>>    [javac] Compiling 17 source files to http://hudson.zones.apache.org/hudson/job/Lucene-trunk/ws/trunk/build/contrib/misc/classes/java
>>    [javac] Note: Some input files use or override a deprecated API.
>>    [javac] Note: Recompile with -Xlint:deprecation for details.
>>
>> compile:
>>
>> init:
>>
>> clover.setup:
>>
>> clover.info:
>>
>> clover:
>>
>> compile-core:
>>    [mkdir] Created dir: http://hudson.zones.apache.org/hudson/job/Lucene-trunk/ws/trunk/build/contrib/collation/classes/java
>>    [javac] Compiling 4 source files to http://hudson.zones.apache.org/hudson/job/Lucene-trunk/ws/trunk/build/contrib/collation/classes/java
>>
>> jar-core:
>>      [jar] Building jar: http://hudson.zones.apache.org/hudson/job/Lucene-trunk/ws/trunk/build/contrib/collation/lucene-collation-2.9-SNAPSHOT.jar
>>
>> jar:
>>
>> compile-test:
>>     [echo] Building collation...
>>
>> javacc-uptodate-check:
>>
>> javacc-notice:
>>
>> jflex-uptodate-check:
>>
>> jflex-notice:
>>
>> common.init:
>>
>> compile-misc:
>>     [echo] Building misc...
>>
>> javacc-uptodate-check:
>>
>> javacc-notice:
>>
>> jflex-uptodate-check:
>>
>> jflex-notice:
>>
>> common.init:
>>
>> build-lucene:
>>
>> build-lucene-tests:
>>
>> init:
>>
>> clover.setup:
>>
>> clover.info:
>>
>> clover:
>>
>> compile-core:
>>
>> compile:
>>
>> init:
>>
>> clover.setup:
>>
>> clover.info:
>>
>> clover:
>>
>> compile-core:
>>
>> common.compile-test:
>>    [mkdir] Created dir: http://hudson.zones.apache.org/hudson/job/Lucene-trunk/ws/trunk/build/contrib/collation/classes/test
>>    [javac] Compiling 5 source files to http://hudson.zones.apache.org/hudson/job/Lucene-trunk/ws/trunk/build/contrib/collation/classes/test
>>    [javac] Note: http://hudson.zones.apache.org/hudson/job/Lucene-trunk/ws/trunk/contrib/collation/src/test/org/apache/lucene/collation/CollationTestBase.java  uses or overrides a deprecated API.
>>    [javac] Note: Recompile with -Xlint:deprecation for details.
>>
>> build-artifacts-and-tests:
>>
>> bdb:
>>     [echo] Building bdb...
>>
>> javacc-uptodate-check:
>>
>> javacc-notice:
>>
>> jflex-uptodate-check:
>>
>> jflex-notice:
>>
>> common.init:
>>
>> build-lucene:
>>
>> build-lucene-tests:
>>
>> contrib-build.init:
>>
>> get-db-jar:
>>    [mkdir] Created dir: http://hudson.zones.apache.org/hudson/job/Lucene-trunk/ws/trunk/contrib/db/bdb/lib
>>      [get] Getting: http://downloads.osafoundation.org/db/db-4.7.25.jar
>>      [get] To: http://hudson.zones.apache.org/hudson/job/Lucene-trunk/ws/trunk/contrib/db/bdb/lib/db-4.7.25.jar
>>      [get] Error getting http://downloads.osafoundation.org/db/db-4.7.25.jar to http://hudson.zones.apache.org/hudson/job/Lucene-trunk/ws/trunk/contrib/db/bdb/lib/db-4.7.25.jar
>>
>> BUILD FAILED
>> http://hudson.zones.apache.org/hudson/job/Lucene-trunk/ws/trunk/build.xml :639: The following error occurred while executing this line:
>> http://hudson.zones.apache.org/hudson/job/Lucene-trunk/ws/trunk/build.xml :629: The following error occurred while executing this line:
>> http://hudson.zones.apache.org/hudson/job/Lucene-trunk/ws/trunk/contrib/db/build.xml :29: The following error occurred while executing this line:
>> http://hudson.zones.apache.org/hudson/job/Lucene-trunk/ws/trunk/contrib/db/bdb/build.xml :36: java.net.UnknownHostException: downloads.osafoundation.org
>>
>> Total time: 4 minutes 57 seconds
>> Publishing Javadoc
>> Recording test results
>> Publishing Clover coverage report...
>>
>>
>> ---------------------------------------------------------------------
>> To unsubscribe, e-mail: java-dev-unsubscribe@lucene.apache.org
>> For additional commands, e-mail: java-dev-help@lucene.apache.org
>>
>>
>

---------------------------------------------------------------------
To unsubscribe, e-mail: java-dev-unsubscribe@lucene.apache.org
For additional commands, e-mail: java-dev-help@lucene.apache.org


Re: Build failed in Hudson: Lucene-trunk #928

Posted by Michael McCandless <lu...@mikemccandless.com>.
downloads.osafoundation.org is still down.

Mike

On Mon, Aug 24, 2009 at 10:15 PM, Apache Hudson
Server<hu...@hudson.zones.apache.org> wrote:
> See http://hudson.zones.apache.org/hudson/job/Lucene-trunk/928/changes
>
> Changes:
>
> [uschindler] Sorry for the last commit, this is the better solution. As the offset attribute was normally already added before in the indexing process, the addAttribute is at no cost. And the additional if-clause is prevented (I missed a second one in the previous commit). Now only payloads are conditional to attribute existence.
>
> [uschindler] Prevent a NPE, when OffsetAttribute is not available.
>
> [gsingers] javadoc addition directing users where to start with this class
>
> [markrmiller] this whole bit is somewhat rough - some quick improvements here, but needs more
>
> [markrmiller] javadoc fix
>
> [uschindler] LUCENE-1843: Update contrib tests to conform to onlyUseNewAPI; refactored assertAnalyzesTo and others into the new BaseTokenStreamTestCase class; Rewrote TestMappingCharFilter to use the new assert functions, too; performance improvements of Token.copyTo(); new impl of SingleTokenTokenStream
>
> [markrmiller] LUCENE-1837: Remove Searcher from Weight#explain - partial revert of LUCENE-1771
>
> [uschindler] LUCENE-1846: Fix more Locale problems
>
> ------------------------------------------
> [...truncated 3980 lines...]
>
> clover:
>
> compile-core:
>
> jar-core:
>      [jar] Building jar: http://hudson.zones.apache.org/hudson/job/Lucene-trunk/ws/trunk/build/contrib/analyzers/common/lucene-analyzers-2.9-SNAPSHOT.jar
>
> default:
>
> smartcn:
>     [echo] Building smartcn...
>
> javacc-uptodate-check:
>
> javacc-notice:
>
> jflex-uptodate-check:
>
> jflex-notice:
>
> common.init:
>
> build-lucene:
>
> build-lucene-tests:
>
> init:
>
> clover.setup:
>
> clover.info:
>
> clover:
>
> compile-core:
>
> jar-core:
>      [jar] Building jar: http://hudson.zones.apache.org/hudson/job/Lucene-trunk/ws/trunk/build/contrib/analyzers/smartcn/lucene-smartcn-2.9-SNAPSHOT.jar
>
> default:
>
> default:
>
> javacc-uptodate-check:
>
> javacc-notice:
>
> jflex-uptodate-check:
>
> jflex-notice:
>
> common.init:
>
> build-lucene:
>
> build-lucene-tests:
>
> init:
>
> clover.setup:
>
> clover.info:
>
> clover:
>
> common.compile-core:
>
> compile-core:
>
> compile:
>
> check-files:
>
> init:
>
> clover.setup:
>
> clover.info:
>
> clover:
>
> compile-core:
>
> common.compile-test:
>    [mkdir] Created dir: http://hudson.zones.apache.org/hudson/job/Lucene-trunk/ws/trunk/build/contrib/benchmark/classes/test
>    [javac] Compiling 12 source files to http://hudson.zones.apache.org/hudson/job/Lucene-trunk/ws/trunk/build/contrib/benchmark/classes/test
>    [javac] Note: Some input files use or override a deprecated API.
>    [javac] Note: Recompile with -Xlint:deprecation for details.
>     [copy] Copying 2 files to http://hudson.zones.apache.org/hudson/job/Lucene-trunk/ws/trunk/build/contrib/benchmark/classes/test
>
> build-artifacts-and-tests:
>     [echo] Building collation...
>
> javacc-uptodate-check:
>
> javacc-notice:
>
> jflex-uptodate-check:
>
> jflex-notice:
>
> common.init:
>
> compile-misc:
>     [echo] Building misc...
>
> javacc-uptodate-check:
>
> javacc-notice:
>
> jflex-uptodate-check:
>
> jflex-notice:
>
> common.init:
>
> build-lucene:
>
> build-lucene-tests:
>
> init:
>
> clover.setup:
>
> clover.info:
>
> clover:
>
> compile-core:
>    [mkdir] Created dir: http://hudson.zones.apache.org/hudson/job/Lucene-trunk/ws/trunk/build/contrib/misc/classes/java
>    [javac] Compiling 17 source files to http://hudson.zones.apache.org/hudson/job/Lucene-trunk/ws/trunk/build/contrib/misc/classes/java
>    [javac] Note: Some input files use or override a deprecated API.
>    [javac] Note: Recompile with -Xlint:deprecation for details.
>
> compile:
>
> init:
>
> clover.setup:
>
> clover.info:
>
> clover:
>
> compile-core:
>    [mkdir] Created dir: http://hudson.zones.apache.org/hudson/job/Lucene-trunk/ws/trunk/build/contrib/collation/classes/java
>    [javac] Compiling 4 source files to http://hudson.zones.apache.org/hudson/job/Lucene-trunk/ws/trunk/build/contrib/collation/classes/java
>
> jar-core:
>      [jar] Building jar: http://hudson.zones.apache.org/hudson/job/Lucene-trunk/ws/trunk/build/contrib/collation/lucene-collation-2.9-SNAPSHOT.jar
>
> jar:
>
> compile-test:
>     [echo] Building collation...
>
> javacc-uptodate-check:
>
> javacc-notice:
>
> jflex-uptodate-check:
>
> jflex-notice:
>
> common.init:
>
> compile-misc:
>     [echo] Building misc...
>
> javacc-uptodate-check:
>
> javacc-notice:
>
> jflex-uptodate-check:
>
> jflex-notice:
>
> common.init:
>
> build-lucene:
>
> build-lucene-tests:
>
> init:
>
> clover.setup:
>
> clover.info:
>
> clover:
>
> compile-core:
>
> compile:
>
> init:
>
> clover.setup:
>
> clover.info:
>
> clover:
>
> compile-core:
>
> common.compile-test:
>    [mkdir] Created dir: http://hudson.zones.apache.org/hudson/job/Lucene-trunk/ws/trunk/build/contrib/collation/classes/test
>    [javac] Compiling 5 source files to http://hudson.zones.apache.org/hudson/job/Lucene-trunk/ws/trunk/build/contrib/collation/classes/test
>    [javac] Note: http://hudson.zones.apache.org/hudson/job/Lucene-trunk/ws/trunk/contrib/collation/src/test/org/apache/lucene/collation/CollationTestBase.java  uses or overrides a deprecated API.
>    [javac] Note: Recompile with -Xlint:deprecation for details.
>
> build-artifacts-and-tests:
>
> bdb:
>     [echo] Building bdb...
>
> javacc-uptodate-check:
>
> javacc-notice:
>
> jflex-uptodate-check:
>
> jflex-notice:
>
> common.init:
>
> build-lucene:
>
> build-lucene-tests:
>
> contrib-build.init:
>
> get-db-jar:
>    [mkdir] Created dir: http://hudson.zones.apache.org/hudson/job/Lucene-trunk/ws/trunk/contrib/db/bdb/lib
>      [get] Getting: http://downloads.osafoundation.org/db/db-4.7.25.jar
>      [get] To: http://hudson.zones.apache.org/hudson/job/Lucene-trunk/ws/trunk/contrib/db/bdb/lib/db-4.7.25.jar
>      [get] Error getting http://downloads.osafoundation.org/db/db-4.7.25.jar to http://hudson.zones.apache.org/hudson/job/Lucene-trunk/ws/trunk/contrib/db/bdb/lib/db-4.7.25.jar
>
> BUILD FAILED
> http://hudson.zones.apache.org/hudson/job/Lucene-trunk/ws/trunk/build.xml :639: The following error occurred while executing this line:
> http://hudson.zones.apache.org/hudson/job/Lucene-trunk/ws/trunk/build.xml :629: The following error occurred while executing this line:
> http://hudson.zones.apache.org/hudson/job/Lucene-trunk/ws/trunk/contrib/db/build.xml :29: The following error occurred while executing this line:
> http://hudson.zones.apache.org/hudson/job/Lucene-trunk/ws/trunk/contrib/db/bdb/build.xml :36: java.net.UnknownHostException: downloads.osafoundation.org
>
> Total time: 4 minutes 57 seconds
> Publishing Javadoc
> Recording test results
> Publishing Clover coverage report...
>
>
> ---------------------------------------------------------------------
> To unsubscribe, e-mail: java-dev-unsubscribe@lucene.apache.org
> For additional commands, e-mail: java-dev-help@lucene.apache.org
>
>

---------------------------------------------------------------------
To unsubscribe, e-mail: java-dev-unsubscribe@lucene.apache.org
For additional commands, e-mail: java-dev-help@lucene.apache.org


Build failed in Hudson: Lucene-trunk #928

Posted by Apache Hudson Server <hu...@hudson.zones.apache.org>.
See http://hudson.zones.apache.org/hudson/job/Lucene-trunk/928/changes

Changes:

[uschindler] Sorry for the last commit, this is the better solution. As the offset attribute was normally already added before in the indexing process, the addAttribute is at no cost. And the additional if-clause is prevented (I missed a second one in the previous commit). Now only payloads are conditional to attribute existence.

[uschindler] Prevent a NPE, when OffsetAttribute is not available.

[gsingers] javadoc addition directing users where to start with this class

[markrmiller] this whole bit is somewhat rough - some quick improvements here, but needs more

[markrmiller] javadoc fix

[uschindler] LUCENE-1843: Update contrib tests to conform to onlyUseNewAPI; refactored assertAnalyzesTo and others into the new BaseTokenStreamTestCase class; Rewrote TestMappingCharFilter to use the new assert functions, too; performance improvements of Token.copyTo(); new impl of SingleTokenTokenStream

[markrmiller] LUCENE-1837: Remove Searcher from Weight#explain - partial revert of LUCENE-1771

[uschindler] LUCENE-1846: Fix more Locale problems

------------------------------------------
[...truncated 3980 lines...]

clover:

compile-core:

jar-core:
      [jar] Building jar: http://hudson.zones.apache.org/hudson/job/Lucene-trunk/ws/trunk/build/contrib/analyzers/common/lucene-analyzers-2.9-SNAPSHOT.jar 

default:

smartcn:
     [echo] Building smartcn...

javacc-uptodate-check:

javacc-notice:

jflex-uptodate-check:

jflex-notice:

common.init:

build-lucene:

build-lucene-tests:

init:

clover.setup:

clover.info:

clover:

compile-core:

jar-core:
      [jar] Building jar: http://hudson.zones.apache.org/hudson/job/Lucene-trunk/ws/trunk/build/contrib/analyzers/smartcn/lucene-smartcn-2.9-SNAPSHOT.jar 

default:

default:

javacc-uptodate-check:

javacc-notice:

jflex-uptodate-check:

jflex-notice:

common.init:

build-lucene:

build-lucene-tests:

init:

clover.setup:

clover.info:

clover:

common.compile-core:

compile-core:

compile:

check-files:

init:

clover.setup:

clover.info:

clover:

compile-core:

common.compile-test:
    [mkdir] Created dir: http://hudson.zones.apache.org/hudson/job/Lucene-trunk/ws/trunk/build/contrib/benchmark/classes/test 
    [javac] Compiling 12 source files to http://hudson.zones.apache.org/hudson/job/Lucene-trunk/ws/trunk/build/contrib/benchmark/classes/test 
    [javac] Note: Some input files use or override a deprecated API.
    [javac] Note: Recompile with -Xlint:deprecation for details.
     [copy] Copying 2 files to http://hudson.zones.apache.org/hudson/job/Lucene-trunk/ws/trunk/build/contrib/benchmark/classes/test 

build-artifacts-and-tests:
     [echo] Building collation...

javacc-uptodate-check:

javacc-notice:

jflex-uptodate-check:

jflex-notice:

common.init:

compile-misc:
     [echo] Building misc...

javacc-uptodate-check:

javacc-notice:

jflex-uptodate-check:

jflex-notice:

common.init:

build-lucene:

build-lucene-tests:

init:

clover.setup:

clover.info:

clover:

compile-core:
    [mkdir] Created dir: http://hudson.zones.apache.org/hudson/job/Lucene-trunk/ws/trunk/build/contrib/misc/classes/java 
    [javac] Compiling 17 source files to http://hudson.zones.apache.org/hudson/job/Lucene-trunk/ws/trunk/build/contrib/misc/classes/java 
    [javac] Note: Some input files use or override a deprecated API.
    [javac] Note: Recompile with -Xlint:deprecation for details.

compile:

init:

clover.setup:

clover.info:

clover:

compile-core:
    [mkdir] Created dir: http://hudson.zones.apache.org/hudson/job/Lucene-trunk/ws/trunk/build/contrib/collation/classes/java 
    [javac] Compiling 4 source files to http://hudson.zones.apache.org/hudson/job/Lucene-trunk/ws/trunk/build/contrib/collation/classes/java 

jar-core:
      [jar] Building jar: http://hudson.zones.apache.org/hudson/job/Lucene-trunk/ws/trunk/build/contrib/collation/lucene-collation-2.9-SNAPSHOT.jar 

jar:

compile-test:
     [echo] Building collation...

javacc-uptodate-check:

javacc-notice:

jflex-uptodate-check:

jflex-notice:

common.init:

compile-misc:
     [echo] Building misc...

javacc-uptodate-check:

javacc-notice:

jflex-uptodate-check:

jflex-notice:

common.init:

build-lucene:

build-lucene-tests:

init:

clover.setup:

clover.info:

clover:

compile-core:

compile:

init:

clover.setup:

clover.info:

clover:

compile-core:

common.compile-test:
    [mkdir] Created dir: http://hudson.zones.apache.org/hudson/job/Lucene-trunk/ws/trunk/build/contrib/collation/classes/test 
    [javac] Compiling 5 source files to http://hudson.zones.apache.org/hudson/job/Lucene-trunk/ws/trunk/build/contrib/collation/classes/test 
    [javac] Note: http://hudson.zones.apache.org/hudson/job/Lucene-trunk/ws/trunk/contrib/collation/src/test/org/apache/lucene/collation/CollationTestBase.java  uses or overrides a deprecated API.
    [javac] Note: Recompile with -Xlint:deprecation for details.

build-artifacts-and-tests:

bdb:
     [echo] Building bdb...

javacc-uptodate-check:

javacc-notice:

jflex-uptodate-check:

jflex-notice:

common.init:

build-lucene:

build-lucene-tests:

contrib-build.init:

get-db-jar:
    [mkdir] Created dir: http://hudson.zones.apache.org/hudson/job/Lucene-trunk/ws/trunk/contrib/db/bdb/lib 
      [get] Getting: http://downloads.osafoundation.org/db/db-4.7.25.jar
      [get] To: http://hudson.zones.apache.org/hudson/job/Lucene-trunk/ws/trunk/contrib/db/bdb/lib/db-4.7.25.jar 
      [get] Error getting http://downloads.osafoundation.org/db/db-4.7.25.jar to http://hudson.zones.apache.org/hudson/job/Lucene-trunk/ws/trunk/contrib/db/bdb/lib/db-4.7.25.jar 

BUILD FAILED
http://hudson.zones.apache.org/hudson/job/Lucene-trunk/ws/trunk/build.xml :639: The following error occurred while executing this line:
http://hudson.zones.apache.org/hudson/job/Lucene-trunk/ws/trunk/build.xml :629: The following error occurred while executing this line:
http://hudson.zones.apache.org/hudson/job/Lucene-trunk/ws/trunk/contrib/db/build.xml :29: The following error occurred while executing this line:
http://hudson.zones.apache.org/hudson/job/Lucene-trunk/ws/trunk/contrib/db/bdb/build.xml :36: java.net.UnknownHostException: downloads.osafoundation.org

Total time: 4 minutes 57 seconds
Publishing Javadoc
Recording test results
Publishing Clover coverage report...


---------------------------------------------------------------------
To unsubscribe, e-mail: java-dev-unsubscribe@lucene.apache.org
For additional commands, e-mail: java-dev-help@lucene.apache.org


Re: Build failed in Hudson: Lucene-trunk #927

Posted by Michael McCandless <lu...@mikemccandless.com>.
Failed for the same reason as last night's build (contrib/db/bdb is
unable to download its jar from downloads.osafoundation.org)...
LUCENE-1845 is working on a fix to skip these tests if the JAR can't
be downloaded.

Mike

On Sun, Aug 23, 2009 at 10:14 PM, Apache Hudson
Server<hu...@hudson.zones.apache.org> wrote:
> See http://hudson.zones.apache.org/hudson/job/Lucene-trunk/927/changes
>
> Changes:
>
> [uschindler] Fix small initialization bug in TermAttributeImpl.copyTo()
>
> [uschindler] Fix small initialization bug in Token.copyTo()
>
> [uschindler] LUCENE-1825: Another one :(
>
> [uschindler] LUCENE-1825: Additional incorrect getAttribute usage
>
> [rmuir] LUCENE-1826: the new tokenizer constructors should not allow deprecated charsets
>
> [uschindler] Cleanup on tearDown to really reset the TokenStream API to the default
>
> [uschindler] Change also the default LuceneTestCase to override runBare() instead of runTest(). This enables tests, to also monitor failures in random during setUp() and tearDown().
>
> [buschmi] LUCENE-1826: Add constructors that take AttributeSource and AttributeFactory to all Tokenizer implementations.
>
> [markrmiller] using entry set is faster than looping on key set when you use map.get(key) in loop
>
> ------------------------------------------
> [...truncated 3983 lines...]
>
> clover:
>
> compile-core:
>
> jar-core:
>      [jar] Building jar: http://hudson.zones.apache.org/hudson/job/Lucene-trunk/ws/trunk/build/contrib/analyzers/common/lucene-analyzers-2.9-SNAPSHOT.jar
>
> default:
>
> smartcn:
>     [echo] Building smartcn...
>
> javacc-uptodate-check:
>
> javacc-notice:
>
> jflex-uptodate-check:
>
> jflex-notice:
>
> common.init:
>
> build-lucene:
>
> build-lucene-tests:
>
> init:
>
> clover.setup:
>
> clover.info:
>
> clover:
>
> compile-core:
>
> jar-core:
>      [jar] Building jar: http://hudson.zones.apache.org/hudson/job/Lucene-trunk/ws/trunk/build/contrib/analyzers/smartcn/lucene-smartcn-2.9-SNAPSHOT.jar
>
> default:
>
> default:
>
> javacc-uptodate-check:
>
> javacc-notice:
>
> jflex-uptodate-check:
>
> jflex-notice:
>
> common.init:
>
> build-lucene:
>
> build-lucene-tests:
>
> init:
>
> clover.setup:
>
> clover.info:
>
> clover:
>
> common.compile-core:
>
> compile-core:
>
> compile:
>
> check-files:
>
> init:
>
> clover.setup:
>
> clover.info:
>
> clover:
>
> compile-core:
>
> common.compile-test:
>    [mkdir] Created dir: http://hudson.zones.apache.org/hudson/job/Lucene-trunk/ws/trunk/build/contrib/benchmark/classes/test
>    [javac] Compiling 12 source files to http://hudson.zones.apache.org/hudson/job/Lucene-trunk/ws/trunk/build/contrib/benchmark/classes/test
>    [javac] Note: Some input files use or override a deprecated API.
>    [javac] Note: Recompile with -Xlint:deprecation for details.
>     [copy] Copying 2 files to http://hudson.zones.apache.org/hudson/job/Lucene-trunk/ws/trunk/build/contrib/benchmark/classes/test
>
> build-artifacts-and-tests:
>     [echo] Building collation...
>
> javacc-uptodate-check:
>
> javacc-notice:
>
> jflex-uptodate-check:
>
> jflex-notice:
>
> common.init:
>
> compile-misc:
>     [echo] Building misc...
>
> javacc-uptodate-check:
>
> javacc-notice:
>
> jflex-uptodate-check:
>
> jflex-notice:
>
> common.init:
>
> build-lucene:
>
> build-lucene-tests:
>
> init:
>
> clover.setup:
>
> clover.info:
>
> clover:
>
> compile-core:
>    [mkdir] Created dir: http://hudson.zones.apache.org/hudson/job/Lucene-trunk/ws/trunk/build/contrib/misc/classes/java
>    [javac] Compiling 17 source files to http://hudson.zones.apache.org/hudson/job/Lucene-trunk/ws/trunk/build/contrib/misc/classes/java
>    [javac] Note: Some input files use or override a deprecated API.
>    [javac] Note: Recompile with -Xlint:deprecation for details.
>
> compile:
>
> init:
>
> clover.setup:
>
> clover.info:
>
> clover:
>
> compile-core:
>    [mkdir] Created dir: http://hudson.zones.apache.org/hudson/job/Lucene-trunk/ws/trunk/build/contrib/collation/classes/java
>    [javac] Compiling 4 source files to http://hudson.zones.apache.org/hudson/job/Lucene-trunk/ws/trunk/build/contrib/collation/classes/java
>
> jar-core:
>      [jar] Building jar: http://hudson.zones.apache.org/hudson/job/Lucene-trunk/ws/trunk/build/contrib/collation/lucene-collation-2.9-SNAPSHOT.jar
>
> jar:
>
> compile-test:
>     [echo] Building collation...
>
> javacc-uptodate-check:
>
> javacc-notice:
>
> jflex-uptodate-check:
>
> jflex-notice:
>
> common.init:
>
> compile-misc:
>     [echo] Building misc...
>
> javacc-uptodate-check:
>
> javacc-notice:
>
> jflex-uptodate-check:
>
> jflex-notice:
>
> common.init:
>
> build-lucene:
>
> build-lucene-tests:
>
> init:
>
> clover.setup:
>
> clover.info:
>
> clover:
>
> compile-core:
>
> compile:
>
> init:
>
> clover.setup:
>
> clover.info:
>
> clover:
>
> compile-core:
>
> common.compile-test:
>    [mkdir] Created dir: http://hudson.zones.apache.org/hudson/job/Lucene-trunk/ws/trunk/build/contrib/collation/classes/test
>    [javac] Compiling 5 source files to http://hudson.zones.apache.org/hudson/job/Lucene-trunk/ws/trunk/build/contrib/collation/classes/test
>    [javac] Note: http://hudson.zones.apache.org/hudson/job/Lucene-trunk/ws/trunk/contrib/collation/src/test/org/apache/lucene/collation/CollationTestBase.java  uses or overrides a deprecated API.
>    [javac] Note: Recompile with -Xlint:deprecation for details.
>
> build-artifacts-and-tests:
>
> bdb:
>     [echo] Building bdb...
>
> javacc-uptodate-check:
>
> javacc-notice:
>
> jflex-uptodate-check:
>
> jflex-notice:
>
> common.init:
>
> build-lucene:
>
> build-lucene-tests:
>
> contrib-build.init:
>
> get-db-jar:
>    [mkdir] Created dir: http://hudson.zones.apache.org/hudson/job/Lucene-trunk/ws/trunk/contrib/db/bdb/lib
>      [get] Getting: http://downloads.osafoundation.org/db/db-4.7.25.jar
>      [get] To: http://hudson.zones.apache.org/hudson/job/Lucene-trunk/ws/trunk/contrib/db/bdb/lib/db-4.7.25.jar
>      [get] Error getting http://downloads.osafoundation.org/db/db-4.7.25.jar to http://hudson.zones.apache.org/hudson/job/Lucene-trunk/ws/trunk/contrib/db/bdb/lib/db-4.7.25.jar
>
> BUILD FAILED
> http://hudson.zones.apache.org/hudson/job/Lucene-trunk/ws/trunk/build.xml :639: The following error occurred while executing this line:
> http://hudson.zones.apache.org/hudson/job/Lucene-trunk/ws/trunk/build.xml :629: The following error occurred while executing this line:
> http://hudson.zones.apache.org/hudson/job/Lucene-trunk/ws/trunk/contrib/db/build.xml :29: The following error occurred while executing this line:
> http://hudson.zones.apache.org/hudson/job/Lucene-trunk/ws/trunk/contrib/db/bdb/build.xml :36: java.net.UnknownHostException: downloads.osafoundation.org
>
> Total time: 4 minutes 57 seconds
> Publishing Javadoc
> Recording test results
> Publishing Clover coverage report...
>
>
> ---------------------------------------------------------------------
> To unsubscribe, e-mail: java-dev-unsubscribe@lucene.apache.org
> For additional commands, e-mail: java-dev-help@lucene.apache.org
>
>

---------------------------------------------------------------------
To unsubscribe, e-mail: java-dev-unsubscribe@lucene.apache.org
For additional commands, e-mail: java-dev-help@lucene.apache.org